<svg id="visual" viewBox="0 0 540 960" width="540" height="960" xmlns="http://www.w3.org/2000/svg"
    xmlns:xlink="http://www.w3.org/1999/xlink" version="1.1">
    <rect x="0" y="0" width="540" height="960" fill="none"></rect>
    <defs>
        <linearGradient id="grad1_0" x1="0%" y1="100%" x2="100%" y2="0%">
            <stop offset="30%" stop-color="#afafaf" stop-opacity="1"></stop>
            <stop offset="70%" stop-color="#afafaf" stop-opacity="1"></stop>
        </linearGradient>
    </defs>
    <defs>
        <linearGradient id="grad1_1" x1="0%" y1="100%" x2="100%" y2="0%">
            <stop offset="30%" stop-color="#afafaf" stop-opacity="1"></stop>
            <stop offset="70%" stop-color="#d6d6d6" stop-opacity="1"></stop>
        </linearGradient>
    </defs>
    <defs>
        <linearGradient id="grad1_2" x1="0%" y1="100%" x2="100%" y2="0%">
            <stop offset="30%" stop-color="#ffffff" stop-opacity="1"></stop>
            <stop offset="70%" stop-color="#d6d6d6" stop-opacity="1"></stop>
        </linearGradient>
    </defs>
    <defs>
        <linearGradient id="grad2_0" x1="0%" y1="100%" x2="100%" y2="0%">
            <stop offset="30%" stop-color="#afafaf" stop-opacity="1"></stop>
            <stop offset="70%" stop-color="#afafaf" stop-opacity="1"></stop>
        </linearGradient>
    </defs>
    <defs>
        <linearGradient id="grad2_1" x1="0%" y1="100%" x2="100%" y2="0%">
            <stop offset="30%" stop-color="#d6d6d6" stop-opacity="1"></stop>
            <stop offset="70%" stop-color="#afafaf" stop-opacity="1"></stop>
        </linearGradient>
    </defs>
    <defs>
        <linearGradient id="grad2_2" x1="0%" y1="100%" x2="100%" y2="0%">
            <stop offset="30%" stop-color="#d6d6d6" stop-opacity="1"></stop>
            <stop offset="70%" stop-color="#ffffff" stop-opacity="1"></stop>
        </linearGradient>
    </defs>
    <g transform="translate(540, 960)">
        <path
            d="M-486 0C-470.6 -82.9 -455.1 -165.9 -416.6 -240.5C-378 -315.1 -316.3 -381.4 -243 -420.9C-169.7 -460.4 -84.9 -473.2 0 -486L0 0Z"
            fill="#eaeaea" fill-opacity="0.4"></path>
        <path
            d="M-324 0C-313.7 -55.3 -303.4 -110.6 -277.7 -160.3C-252 -210.1 -210.9 -254.2 -162 -280.6C-113.1 -306.9 -56.6 -315.5 0 -324L0 0Z"
            fill="#c2c2c2" fill-opacity="0.4"></path>
        <path
            d="M-162 0C-156.9 -27.6 -151.7 -55.3 -138.9 -80.2C-126 -105 -105.4 -127.1 -81 -140.3C-56.6 -153.5 -28.3 -157.7 0 -162L0 0Z"
            fill="#afafaf" fill-opacity="0.4"></path>
    </g>
    <g transform="translate(0, 0)">
        <path
            d="M486 0C475.4 88.7 464.8 177.3 420.9 243C377 308.7 299.7 351.3 224 388C148.3 424.6 74.1 455.3 0 486L0 0Z"
            fill="#eaeaea" fill-opacity="0.4"></path>
        <path
            d="M324 0C316.9 59.1 309.9 118.2 280.6 162C251.3 205.8 199.8 234.2 149.3 258.7C98.9 283.1 49.4 303.5 0 324L0 0Z"
            fill="#c2c2c2" fill-opacity="0.4"></path>
        <path
            d="M162 0C158.5 29.6 154.9 59.1 140.3 81C125.7 102.9 99.9 117.1 74.7 129.3C49.4 141.5 24.7 151.8 0 162L0 0Z"
            fill="#afafaf" fill-opacity="0.4"></path>
    </g>
</svg>