{
  "$schema": "https://docs.renovatebot.com/renovate-schema.json",
  "extends": [
    "config:recommended"
  ],
  "packageRules": [
    {
      "matchDatasources": ["docker"],
      "matchPackageNames": ["python"],
      "allowedVersions": "3.12"
    }
  ],
  "customManagers": [
    {
      "customType": "regex",
      "fileMatch": [
        "^Containerfile$"
      ],
      "matchStrings": [
        "#\\s*renovate:\\s*datasource=(?<datasource>.*?) depName=(?<depName>.*?)( versioning=(?<versioning>.*?))?\\sENV .*?_(?:VERSION|TAG)=\"(?<currentValue>.*)\"\\s"
      ],
      "versioningTemplate": "{{#if versioning}}{{{versioning}}}{{else}}semver{{/if}}"
    },
    {
      "customType": "regex",
      "fileMatch": [
        "^\\.version$",
        "^scripts/.*\\.sh$"
      ],
      "matchStrings": [
        "#\\s*renovate:\\s*datasource=(?<datasource>.*?) depName=(?<depName>.*?)( versioning=(?<versioning>.*?))?\\s.*?_(?:VERSION|TAG)=\"(?<currentValue>.*)\"\\s"
      ],
      "versioningTemplate": "{{#if versioning}}{{{versioning}}}{{else}}semver{{/if}}"
    },
    {
      "customType": "regex",
      "fileMatch": [
        "^\\.version$",
        "^scripts/.*\\.sh$"
      ],
      "matchStrings": [
        "#\\s*renovate:\\s*chart\\s*repository=(?<registryUrl>.*?)\\s*name=(?<depName>.*?)\\s.*?_(?:VERSION|TAG)=\"(?<currentValue>.*)\"\\s"
      ],
      "datasourceTemplate": "helm"
    }
  ]
}
