Division,WeightClassKg,Place,Name,Team,BodyweightKg,Best3SquatKg,Best3BenchKg,Best3DeadliftKg,TotalKg,Equipment,Event,Sex
Boys,51.71,1,Zohn-Luke McCoy,New Boston,51.26,167.83,97.52,163.29,428.64,Single-ply,SBD,M
Boys,51.71,2,Brandon Nettles,Texarkana Pleasant Grove,51.26,124.74,77.11,115.67,317.51,Single-ply,SBD,M
Boys,51.71,3,Mitchell Roberts,Texarkana Pleasant Grove,48.99,108.86,58.97,117.93,285.76,Single-ply,SBD,M
Boys,51.71,4,Nate Doyle,Ore City,51.26,102.06,52.16,111.13,265.35,Single-ply,SBD,M
Boys,51.71,5,Ryder Brock,Detroit,46.72,99.79,47.63,95.25,242.67,Single-ply,SBD,M
Boys,51.71,6,Trace Lewis,Redwater,49.44,95.25,52.16,90.72,238.14,Single-ply,SBD,M
Boys,51.71,7,Jesse Hancock,Redwater,51.26,79.38,45.36,90.72,215.46,Single-ply,SBD,M
Boys,55.79,1,Brandon Jones,Cumby,55.34,136.08,95.25,140.61,371.95,Single-ply,SBD,M
Boys,55.79,2,Tim Jones,Cumby,55.79,133.81,74.84,133.81,342.46,Single-ply,SBD,M
Boys,55.79,3,Rj Patrick,McLeod,55.34,104.33,83.91,136.08,324.32,Single-ply,SBD,M
Boys,55.79,4,Simon Traylor,McLeod,55.79,115.67,65.77,129.27,310.71,Single-ply,SBD,M
Boys,55.79,5,Cameron Sterling,McLeod,55.34,97.52,65.77,129.27,292.57,Single-ply,SBD,M
Boys,59.87,1,JaMarkus Boyd,Ore City,56.7,170.1,99.79,165.56,435.45,Single-ply,SBD,M
Boys,59.87,2,Kolton Morgan,Queen City,59.87,127.01,77.11,154.22,358.34,Single-ply,SBD,M
Boys,59.87,3,Lane Clark,New Boston,58.51,129.27,77.11,142.88,349.27,Single-ply,SBD,M
Boys,59.87,4,Reece Walker,Cumby,58.97,140.61,70.31,136.08,347,Single-ply,SBD,M
Boys,59.87,5,Colby Ivy,Queen City,58.06,122.47,72.57,142.88,337.93,Single-ply,SBD,M
Boys,59.87,6,Cody Shockley,Queen City,56.7,117.93,58.97,145.15,322.05,Single-ply,SBD,M
Boys,59.87,7,Tj Allen,Ore City,58.06,120.2,74.84,113.4,308.44,Single-ply,SBD,M
Boys,59.87,8,Jackson Monizingo,McLeod,59.42,102.06,68.04,136.08,306.17,Single-ply,SBD,M
Boys,59.87,9,Tristan Brooks,Detroit,58.51,117.93,68.04,115.67,301.64,Single-ply,SBD,M
Boys,59.87,10,Jackson Baker,McLeod,59.87,79.38,56.7,120.2,256.28,Single-ply,SBD,M
Boys,67.13,1,Harold Carter,Texarkana Pleasant Grove,67.13,188.24,113.4,199.58,501.22,Single-ply,SBD,M
Boys,67.13,2,Trevor Cobb,Texarkana Pleasant Grove,65.77,167.83,90.72,165.56,424.11,Single-ply,SBD,M
Boys,67.13,3,Brad Meadows,Redwater,66.22,142.88,102.06,165.56,410.5,Single-ply,SBD,M
Boys,67.13,4,Brady Romans,Cumby,63.5,151.95,99.79,156.49,408.23,Single-ply,SBD,M
Boys,67.13,5,Jacob Martin,Ore City,62.6,167.83,79.38,142.88,390.09,Single-ply,SBD,M
Boys,67.13,6,Jared Miller,Maud,66.68,161.03,90.72,136.08,387.82,Single-ply,SBD,M
Boys,67.13,7,Shawn Wright,McLeod,66.22,124.74,79.38,165.56,369.68,Single-ply,SBD,M
Boys,67.13,8,Travis Bryant,Detroit,63.96,147.42,68.04,151.95,367.41,Single-ply,SBD,M
Boys,67.13,9,Dakota Martin,Ore City,66.22,133.81,63.5,140.61,337.93,Single-ply,SBD,M
Boys,67.13,10,Caleb Collins,Maud,65.77,129.27,68.04,117.93,315.25,Single-ply,SBD,M
Boys,67.13,11,Dylan White,New Boston,66.22,131.54,70.31,113.4,315.25,Single-ply,SBD,M
Boys,67.13,12,Luke Yates,McLeod,67.13,81.65,70.31,124.74,276.69,Single-ply,SBD,M
Boys,74.84,1,Robbie Eitel,Redwater,73.94,226.8,140.61,215.46,582.87,Single-ply,SBD,M
Boys,74.84,2,Trey Jackson,New Boston,73.48,219.99,111.13,206.38,537.51,Single-ply,SBD,M
Boys,74.84,3,Stone Leach,Ore City,73.48,190.51,120.2,201.85,512.56,Single-ply,SBD,M
Boys,74.84,4,Thomas Craver,Ore City,74.84,179.17,95.25,195.04,469.47,Single-ply,SBD,M
Boys,74.84,5,Cole Pearson,Texarkana Pleasant Grove,73.03,151.95,79.38,181.44,412.77,Single-ply,SBD,M
Boys,74.84,6,Josh Reeves,Ore City,73.94,136.08,86.18,185.97,408.23,Single-ply,SBD,M
Boys,74.84,7,Clay Hathcoat,Ore City,68.49,145.15,81.65,163.29,390.09,Single-ply,SBD,M
Boys,74.84,8,Billy Loy,Queen City,72.57,122.47,81.65,167.83,371.95,Single-ply,SBD,M
Boys,74.84,9,Tanner Martin,Queen City,69.4,129.27,74.84,140.61,344.73,Single-ply,SBD,M
Boys,74.84,10,Michael Tharp,Detroit,68.95,129.27,72.57,133.81,335.66,Single-ply,SBD,M
Boys,74.84,11,Ryan Hindsman,McLeod,73.48,108.86,79.38,133.81,322.05,Single-ply,SBD,M
Boys,74.84,DQ,Dalton McMillan,New Boston,73.03,131.54,,,,Single-ply,SBD,M
Boys,82.1,1,Trent Tucker,Texarkana Liberty-Eylau,77.11,213.19,138.35,204.12,555.65,Single-ply,SBD,M
Boys,82.1,2,Ty Jones,New Boston,82.1,215.46,127.01,204.12,546.58,Single-ply,SBD,M
Boys,82.1,3,Allen Phillips,Ore City,76.66,183.7,102.06,226.8,512.56,Single-ply,SBD,M
Boys,82.1,4,Collin Gholsten,New Boston,78.47,172.37,97.52,161.03,430.91,Single-ply,SBD,M
Boys,82.1,5,Blake Westbrook,Detroit,76.2,158.76,92.99,174.63,426.38,Single-ply,SBD,M
Boys,82.1,6,Jon Wilhelm,McLeod,78.93,136.08,106.59,183.7,426.38,Single-ply,SBD,M
Boys,82.1,7,Dan Davis,Queen City,81.19,136.08,99.79,172.37,408.23,Single-ply,SBD,M
Boys,82.1,8,Shadeaux Wynn,McLeod,77.56,117.93,81.65,151.95,351.53,Single-ply,SBD,M
Boys,82.1,DQ,Levi Wooten,Cumby,80.74,181.44,,,,Single-ply,SBD,M
Boys,89.81,1,Josh Trumble,Redwater,84.82,240.4,149.69,226.8,616.89,Single-ply,SBD,M
Boys,89.81,2,Lee Cecil,Redwater,89.36,226.8,145.15,226.8,598.74,Single-ply,SBD,M
Boys,89.81,3,Damien Haskins,New Boston,87.09,226.8,115.67,238.14,580.6,Single-ply,SBD,M
Boys,89.81,4,Tyler Wellborn,Texarkana Pleasant Grove,88.45,201.85,124.74,215.46,542.04,Single-ply,SBD,M
Boys,89.81,5,Taylor Lollis,Texarkana Liberty-Eylau,84.82,199.58,124.74,181.44,505.76,Single-ply,SBD,M
Boys,89.81,6,Adam Owens,Texarkana Pleasant Grove,84.82,181.44,106.59,190.51,478.54,Single-ply,SBD,M
Boys,89.81,7,Braven Smith,Redwater,83.46,151.95,86.18,151.95,390.09,Single-ply,SBD,M
Boys,99.79,1,Quan Bell,Clarksville,97.07,204.12,149.69,226.8,580.6,Single-ply,SBD,M
Boys,99.79,2,Lorenzo Calvillo,Clarksville,97.07,204.12,145.15,217.72,566.99,Single-ply,SBD,M
Boys,99.79,3,Tyler Boyd,Maud,91.63,219.99,129.27,204.12,553.38,Single-ply,SBD,M
Boys,99.79,4,Jacobie Briscoe,Redwater,96.62,217.72,111.13,190.51,519.36,Single-ply,SBD,M
Boys,99.79,5,Clifford Dial,Ore City,94.35,213.19,108.86,188.24,510.29,Single-ply,SBD,M
Boys,99.79,6,Neco Smith,Texarkana Pleasant Grove,95.25,181.44,113.4,176.9,471.74,Single-ply,SBD,M
Boys,99.79,7,Jermaine Emmers,Clarksville,99.79,181.44,106.59,181.44,469.47,Single-ply,SBD,M
Boys,99.79,8,Trevor Zaunbracher,New Boston,96.62,163.29,86.18,163.29,412.77,Single-ply,SBD,M
Boys,99.79,9,Geremy Williams,Clarksville,97.52,158.76,99.79,154.22,412.77,Single-ply,SBD,M
Boys,99.79,10,Joseph Martin,Cumby,96.16,136.08,79.38,161.03,376.48,Single-ply,SBD,M
Boys,99.79,DQ,Dj Lackey,Cumby,97.07,172.37,,,,Single-ply,SBD,M
Boys,109.77,1,Jesse Roberson,Redwater,109.32,317.51,204.12,272.16,793.79,Single-ply,SBD,M
Boys,109.77,2,Dewey Fleming,Redwater,102.51,265.35,172.37,226.8,664.51,Single-ply,SBD,M
Boys,109.77,3,Reggie Scales,New Boston,102.06,260.82,140.61,233.6,635.03,Single-ply,SBD,M
Boys,109.77,4,Anthony Ringenberg,Cumby,100.7,226.8,124.74,181.44,532.97,Single-ply,SBD,M
Boys,109.77,5,Dalton Vann,New Boston,109.77,197.31,102.06,204.12,503.49,Single-ply,SBD,M
Boys,109.77,6,John Smith,McLeod,109.77,151.95,117.93,181.44,451.32,Single-ply,SBD,M
Boys,109.77,7,Alexander Andrice,Cumby,100.24,158.76,113.4,176.9,449.06,Single-ply,SBD,M
Boys,109.77,8,Tk Cambell,Ore City,102.06,176.9,86.18,174.63,437.72,Single-ply,SBD,M
Boys,109.77,9,Glen Goode,Cumby,106.14,161.03,102.06,161.03,424.11,Single-ply,SBD,M
Boys,124.74,1,Chance Edwards,Redwater,113.4,276.69,176.9,235.87,689.46,Single-ply,SBD,M
Boys,124.74,2,Brandon Contoleon,New Boston,123.83,226.8,127.01,195.04,548.85,Single-ply,SBD,M
Boys,124.74,3,Blake Jordan,Texarkana Pleasant Grove,117.48,183.7,127.01,190.51,501.22,Single-ply,SBD,M
Boys,124.74,4,Tanner Inman,New Boston,120.66,170.1,129.27,158.76,458.13,Single-ply,SBD,M
Boys,124.74,5,Haden Sanders,Maud,117.93,176.9,108.86,170.1,455.86,Single-ply,SBD,M
Boys,124.74,6,Jordan LaBrie,Texarkana Pleasant Grove,112.94,181.44,111.13,158.76,451.32,Single-ply,SBD,M
Boys,124.74+,1,Clinton Ford,Redwater,144.7,249.48,165.56,238.14,653.17,Single-ply,SBD,M
Boys,124.74+,2,Shakeem Woodberry,Clarksville,126.1,240.4,154.22,210.92,605.55,Single-ply,SBD,M
