Division,WeightClassKg,Place,Name,Team,BodyweightKg,Best3SquatKg,Best3BenchKg,Best3DeadliftKg,TotalKg,Equipment,Event,Sex
Boys,51.71,1,Fernando Valdez,Needville,50.89,90.72,61.23,124.74,276.69,Single-ply,SBD,M
Boys,51.71,2,Mathew Rice,Conroe Oak Ridge,50.8,90.72,58.97,104.33,254.01,Single-ply,SBD,M
Boys,51.71,3,Mason Rice,West Columbia,47.9,102.06,43.09,,145.15,Single-ply,SB,M
Boys,51.71,DQ,Dylan Elkins,Needville,51.71,,,,,Single-ply,SB,M
Boys,51.71,DQ,Will Foland,Manvel,51.71,,,,,Single-ply,SB,M
Boys,55.79,1,Chris Player,Manvel,55.79,136.08,90.72,149.69,376.48,Single-ply,SBD,M
Boys,59.87,2,Jacob Ryder,Needville,55.88,120.2,81.65,147.42,349.27,Single-ply,SBD,M
Boys,55.79,3,Bryant Roman,Alvin,52.62,108.86,81.65,140.61,331.12,Single-ply,SBD,M
Boys,55.79,4,Mike Angeletti,Conroe Oak Ridge,55.34,104.33,70.31,129.27,303.91,Single-ply,SBD,M
Boys,59.87,5,Arron Solis,West Columbia,55.97,72.57,63.5,111.13,247.21,Single-ply,SBD,M
Boys,55.79,DQ,Franciso Pineda,Houston Milby,54.7,,,,,Single-ply,SBD,M
Boys,59.87,1,DeMarco Corner,Manvel,59.87,163.29,90.72,181.44,435.45,Single-ply,SBD,M
Boys,59.87,2,Tyler Marcel,Conroe Oak Ridge,59.06,142.88,95.25,174.63,412.77,Single-ply,SBD,M
Boys,67.13,3,Leo Gonzalez,Alvin,60.06,133.81,95.25,181.44,410.5,Single-ply,SBD,M
Boys,59.87,4,Jason Simmons,Conroe Oak Ridge,58.79,136.08,102.06,165.56,403.7,Single-ply,SBD,M
Boys,59.87,5,Isaac Cervantes,Needville,58.15,127.01,74.84,161.03,362.87,Single-ply,SBD,M
Boys,59.87,6,Greg Gomez,West Columbia,57.7,136.08,86.18,136.08,358.34,Single-ply,SBD,M
Boys,59.87,7,Chance Luxton,West Columbia,58.33,102.06,70.31,122.47,294.84,Single-ply,SBD,M
Boys,59.87,8,Nathan Tellez,Houston Milby,58.51,97.52,61.23,106.59,265.35,Single-ply,SBD,M
Boys,59.87,9,Kyle Jones,Needville,57.42,90.72,70.31,99.79,260.82,Single-ply,SBD,M
Boys,59.87,10,Luigi Ramirez,Houston Milby,56.79,102.06,70.31,,172.37,Single-ply,SB,M
Boys,59.87,DQ,Leonardo Gonzalez,Alvin,59.87,,,,,Single-ply,SB,M
Boys,67.13,1,Martin Banda,Manvel,67.13,197.31,106.59,188.24,492.15,Single-ply,SBD,M
Boys,67.13,2,Tanner Kuhl,Conroe Oak Ridge,61.51,131.54,90.72,142.88,365.14,Single-ply,SBD,M
Boys,67.13,3,Sergio Olvera,Needville,61.78,129.27,88.45,147.42,365.14,Single-ply,SBD,M
Boys,67.13,4,Matt Durham,West Columbia,62.23,129.27,63.5,124.74,317.51,Single-ply,SBD,M
Boys,67.13,DQ,Devin Noiseux,Needville,67.13,,,,,Single-ply,SBD,M
Boys,74.84,1,Jesse Trevino,Houston Milby,67.95,195.04,106.59,204.12,505.76,Single-ply,SBD,M
Boys,74.84,2,Justin Hussey,West Columbia,70.31,204.12,111.13,181.44,496.68,Single-ply,SBD,M
Boys,74.84,3,Travion Brown,Conroe Oak Ridge,69.4,158.76,79.38,170.1,408.23,Single-ply,SBD,M
Boys,82.1,4,Andres Chapa,Conroe Oak Ridge,75.02,142.88,99.79,163.29,405.97,Single-ply,SBD,M
Boys,74.84,5,Cristo Sanchez,Houston Milby,72.21,120.2,74.84,149.69,344.73,Single-ply,SBD,M
Boys,74.84,6,Josh Matinez,Alvin,70.85,99.79,74.84,117.93,292.57,Single-ply,SBD,M
Boys,74.84,DQ,Branson Haberkorn,Alvin,74.84,,,,,Single-ply,SBD,M
Boys,74.84,DQ,Elisio Hercules,Houston Westbury,74.84,,,,,Single-ply,SBD,M
Boys,74.84,DQ,Aj Jackson,Houston Westbury,74.84,,,,,Single-ply,SBD,M
Boys,82.1,1,Brandon Pitre,Manvel,76.66,208.65,138.35,197.31,544.31,Single-ply,SBD,M
Boys,82.1,2,Darius Thornton,Houston Westbury,79.02,206.38,136.08,201.85,544.31,Single-ply,SBD,M
Boys,82.1,3,Mike Handy,Conroe Oak Ridge,79.92,190.51,115.67,210.92,517.1,Single-ply,SBD,M
Boys,82.1,4,Russell Taylor,Needville,82.1,181.44,120.2,181.44,483.08,Single-ply,SBD,M
Boys,82.1,5,Jovito Mendez,Needville,81.01,176.9,113.4,185.97,476.27,Single-ply,SBD,M
Boys,82.1,6,Kolby Kitterman,Conroe Oak Ridge,81.74,174.63,108.86,183.7,467.2,Single-ply,SBD,M
Boys,82.1,7,Kyle Adams,Conroe Oak Ridge,79.83,165.56,113.4,185.97,464.93,Single-ply,SBD,M
Boys,89.81,8,Carlos García,Alvin,82.28,170.1,102.06,181.44,453.59,Single-ply,SBD,M
Boys,82.1,9,Jonathan Voltaire,Conroe Oak Ridge,78.56,149.69,95.25,192.78,437.72,Single-ply,SBD,M
Boys,82.1,10,Eugene Sims,West Columbia,79.38,136.08,92.99,181.44,410.5,Single-ply,SBD,M
Boys,89.81,11,Carlos Zanzen,Needville,82.19,158.76,92.99,158.76,410.5,Single-ply,SBD,M
Boys,82.1,12,Jamarcus Durst,Conroe Oak Ridge,75.57,136.08,97.52,170.1,403.7,Single-ply,SBD,M
Boys,89.81,13,Chris Hobbs,West Columbia,82.19,142.88,102.06,158.76,403.7,Single-ply,SBD,M
Boys,82.1,DQ,Xazier Murry,Manvel,82.1,,,,,Single-ply,SBD,M
Boys,89.81,1,George Stephanson,Conroe Oak Ridge,88.81,231.33,117.93,226.8,576.06,Single-ply,SBD,M
Boys,89.81,2,Kieth Collins,Alvin,89.81,213.19,136.08,213.19,562.45,Single-ply,SBD,M
Boys,89.81,3,Luis Escobedo,Needville,87,199.58,124.74,181.44,505.76,Single-ply,SBD,M
Boys,89.81,4,Johny Peters,Houston Westbury,83.73,181.44,122.47,183.7,487.61,Single-ply,SBD,M
Boys,89.81,5,Terrance Giles,Alvin,86.73,165.56,113.4,179.17,458.13,Single-ply,SBD,M
Boys,89.81,6,Trevon Asbury,Houston Westbury,84.73,156.49,106.59,165.56,428.64,Single-ply,SBD,M
Boys,99.79,1,Kyle Dunk,Needville,94.71,149.69,108.86,163.29,421.84,Single-ply,SBD,M
Boys,99.79,2,Christian Jackson,Conroe Oak Ridge,96.34,154.22,90.72,151.95,396.89,Single-ply,SBD,M
Boys,99.79,DQ,Johnatan Rosalas,Houston Milby,99.79,,,,,Single-ply,SBD,M
Boys,99.79,DQ,Nick Goza,Needville,98.61,172.37,111.13,,,Single-ply,SBD,M
Boys,99.79,DQ,Naren Medrano,Manvel,99.79,204.12,129.27,,,Single-ply,SBD,M
Boys,99.79,DQ,Wesley Laster,Manvel,99.79,,,,,Single-ply,SBD,M
Boys,109.77,1,Cody Gonzalez,Manvel,107.5,263.08,117.93,242.67,623.69,Single-ply,SBD,M
Boys,109.77,2,Chris Shepherd,Alvin,107.68,247.21,136.08,231.33,614.62,Single-ply,SBD,M
Boys,109.77,3,Devar Brown,Houston Westbury,102.69,199.58,122.47,254.01,576.06,Single-ply,SBD,M
Boys,109.77,4,Justin Latonero,Conroe Oak Ridge,102.24,215.46,136.08,219.99,571.53,Single-ply,SBD,M
Boys,109.77,5,Terell Wiltz,Houston Westbury,106.32,158.76,120.2,217.72,496.68,Single-ply,SBD,M
Boys,109.77,6,Nester Gonzalez,Houston Milby,105.6,170.1,120.2,197.31,487.61,Single-ply,SBD,M
Boys,109.77,DQ,Simon Curiel,Manvel,109.77,,,,,Single-ply,SBD,M
Boys,124.74,DQ,Sergio Arrendondo,Manvel,109.86,201.85,111.13,,,Single-ply,SBD,M
Boys,124.74,1,Hayden Hasenbein,Conroe Oak Ridge,120.2,249.48,147.42,222.26,619.15,Single-ply,SBD,M
Boys,124.74,2,James Marin,Alvin,115.03,229.06,156.49,222.26,607.81,Single-ply,SBD,M
Boys,124.74,3,Oshuan Lewis-Phillips,Houston Westbury,110.95,201.85,120.2,204.12,526.17,Single-ply,SBD,M
Boys,124.74,4,Marlon Jackson,Houston Westbury,113.94,195.04,106.59,222.26,523.9,Single-ply,SBD,M
Boys,124.74,5,Cory Klinger,Manvel,121.56,170.1,111.13,197.31,478.54,Single-ply,SBD,M
Boys,124.74,6,Michael Yonts,West Columbia,120.29,165.56,113.4,151.95,430.91,Single-ply,SBD,M
Boys,124.74,7,Jordan Stapleton,Alvin,124.74,99.79,74.84,136.08,310.71,Single-ply,SBD,M
Boys,124.74,8,Taylor Romero,Manvel,124.74,127.01,,,127.01,Single-ply,S,M
Boys,124.74,DQ,Dewan Edmonson,Manvel,124.74,,,,,Single-ply,S,M
Boys,124.74+,1,Deon Thorton,Houston Westbury,126.73,224.53,138.35,233.6,596.47,Single-ply,SBD,M
Boys,124.74+,2,Kyle Tamase,Manvel,127.55,226.8,113.4,226.8,566.99,Single-ply,SBD,M
Boys,124.74+,3,Kevin Arcizo,Houston Milby,126.1,183.7,102.06,181.44,467.2,Single-ply,SBD,M
Boys,124.74+,DQ,Eric Hernandez,Manvel,126.1,,,,,Single-ply,SBD,M
Boys,124.74+,DQ,Billy Soto,Houston Westbury,125.19,,,,,Single-ply,SBD,M
