Division,WeightClassKg,Place,Name,Team,BodyweightKg,Best3SquatKg,Best3BenchKg,Best3DeadliftKg,TotalKg,Equipment,Event,Sex
Boys,51.71,1,Randy Salinas,Bangs,51.44,133.81,72.57,158.76,365.14,Single-ply,SBD,M
Boys,51.71,2,Jason Ayers,Lampasas,51.17,129.27,63.5,145.15,337.93,Single-ply,SBD,M
Boys,55.79,3,Luke Argo,Lampasas,51.8,124.74,54.43,127.01,306.17,Single-ply,SBD,M
Boys,51.71,4,Dalton Dewveall,Llano,48.99,104.33,56.7,117.93,278.96,Single-ply,SBD,M
Boys,51.71,5,Payton Johnson,San Saba,46.49,90.72,43.09,90.72,224.53,Single-ply,SBD,M
Boys,51.71,6,Wyatt Ivey,Lometa,50.44,77.11,47.63,99.79,224.53,Single-ply,SBD,M
Boys,51.71,DQ,C Goodgoin,Brownwood,51.26,86.18,,,,Single-ply,SBD,M
Boys,55.79,1,Nimo Vega,San Saba,55.75,124.74,74.84,163.29,362.87,Single-ply,SBD,M
Boys,59.87,2,Chris Ramirez,Lampasas,55.97,136.08,74.84,151.95,362.87,Single-ply,SBD,M
Boys,55.79,3,Nike Garcia,Early,55.25,124.74,65.77,131.54,322.05,Single-ply,SBD,M
Boys,55.79,4,Isidro Bahena,Dublin,55.7,97.52,61.23,129.27,288.03,Single-ply,SBD,M
Boys,55.79,5,Derrick McBee,Brady,53.71,106.59,47.63,127.01,281.23,Single-ply,SBD,M
Boys,55.79,6,Marcus Griffith,Lometa,55.61,88.45,54.43,108.86,251.74,Single-ply,SBD,M
Boys,55.79,7,Adrian Flores,Coleman,52.25,83.91,65.77,97.52,247.21,Single-ply,SBD,M
Boys,55.79,DQ,Kenny Craig,Hamilton,55.79,90.72,,,,Single-ply,SBD,M
Boys,59.87,1,Ricardo Pina,Comanche,59.51,167.83,106.59,197.31,471.74,Single-ply,SBD,M
Boys,59.87,2,Lucas Diaz,Santa Anna,59.42,142.88,74.84,158.76,376.48,Single-ply,SBD,M
Boys,59.87,3,Dorian Jimenez,Brady,59.06,142.88,72.57,156.49,371.95,Single-ply,SBD,M
Boys,59.87,4,Dominic Garcia,Burnet,59.24,133.81,81.65,156.49,371.95,Single-ply,SBD,M
Boys,67.13,5,Justus Alaniz,Lometa,59.96,131.54,72.57,142.88,347,Single-ply,SBD,M
Boys,59.87,6,Quentin Winborn,Early,56.61,142.88,68.04,124.74,335.66,Single-ply,SBD,M
Boys,59.87,7,Preston Garcia,Early,56.61,120.2,72.57,124.74,317.51,Single-ply,SBD,M
Boys,59.87,DQ,Matt Anderson,Coleman,58.97,,,,,Single-ply,SBD,M
Boys,59.87,DQ,Jonathan Taylor,Stephenville,58.69,127.01,72.57,,,Single-ply,SBD,M
Boys,67.13,DQ,Justin Little,Strawn,59.96,117.93,74.84,,,Single-ply,SBD,M
Boys,67.13,1,Corey Crowell,Bangs,66.59,167.83,106.59,181.44,455.86,Single-ply,SBD,M
Boys,74.84,2,Cosme Diaz,San Saba,67.31,161.03,88.45,181.44,430.91,Single-ply,SBD,M
Boys,67.13,3,Justin Medrano,Brady,66.77,138.35,113.4,172.37,424.11,Single-ply,SBD,M
Boys,67.13,4,Trevor Penny,Llano,63.68,151.95,79.38,163.29,394.63,Single-ply,SBD,M
Boys,67.13,5,Will Smith,Lampasas,67.13,149.69,81.65,163.29,394.63,Single-ply,SBD,M
Boys,67.13,6,Mark DeLeon,Brady,60.42,124.74,86.18,142.88,353.8,Single-ply,SBD,M
Boys,67.13,7,Brian Denison,Hamilton,65.32,113.4,79.38,147.42,340.19,Single-ply,SBD,M
Boys,67.13,8,Brady Jones,Coleman,66.68,111.13,70.31,122.47,303.91,Single-ply,SBD,M
Boys,67.13,DQ,Jacob Vasquez,Marble Falls,61.69,90.72,,,,Single-ply,SBD,M
Boys,67.13,DQ,Daniel Comacho,Marble Falls,62.51,120.2,,,,Single-ply,SBD,M
Boys,67.13,DQ,Anthony Garcia,Strawn,62.14,136.08,74.84,,,Single-ply,SBD,M
Boys,74.84,1,Jake Gravell,Bangs,74.57,204.12,124.74,199.58,528.44,Single-ply,SBD,M
Boys,74.84,2,Jose Lopez,Gustine,74.66,179.17,117.93,190.51,487.61,Single-ply,SBD,M
Boys,74.84,3,Joel Comacho,Marble Falls,70.4,181.44,104.33,190.51,476.27,Single-ply,SBD,M
Boys,74.84,4,Avery Gary,Lampasas,71.58,183.7,108.86,181.44,474,Single-ply,SBD,M
Boys,74.84,5,Fidel Perez,Dublin,73.75,181.44,108.86,158.76,449.06,Single-ply,SBD,M
Boys,74.84,6,Travis Dilworth,Marble Falls,70.4,147.42,97.52,167.83,412.77,Single-ply,SBD,M
Boys,74.84,7,Logan Mendoz,Santa Anna,74.39,158.76,86.18,158.76,403.7,Single-ply,SBD,M
Boys,74.84,8,Christian Rodriquez,Llano,68.22,158.76,97.52,136.08,392.36,Single-ply,SBD,M
Boys,74.84,9,Gary Flores,Brady,70.85,151.95,81.65,158.76,392.36,Single-ply,SBD,M
Boys,74.84,10,Charlie Tongate,Early,71.85,142.88,61.23,183.7,387.82,Single-ply,SBD,M
Boys,74.84,11,G. Doyle,Brownwood,74.75,127.01,83.91,129.27,340.19,Single-ply,SBD,M
Boys,74.84,12,Jose Zuniga,Comanche,70.31,115.67,88.45,133.81,337.93,Single-ply,SBD,M
Boys,74.84,13,Armando Aguilar,Gustine,71.53,113.4,83.91,120.2,317.51,Single-ply,SBD,M
Boys,74.84,14,Trent Cofersi,Bangs,73.57,106.59,74.84,122.47,303.91,Single-ply,SBD,M
Boys,74.84,15,Jacob Cortez,Coleman,71.49,99.79,65.77,111.13,276.69,Single-ply,SBD,M
Boys,74.84,DQ,Brandon McPherson,Coleman,73.03,102.06,,,,Single-ply,SBD,M
Boys,74.84,DQ,Travis Hickman,Comanche,74.75,181.44,,,,Single-ply,SBD,M
Boys,74.84,DQ,Jesse Luker,Comanche,69.49,172.37,95.25,,,Single-ply,SBD,M
Boys,74.84,DQ,Sam Cannon,Stephenville,74.21,117.93,54.43,,,Single-ply,SBD,M
Boys,74.84,DQ,Reed Lane,Stephenville,71.67,136.08,90.72,,,Single-ply,SBD,M
Boys,74.84,DQ,Landon Reeves,Stephenville,68.86,124.74,79.38,,,Single-ply,SBD,M
Boys,82.1,1,Saul Lopez,Comanche,82.1,222.26,127.01,213.19,562.45,Single-ply,SBD,M
Boys,82.1,2,Salvador Marquez,Comanche,80.47,210.92,122.47,217.72,551.11,Single-ply,SBD,M
Boys,89.81,3,Cody Jandreau,Lampasas,82.28,204.12,149.69,195.04,548.85,Single-ply,SBD,M
Boys,82.1,4,Kevin Reed,Marble Falls,77.47,190.51,127.01,199.58,517.1,Single-ply,SBD,M
Boys,89.81,5,Dylan Rosales,San Saba,82.24,176.9,108.86,206.38,492.15,Single-ply,SBD,M
Boys,82.1,6,Cody Morrison,Early,80.38,199.58,77.11,204.12,480.81,Single-ply,SBD,M
Boys,82.1,7,Daulton Allen,Coleman,80.2,183.7,102.06,192.78,478.54,Single-ply,SBD,M
Boys,82.1,8,Steven Jazdyk,Lampasas,81.92,167.83,99.79,206.38,474,Single-ply,SBD,M
Boys,89.81,9,Ismael Ramierez,San Saba,82.24,158.76,106.59,192.78,458.13,Single-ply,SBD,M
Boys,82.1,10,Hunter Wilkinson,Lampasas,78.56,165.56,102.06,188.24,455.86,Single-ply,SBD,M
Boys,82.1,11,Jesse Uvalle,Lampasas,80.38,161.03,102.06,170.1,433.18,Single-ply,SBD,M
Boys,82.1,12,Isreal Torres,Brady,79.02,158.76,99.79,158.76,417.3,Single-ply,SBD,M
Boys,82.1,13,M. Gibson,Brownwood,78.2,147.42,92.99,165.56,405.97,Single-ply,SBD,M
Boys,82.1,14,Michael Foix,Comanche,81.65,154.22,83.91,147.42,385.55,Single-ply,SBD,M
Boys,82.1,15,J Nash,Brownwood,77.29,149.69,83.91,136.08,369.68,Single-ply,SBD,M
Boys,82.1,16,Martin Herrera,Comanche,78.74,102.06,81.65,149.69,333.39,Single-ply,SBD,M
Boys,82.1,17,Skylor Postgate,Marble Falls,81.1,104.33,81.65,131.54,317.51,Single-ply,SBD,M
Boys,89.81,18,Collin Mayne,Llano,82.19,102.06,90.72,102.06,294.84,Single-ply,SBD,M
Boys,89.81,1,Caleb Penny,Llano,88.81,217.72,124.74,185.97,528.44,Single-ply,SBD,M
Boys,89.81,2,Junior Sanchez,Early,84.1,204.12,111.13,204.12,519.36,Single-ply,SBD,M
Boys,89.81,3,Jaime Faust,Hamilton,85.28,226.8,92.99,192.78,512.56,Single-ply,SBD,M
Boys,89.81,4,Jason Lenior,Marble Falls,85.18,190.51,108.86,183.7,483.08,Single-ply,SBD,M
Boys,89.81,5,Phillip James Hammond,Coleman,83.64,183.7,104.33,192.78,480.81,Single-ply,SBD,M
Boys,89.81,6,Jared McHazlett,Burnet,88,163.29,102.06,206.38,471.74,Single-ply,SBD,M
Boys,89.81,7,Chris Carter,Marble Falls,87.36,170.1,106.59,179.17,455.86,Single-ply,SBD,M
Boys,89.81,8,M Monsen,Brownwood,88.99,181.44,115.67,158.76,455.86,Single-ply,SBD,M
Boys,89.81,9,Damian Hatcher,Dublin,87.63,179.17,115.67,156.49,451.32,Single-ply,SBD,M
Boys,89.81,10,Albert Elizondo,Early,85.28,174.63,99.79,165.56,439.98,Single-ply,SBD,M
Boys,89.81,11,Weston McIntire,Lampasas,85.82,158.76,99.79,174.63,433.18,Single-ply,SBD,M
Boys,89.81,12,Alejandro Rodriquez,Dublin,88.9,154.22,111.13,158.76,424.11,Single-ply,SBD,M
Boys,89.81,13,Cullen Ferrill,Burnet,89.09,158.76,88.45,170.1,417.3,Single-ply,SBD,M
Boys,99.79,14,Sergio Torres,Brady,89.99,158.76,99.79,154.22,412.77,Single-ply,SBD,M
Boys,89.81,15,Isaiah Regeon,Brady,87.36,158.76,88.45,163.29,410.5,Single-ply,SBD,M
Boys,89.81,16,Daniel Calderon,San Saba,86.18,147.42,92.99,167.83,408.23,Single-ply,SBD,M
Boys,89.81,17,Christian Guevara,Hamilton,85.28,158.76,79.38,151.95,390.09,Single-ply,SBD,M
Boys,89.81,18,Miguel Palacio,Lampasas,87.72,154.22,79.38,142.88,376.48,Single-ply,SBD,M
Boys,89.81,19,Garrett Hight,Gustine,86.45,113.4,68.04,165.56,347,Single-ply,SBD,M
Boys,89.81,20,Erwin Rodas,Brady,85.55,140.61,72.57,117.93,331.12,Single-ply,SBD,M
Boys,89.81,21,John Allen,Early,89.18,142.88,68.04,113.4,324.32,Single-ply,SBD,M
Boys,89.81,22,S Castillo,Brownwood,85.64,127.01,68.04,127.01,322.05,Single-ply,SBD,M
Boys,89.81,23,Sean Dority,Coleman,84.46,113.4,63.5,127.01,303.91,Single-ply,SBD,M
Boys,89.81,24,R. Lara,Brownwood,85.91,113.4,72.57,104.33,290.3,Single-ply,SBD,M
Boys,89.81,DQ,Robert Reeves,Brady,82.74,,,,,Single-ply,SBD,M
Boys,89.81,DQ,Cj Camarillo,Brady,86.27,165.56,,,,Single-ply,SBD,M
Boys,89.81,DQ,Rudy Rodriquez,Dublin,86.55,197.31,111.13,,,Single-ply,SBD,M
Boys,89.81,DQ,Topher McGhee,Lampasas,88.54,174.63,,,,Single-ply,SBD,M
Boys,89.81,DQ,Jacob Trujillo,Strawn,82.55,142.88,83.91,,,Single-ply,SBD,M
Boys,89.81,DQ,Josue Olvera,Stephenville,86.82,147.42,90.72,,,Single-ply,SBD,M
Boys,89.81,DQ,Roberto Gurrola,Stephenville,89.72,79.38,68.04,,,Single-ply,SBD,M
Boys,89.81,DQ,Aaron Johns,Burnet,88.9,199.58,127.01,,,Single-ply,SBD,M
Boys,99.79,1,Josh Beckwith,Bangs,92.26,242.67,147.42,226.8,616.89,Single-ply,SBD,M
Boys,109.77,2,Shelton Zarate,Coleman,99.88,249.48,138.35,217.72,605.55,Single-ply,SBD,M
Boys,99.79,3,Charlie Thomas,Coleman,94.89,222.26,136.08,238.14,596.47,Single-ply,SBD,M
Boys,99.79,4,Jaylen Bocknite,Brownwood,99.34,217.72,120.2,222.26,560.19,Single-ply,SBD,M
Boys,99.79,5,Brian Rogers,San Saba,90.85,204.12,129.27,213.19,546.58,Single-ply,SBD,M
Boys,99.79,6,Keith Clardy,Early,95.16,215.46,115.67,201.85,532.97,Single-ply,SBD,M
Boys,99.79,7,D Stredic,Brownwood,91.53,206.38,115.67,206.38,528.44,Single-ply,SBD,M
Boys,99.79,8,Bj Walker,Burnet,95.16,208.65,120.2,181.44,510.29,Single-ply,SBD,M
Boys,99.79,9,Ambrosio Rodirquez,Dublin,96.89,192.78,115.67,201.85,510.29,Single-ply,SBD,M
Boys,99.79,10,Zach McCleskey,Burnet,98.79,172.37,108.86,190.51,471.74,Single-ply,SBD,M
Boys,109.77,11,Christian Saldivar,Burnet,99.99,188.24,113.4,167.83,469.47,Single-ply,SBD,M
Boys,99.79,12,Hunter Thomas,Burnet,90.36,181.44,104.33,174.63,460.4,Single-ply,SBD,M
Boys,99.79,13,R. Lewis,Brownwood,95.98,167.83,92.99,172.37,433.18,Single-ply,SBD,M
Boys,99.79,14,J. Mobley,Brownwood,99.06,145.15,108.86,149.69,403.7,Single-ply,SBD,M
Boys,99.79,15,Christian Vargas,Brady,97.79,158.76,79.38,158.76,396.89,Single-ply,SBD,M
Boys,99.79,16,James Stamper,Coleman,93.71,124.74,102.06,156.49,383.29,Single-ply,SBD,M
Boys,99.79,17,Josh Shreeves,Early,91.53,154.22,72.57,142.88,369.68,Single-ply,SBD,M
Boys,99.79,18,C. Gonzales,Brownwood,98.16,136.08,72.57,127.01,335.66,Single-ply,SBD,M
Boys,99.79,DQ,T Chesser,Brownwood,99.16,136.08,,,,Single-ply,SBD,M
Boys,99.79,DQ,Jacob Martin,Stephenville,94.89,172.37,111.13,,,Single-ply,SBD,M
Boys,99.79,DQ,Justin Wade,Stephenville,95.16,142.88,111.13,,,Single-ply,SBD,M
Boys,99.79,DQ,Marcus Hernandez,Strawn,91.72,170.1,95.25,,,Single-ply,SBD,M
Boys,99.79,DQ,Victor Hernandez,Strawn,97.16,172.37,113.4,,,Single-ply,SBD,M
Boys,109.77,1,Michael McKinnerney,San Saba,109.77,233.6,147.42,272.16,653.17,Single-ply,SBD,M
Boys,109.77,2,David Cockrell,Lampasas,108.5,219.99,154.22,195.04,569.26,Single-ply,SBD,M
Boys,109.77,3,Vincent Compuzano,Marble Falls,106.14,204.12,129.27,233.6,566.99,Single-ply,SBD,M
Boys,109.77,4,Fred Hemphill,Coleman,106.78,197.31,129.27,208.65,535.24,Single-ply,SBD,M
Boys,109.77,5,Donald Ricketson,Llano,102.97,204.12,136.08,190.51,530.7,Single-ply,SBD,M
Boys,109.77,6,Christopher Saldivar,Burnet,100.24,199.58,122.47,176.9,498.95,Single-ply,SBD,M
Boys,109.77,7,Marshall Wirtz,Comanche,104.6,188.24,111.13,190.51,489.88,Single-ply,SBD,M
Boys,109.77,8,Dusty Parum,San Saba,105.46,183.7,117.93,181.44,483.08,Single-ply,SBD,M
Boys,109.77,9,Luis Escamilla,Gustine,104.33,181.44,102.06,170.1,453.59,Single-ply,SBD,M
Boys,109.77,10,N Wilkens,Brownwood,108.95,149.69,99.79,185.97,435.45,Single-ply,SBD,M
Boys,109.77,11,Juan Mungia,Llano,101.88,129.27,92.99,151.95,374.21,Single-ply,SBD,M
Boys,109.77,12,Kyle Waling,Lometa,106.5,131.54,86.18,145.15,362.87,Single-ply,SBD,M
Boys,109.77,13,Gunner Bradley,Lometa,108.14,131.54,83.91,147.42,362.87,Single-ply,SBD,M
Boys,109.77,14,Michael Schultz,Coleman,101.24,136.08,65.77,140.61,342.46,Single-ply,SBD,M
Boys,109.77,DQ,M Livingston,Brownwood,103.06,158.76,,,,Single-ply,SBD,M
Boys,109.77,DQ,Trace Boyd,Strawn,101.79,147.42,90.72,,,Single-ply,SBD,M
Boys,124.74,1,James Nesom,Burnet,123.92,265.35,149.69,204.12,619.15,Single-ply,SBD,M
Boys,124.74,2,Michael Buya,Marble Falls,118.02,244.94,151.95,204.12,601.01,Single-ply,SBD,M
Boys,124.74,3,Andy Gamez,Lampasas,112.49,226.8,122.47,213.19,562.45,Single-ply,SBD,M
Boys,124.74,4,Jacob Bryer,Marble Falls,116.85,217.72,129.27,213.19,560.19,Single-ply,SBD,M
Boys,124.74,5,Colton Roark,Llano,117.75,142.88,99.79,158.76,401.43,Single-ply,SBD,M
Boys,124.74,DQ,Daniel Demilo,Stephenville,120.2,167.83,102.06,,,Single-ply,SBD,M
Boys,124.74+,1,Diego Montoya,San Saba,130.77,294.84,179.17,278.96,752.96,Single-ply,SBD,M
Boys,124.74+,2,Jake Dibble,Lampasas,147.15,226.8,133.81,219.99,580.6,Single-ply,SBD,M
Boys,124.74+,3,Chase Fry,Marble Falls,147.42,222.26,142.88,204.12,569.26,Single-ply,SBD,M
Boys,124.74+,4,Kevin Hobbs,Brownwood,134.17,215.46,120.2,226.8,562.45,Single-ply,SBD,M
Boys,124.74+,5,Weldon Edwards,Early,150.59,226.8,102.06,181.44,510.29,Single-ply,SBD,M
Boys,124.74+,6,Travis Sparks,Marble Falls,135.71,199.58,108.86,181.44,489.88,Single-ply,SBD,M
Boys,124.74+,7,Bucky McDaniel,Early,129.46,158.76,92.99,170.1,421.84,Single-ply,SBD,M
Boys,124.74+,8,Jordan Ledbetter,Llano,145.33,161.03,99.79,136.08,396.89,Single-ply,SBD,M
Boys,124.74+,DQ,Derek Morgan,Comanche,135.53,210.92,122.47,,,Single-ply,SBD,M
Boys,124.74+,DQ,C Ruth,Brownwood,158.76,240.4,145.15,,,Single-ply,SBD,M
Boys,124.74+,DQ,Brian Manly,Stephenville,134.99,213.19,136.08,,,Single-ply,SBD,M
Boys,124.74+,DQ,Dempsey Dorris,Strawn,137.53,192.78,102.06,,,Single-ply,SBD,M
Boys,,NS,Jacob Reed,Burnet,,,,,,Single-ply,SBD,M
Boys,,NS,Brodee Johnson,Burnet,,,,,,Single-ply,SBD,M
Boys,,NS,Bryce Sims,Hamilton,,,,,,Single-ply,SBD,M
