Division,WeightClassKg,Place,Name,Team,BodyweightKg,Best3SquatKg,Best3BenchKg,Best3DeadliftKg,TotalKg,Equipment,Event,Sex
Girls,44.23,1,Katrina Le,Beaumont West Brook,42.91,95.25,36.29,104.33,235.87,Single-ply,SBD,F
Girls,44.23,2,Amanda Barrera,Alvin,43.73,83.91,38.56,102.06,224.53,Single-ply,SBD,F
Girls,44.23,3,Valerie Arango,Channelview,44.23,81.65,31.75,92.99,206.38,Single-ply,SBD,F
Girls,47.85,1,Christina Varela,Alvin,46.9,97.52,52.16,90.72,240.4,Single-ply,SBD,F
Girls,47.85,2,Kennedi Herrington,Pearland,47.26,79.38,34.02,79.38,192.78,Single-ply,SBD,F
Girls,47.85,3,Kylee Ayers,Cleveland Tarkington,46.9,70.31,36.29,68.04,174.63,Single-ply,SBD,F
Girls,47.85,4,Tara Lesley,Pearland Dawson,46.81,54.43,31.75,61.23,147.42,Single-ply,SBD,F
Girls,47.85,5,Katie Wamsley,Pearland Dawson,45.54,54.43,20.41,61.23,136.08,Single-ply,SBD,F
Girls,51.94,1,Madison Williams,Cleveland Tarkington,48.9,113.4,49.9,111.13,274.42,Single-ply,SBD,F
Girls,51.94,2,Crystal Phan,Dickinson,51.71,99.79,45.36,108.86,254.01,Single-ply,SBD,F
Girls,51.94,3,Bayley Braquet,Beaumont West Brook,48.72,86.18,47.63,104.33,238.14,Single-ply,SBD,F
Girls,51.94,4,Madi Cervantes,Santa Fe,51.26,92.99,31.75,97.52,222.26,Single-ply,SBD,F
Girls,51.94,5,Paloma Garcia,Alvin,50.89,92.99,38.56,83.91,215.46,Single-ply,SBD,F
Girls,51.94,6,Andrea Recendez,Alvin,49.53,83.91,38.56,86.18,208.65,Single-ply,SBD,F
Girls,51.94,7,Keira Rodriguez,Santa Fe,48.9,83.91,31.75,83.91,199.58,Single-ply,SBD,F
Girls,51.94,8,Sidney Kubicek,Pearland,51.53,70.31,34.02,70.31,174.63,Single-ply,SBD,F
Girls,56.02,1,Madalyn Hollingsworth,Cleveland Tarkington,54.61,90.72,49.9,120.2,260.82,Single-ply,SBD,F
Girls,56.02,2,Araceli Dale,Alvin,55.07,97.52,49.9,106.59,254.01,Single-ply,SBD,F
Girls,56.02,3,Cameron Bloomfield,Santa Fe,55.16,102.06,45.36,92.99,240.4,Single-ply,SBD,F
Girls,56.02,4,Taylor Lewis,Beaumont West Brook,55.88,77.11,47.63,115.67,240.4,Single-ply,SBD,F
Girls,56.02,5,Karli Kalischko,Alvin,54.52,92.99,49.9,86.18,229.06,Single-ply,SBD,F
Girls,56.02,6,Maritza Catalan,Channelview,54.88,95.25,36.29,97.52,229.06,Single-ply,SBD,F
Girls,56.02,7,BriYan Nichols,Baytown Lee,52.71,79.38,43.09,104.33,226.8,Single-ply,SBD,F
Girls,56.02,8,Alexis Ehrlich,Cleveland Tarkington,53.52,88.45,43.09,92.99,224.53,Single-ply,SBD,F
Girls,56.02,9,Debanni Piedra,Baytown Lee,55.79,92.99,34.02,88.45,215.46,Single-ply,SBD,F
Girls,56.02,10,Keiara Ochoa,Port Arthur Memorial,55.43,74.84,36.29,83.91,195.04,Single-ply,SBD,F
Girls,56.02,11,Sydney Mounts,Santa Fe,52.25,74.84,34.02,72.57,181.44,Single-ply,SBD,F
Girls,56.02,12,Madison Harrison,Cleveland Tarkington,52.89,49.9,34.02,74.84,158.76,Single-ply,SBD,F
Girls,56.02,13,Nova Tull,Santa Fe,55.07,47.63,29.48,61.23,138.35,Single-ply,SBD,F
Girls,60.1,1,Nancy Meza,Alvin,58.88,129.27,47.63,133.81,310.71,Single-ply,SBD,F
Girls,60.1,2,Joselin Lara,Channelview,59.15,117.93,49.9,129.27,297.1,Single-ply,SBD,F
Girls,60.1,3,Jasmin Yanez,Channelview,58.51,106.59,52.16,117.93,276.69,Single-ply,SBD,F
Girls,60.1,4,Karina Recendez,Alvin,59.87,102.06,45.36,102.06,249.48,Single-ply,SBD,F
Girls,60.1,5,Dominique de la Rosa,Alvin,59.06,99.79,47.63,99.79,247.21,Single-ply,SBD,F
Girls,60.1,6,Emily Rubio,Dickinson,59.78,86.18,40.82,104.33,231.33,Single-ply,SBD,F
Girls,60.1,7,Gracie Cervantes,Santa Fe,57.33,92.99,49.9,86.18,229.06,Single-ply,SBD,F
Girls,60.1,8,Ashley Taunton,Beaumont West Brook,58.97,81.65,43.09,102.06,226.8,Single-ply,SBD,F
Girls,60.1,9,Leila Abel,Beaumont West Brook,59.6,70.31,47.63,108.86,226.8,Single-ply,SBD,F
Girls,60.1,10,Kyra Peacock,Port Arthur Memorial,59.15,95.25,29.48,90.72,215.46,Single-ply,SBD,F
Girls,60.1,11,Jasie Melancon,Santa Fe,59.87,79.38,45.36,86.18,210.92,Single-ply,SBD,F
Girls,60.1,12,Karringtan Gerard,Beaumont West Brook,57.52,77.11,34.02,90.72,201.85,Single-ply,SBD,F
Girls,67.36,1,Ahniyah Walker,Beaumont West Brook,66.68,113.4,58.97,122.47,294.84,Single-ply,SBD,F
Girls,67.36,2,Camila Recendez,Alvin,67.04,122.47,45.36,120.2,288.03,Single-ply,SBD,F
Girls,67.36,3,Isela Garza,Klein Cain,61.87,113.4,58.97,111.13,283.5,Single-ply,SBD,F
Girls,67.36,4,Angelica Avalos,Alvin,63.59,113.4,61.23,108.86,283.5,Single-ply,SBD,F
Girls,67.36,5,Symantha Donaldson,Pearland,64.77,113.4,56.7,102.06,272.16,Single-ply,SBD,F
Girls,67.36,6,Ashtyn Yovan,Santa Fe,60.96,102.06,52.16,102.06,256.28,Single-ply,SBD,F
Girls,67.36,7,Raeann Hernandez,Alvin,67.04,95.25,40.82,120.2,256.28,Single-ply,SBD,F
Girls,67.36,8,Cameron Baker,Cleveland Tarkington,62.78,95.25,43.09,106.59,244.94,Single-ply,SBD,F
Girls,67.36,9,Tayler Landry,Beaumont West Brook,65.32,83.91,56.7,102.06,242.67,Single-ply,SBD,F
Girls,67.36,10,Kaelyn Andrus,Beaumont West Brook,65.32,99.79,43.09,97.52,240.4,Single-ply,SBD,F
Girls,67.36,11,Tia Anderson,Beaumont West Brook,66.5,86.18,43.09,104.33,233.6,Single-ply,SBD,F
Girls,67.36,12,Adrianna Odell,Alvin,65.41,90.72,43.09,97.52,231.33,Single-ply,SBD,F
Girls,67.36,13,Savannah Williams,Cleveland Tarkington,62.05,79.38,54.43,95.25,229.06,Single-ply,SBD,F
Girls,67.36,14,Elissa Torres,Baytown Lee,62.23,86.18,43.09,97.52,226.8,Single-ply,SBD,F
Girls,67.36,15,Blanco Midulla Fiorella,Houston Clear Lake,66.22,83.91,40.82,95.25,219.99,Single-ply,SBD,F
Girls,67.36,16,Taylor Schneider,Beaumont West Brook,64.41,79.38,31.75,102.06,213.19,Single-ply,SBD,F
Girls,67.36,17,Kaylah Morgan,Beaumont West Brook,60.96,72.57,36.29,102.06,210.92,Single-ply,SBD,F
Girls,67.36,18,Alex Cravey,Santa Fe,61.69,74.84,43.09,88.45,206.38,Single-ply,SBD,F
Girls,67.36,19,Morgan Singleton,Pearland,64.23,81.65,34.02,83.91,199.58,Single-ply,SBD,F
Girls,67.36,20,Destiny Trevino,La Marque,60.51,81.65,34.02,72.57,188.24,Single-ply,SBD,F
Girls,75.07,1,Karina Macias,Alvin,74.39,156.49,56.7,149.69,362.87,Single-ply,SBD,F
Girls,75.07,2,Alyssa Redeaux,Beaumont West Brook,73.84,120.2,72.57,138.35,331.12,Single-ply,SBD,F
Girls,75.07,3,Krissy Prier,Pearland Dawson,73.57,102.06,45.36,113.4,260.82,Single-ply,SBD,F
Girls,75.07,4,Kayla Lawrence,Beaumont West Brook,67.77,92.99,43.09,106.59,242.67,Single-ply,SBD,F
Girls,75.07,5,Karissa Betancourt,Santa Fe,73.12,92.99,49.9,83.91,226.8,Single-ply,SBD,F
Girls,75.07,6,Paris Rodriguez,Texas City,74.57,92.99,36.29,83.91,213.19,Single-ply,SBD,F
Girls,75.07,7,Amalia Flores,Baytown Lee,72.03,74.84,34.02,92.99,201.85,Single-ply,SBD,F
Girls,75.07,8,Kyleigh McGilberry,Santa Fe,74.03,74.84,38.56,86.18,199.58,Single-ply,SBD,F
Girls,75.07,9,Kiara Chevalier,Port Arthur Memorial,73.39,65.77,31.75,74.84,172.37,Single-ply,SBD,F
Girls,75.07,10,Paris Williams,Beaumont West Brook,67.68,108.86,54.43,,163.29,Single-ply,SB,F
Girls,75.07,11,Alysia Brown,Port Arthur Memorial,68.76,68.04,,90.72,158.76,Single-ply,SD,F
Girls,82.33,1,Marie LeCompte,Santa Fe,81.83,147.42,61.23,117.93,326.59,Single-ply,SBD,F
Girls,82.33,2,Lacey Johnson,Pearland Dawson,75.84,113.4,43.09,127.01,283.5,Single-ply,SBD,F
Girls,82.33,3,Iran Inzunza,Beaumont West Brook,79.47,113.4,47.63,122.47,283.5,Single-ply,SBD,F
Girls,82.33,4,Lety Rodriquez,Pasadena Memorial,80.47,106.59,43.09,108.86,258.55,Single-ply,SBD,F
Girls,82.33,5,Cassidy Casey,Pearland Dawson,77.29,90.72,54.43,106.59,251.74,Single-ply,SBD,F
Girls,82.33,6,Kolby Williams,Texas City,75.66,92.99,52.16,102.06,247.21,Single-ply,SBD,F
Girls,82.33,7,Briana Williams,Beaumont West Brook,75.48,83.91,47.63,102.06,233.6,Single-ply,SBD,F
Girls,82.33,8,Gabby Magenheim,Pearland Dawson,78.74,83.91,43.09,104.33,231.33,Single-ply,SBD,F
Girls,82.33,9,Sadie White,Santa Fe,76.38,88.45,47.63,79.38,215.46,Single-ply,SBD,F
Girls,82.33,10,Kayla Morgan,Cleveland Tarkington,77.2,83.91,43.09,79.38,206.38,Single-ply,SBD,F
Girls,82.33,11,Eliza Guzman,Baytown Lee,82.28,65.77,34.02,104.33,204.12,Single-ply,SBD,F
Girls,82.33,12,Nicole Carley,Cleveland Tarkington,75.3,61.23,34.02,70.31,165.56,Single-ply,SBD,F
Girls,90.04,1,Gabrielle Castillo,Beaumont West Brook,89.81,129.27,83.91,131.54,344.73,Single-ply,SBD,F
Girls,90.04,2,Katera Perkins,Beaumont West Brook,83.01,127.01,65.77,131.54,324.32,Single-ply,SBD,F
Girls,90.04,3,Alyna Mickens,Beaumont West Brook,88.27,120.2,61.23,136.08,317.51,Single-ply,SBD,F
Girls,90.04,4,Stevie Goodman,Alvin,84.28,108.86,58.97,117.93,285.76,Single-ply,SBD,F
Girls,90.04,5,Trinity Lee,Pearland,85.46,92.99,56.7,120.2,269.89,Single-ply,SBD,F
Girls,90.04,6,Paulina Hernandez,Baytown Lee,87.45,102.06,43.09,120.2,265.35,Single-ply,SBD,F
Girls,90.04,7,Hope Anderson,Cleveland Tarkington,89.9,108.86,54.43,99.79,263.08,Single-ply,SBD,F
Girls,90.04,8,Jewel Jones,Cleveland Tarkington,86.55,83.91,45.36,104.33,233.6,Single-ply,SBD,F
Girls,90.04,9,Madelynn Gustafson,Dickinson,88.36,88.45,45.36,99.79,233.6,Single-ply,SBD,F
Girls,90.04,10,Briana Alaniz,Baytown Lee,83.1,70.31,31.75,102.06,204.12,Single-ply,SBD,F
Girls,100.02,1,Trinity Ruiz,Alvin,99.61,163.29,77.11,129.27,369.68,Single-ply,SBD,F
Girls,100.02,2,Maria Pena,Pasadena Memorial,98.52,113.4,52.16,140.61,306.17,Single-ply,SBD,F
Girls,100.02,3,Kylie Allbritton,Pearland,99.16,124.74,56.7,115.67,297.1,Single-ply,SBD,F
Girls,100.02,4,Ashanti Robinson,Dickinson,96.25,102.06,65.77,122.47,290.3,Single-ply,SBD,F
Girls,100.02,5,Alexia Aguirre,Dickinson,99.06,97.52,56.7,115.67,269.89,Single-ply,SBD,F
Girls,100.02,6,Jennifer De Leon,Alvin,90.99,86.18,38.56,81.65,206.38,Single-ply,SBD,F
Girls,117.71,1,Cydney Griffin,Beaumont West Brook,100.97,163.29,83.91,136.08,383.29,Single-ply,SBD,F
Girls,117.71,2,Stephanie Hawkins,Dickinson,103.78,122.47,65.77,129.27,317.51,Single-ply,SBD,F
Girls,117.71,3,Hayli Pennington,Alvin,111.31,136.08,63.5,115.67,315.25,Single-ply,SBD,F
Girls,117.71,4,Madison Hall,Channelview,106.14,131.54,61.23,106.59,299.37,Single-ply,SBD,F
Girls,117.71,5,Anina Miller,Beaumont West Brook,107.32,92.99,61.23,113.4,267.62,Single-ply,SBD,F
Girls,117.71,6,Jalecia Myles,Dickinson,113.13,97.52,54.43,104.33,256.28,Single-ply,SBD,F
Girls,117.71,7,Aniaya Hart,Port Arthur Memorial,117.3,111.13,43.09,86.18,240.4,Single-ply,SBD,F
Girls,117.71,8,Maile Ramirez,Alvin,101.06,90.72,47.63,79.38,217.72,Single-ply,SBD,F
Girls,117.71,9,Savanah Hass,Texas City,101.51,74.84,34.02,95.25,204.12,Single-ply,SBD,F
Girls,117.71,10,Aleicya Sells,Beaumont West Brook,102.42,63.5,52.16,88.45,204.12,Single-ply,SBD,F
Girls,117.71+,1,Haley Blumrich,Pearland Dawson,131.81,170.1,65.77,158.76,394.63,Single-ply,SBD,F
Girls,117.71+,2,Belen Almader,Alvin,128,167.83,61.23,142.88,371.95,Single-ply,SBD,F
Girls,117.71+,3,Mecaiya Green,Dickinson,149.32,129.27,65.77,131.54,326.59,Single-ply,SBD,F
Girls,117.71+,4,Karynton Mitchell,Beaumont West Brook,128.46,106.59,61.23,104.33,272.16,Single-ply,SBD,F
