Division,WeightClassKg,Place,Name,Team,BodyweightKg,Best3SquatKg,Best3BenchKg,Best3DeadliftKg,TotalKg,Equipment,Event,Sex
Boys,51.71,1,Chris McGilberry,Silsbee,50.8,108.86,63.5,102.06,274.42,Single-ply,SBD,M
Boys,51.71,2,DaShawn Holt,West Orange-Stark,42.18,90.72,47.63,102.06,240.4,Single-ply,SBD,M
Boys,51.71,DQ,Hunter Angello,Orange Little Cypress-Mauriceville,51.26,,,,,Single-ply,SBD,M
Boys,55.79,1,Taylor Cheshire,Silsbee,52.62,99.79,68.04,117.93,285.76,Single-ply,SBD,M
Boys,59.87,1,Dustin Forester,Orange Little Cypress-Mauriceville,58.97,111.13,56.7,149.69,317.51,Single-ply,SBD,M
Boys,67.13,1,Ronald Guillory,West Orange-Stark,65.77,163.29,99.79,204.12,467.2,Single-ply,SBD,M
Boys,67.13,2,Trey Ruggles,Silsbee,65.77,133.81,79.38,131.54,344.73,Single-ply,SBD,M
Boys,67.13,3,Cade Datillio,Orangefield,63.05,111.13,90.72,136.08,337.93,Single-ply,SBD,M
Boys,67.13,4,Sean Hollyfield,Silsbee,67.13,113.4,95.25,129.27,337.93,Single-ply,SBD,M
Boys,67.13,DQ,Victor Davila,Orange Little Cypress-Mauriceville,66.68,142.88,92.99,,,Single-ply,SBD,M
Boys,74.84,1,Hunter Fontenot,Orange Little Cypress-Mauriceville,73.48,181.44,113.4,204.12,498.95,Single-ply,SBD,M
Boys,74.84,2,Cameron Guillot,Orangefield,73.03,190.51,97.52,163.29,451.32,Single-ply,SBD,M
Boys,74.84,3,Ghaboolian-Zare Ehson,Silsbee,71.21,161.03,90.72,183.7,435.45,Single-ply,SBD,M
Boys,74.84,4,Kyle Coffey,Silsbee,70.76,140.61,90.72,149.69,381.02,Single-ply,SBD,M
Boys,74.84,5,Chris Griffin,West Orange-Stark,71.21,142.88,79.38,142.88,365.14,Single-ply,SBD,M
Boys,82.1,1,Austin Moore,Orangefield,79.38,249.48,161.03,244.94,655.44,Single-ply,SBD,M
Boys,82.1,2,Demaric Judge,West Orange-Stark,78.02,183.7,113.4,190.51,487.61,Single-ply,SBD,M
Boys,82.1,3,Alex Reed,Orange Little Cypress-Mauriceville,78.02,199.58,97.52,181.44,478.54,Single-ply,SBD,M
Boys,82.1,4,Jerrick Spencer,West Orange-Stark,81.65,154.22,120.2,181.44,455.86,Single-ply,SBD,M
Boys,82.1,5,Shayne Arceneaux,Orangefield,82.1,167.83,70.31,183.7,421.84,Single-ply,SBD,M
Boys,89.81,1,Paul Ivory,West Orange-Stark,86.18,151.95,90.72,197.31,439.98,Single-ply,SBD,M
Boys,89.81,2,Coleton Atkins,Orange Little Cypress-Mauriceville,85.28,129.27,74.84,147.42,351.53,Single-ply,SBD,M
Boys,89.81,3,Tyler Savant,Orangefield,89.36,120.2,74.84,142.88,337.93,Single-ply,SBD,M
Boys,89.81,4,Jordan Parks,Orange Little Cypress-Mauriceville,84.82,115.67,74.84,124.74,315.25,Single-ply,SBD,M
Boys,89.81,DQ,Blake LeBlanc,Orange Little Cypress-Mauriceville,88.45,,,,,Single-ply,SBD,M
Boys,99.79,1,Dylan Garcia,Anahuac,99.47,201.85,124.74,179.17,505.76,Single-ply,SBD,M
Boys,99.79,2,Tristen Scott,West Orange-Stark,98.88,165.56,115.67,197.31,478.54,Single-ply,SBD,M
Boys,99.79,3,Bobby Rash,West Orange-Stark,99.79,149.69,106.59,167.83,424.11,Single-ply,SBD,M
Boys,99.79,4,Lucas Russell,Orange Little Cypress-Mauriceville,90.72,170.1,81.65,163.29,415.04,Single-ply,SBD,M
Boys,99.79,5,Daniel Grant,Silsbee,92.99,133.81,95.25,163.29,392.36,Single-ply,SBD,M
Boys,99.79,DQ,Morris Joseph,West Orange-Stark,98.88,183.7,97.52,,,Single-ply,SBD,M
Boys,109.77,1,Adam Jacobs,Orangefield,106.14,226.8,151.95,192.78,571.53,Single-ply,SBD,M
Boys,109.77,2,Garrett Johnson,Orange Little Cypress-Mauriceville,108.86,233.6,120.2,195.04,548.85,Single-ply,SBD,M
Boys,109.77,3,Jabari Gooch,Silsbee,107.95,192.78,111.13,215.46,519.36,Single-ply,SBD,M
Boys,109.77,4,Josh King,West Orange-Stark,109.77,181.44,104.33,224.53,510.29,Single-ply,SBD,M
Boys,109.77,5,Jake Bradley,Orangefield,102.06,190.51,115.67,195.04,501.22,Single-ply,SBD,M
Boys,109.77,DQ,Jacob Vezina,Orange Little Cypress-Mauriceville,102.06,,,,,Single-ply,SBD,M
Boys,124.74,1,Carter Beck,Orange Little Cypress-Mauriceville,118.84,226.8,149.69,226.8,603.28,Single-ply,SBD,M
Boys,124.74,2,Chris Stanley,Anahuac,114.85,235.87,154.22,208.65,598.74,Single-ply,SBD,M
Boys,124.74,3,Daren Garcia,Anahuac,122.15,226.8,136.08,174.63,537.51,Single-ply,SBD,M
Boys,124.74,4,Johnathan Hageon,Silsbee,112.94,204.12,113.4,208.65,526.17,Single-ply,SBD,M
Boys,124.74,5,Johnathan Mitchell,Silsbee,117.93,195.04,108.86,156.49,460.4,Single-ply,SBD,M
Boys,124.74,6,Tyler Collins #1,Silsbee,120.2,172.37,122.47,124.74,419.57,Single-ply,SBD,M
Boys,124.74,7,LeDariah Carter,West Orange-Stark,112.49,124.74,92.99,199.58,417.3,Single-ply,SBD,M
Boys,124.74,8,Dakota Ard,Silsbee,117.93,158.76,81.65,161.03,401.43,Single-ply,SBD,M
Boys,124.74+,1,Patrick Hudson,Silsbee,141.52,285.76,183.7,285.76,755.23,Single-ply,SBD,M
Boys,124.74+,2,Aaron Galitz,Orangefield,137.89,206.38,136.08,206.38,548.85,Single-ply,SBD,M
Boys,124.74+,3,Hunter Johnson,Anahuac,159.85,197.31,106.59,174.63,478.54,Single-ply,SBD,M
Boys,124.74+,4,Chris Dyson,Orange Little Cypress-Mauriceville,145.15,172.37,65.77,142.88,381.02,Single-ply,SBD,M
Boys,124.74+,DQ,Luke Padilla,Orangefield,154.22,192.78,,183.7,,Single-ply,SBD,M
