Division,WeightClassKg,Place,Name,Team,BodyweightKg,Best3SquatKg,Best3BenchKg,Best3DeadliftKg,TotalKg,Equipment,Event,Sex
Girls,44.23,1,Hailey Zigal,Splendora,42.73,61.23,24.95,65.77,151.95,Single-ply,SBD,F
Girls,44.23,2,Avery Moresco,Hitchcock,41.73,45.36,24.95,49.9,120.2,Single-ply,SBD,F
Girls,47.85,1,Criselda Serna,Freeport Brazosport,46.54,92.99,45.36,102.06,240.4,Single-ply,SBD,F
Girls,47.85,2,Kendra Campbell,Splendora,46.63,61.23,29.48,81.65,172.37,Single-ply,SBD,F
Girls,47.85,3,Sarah Buffington,Santa Fe,46.27,65.77,34.02,70.31,170.1,Single-ply,SBD,F
Girls,51.94,1,Sydney Platt,Clute Brazoswood,50.71,113.4,77.11,113.4,303.91,Single-ply,SBD,F
Girls,51.94,2,Yessi Altimirano,Manvel,50.98,95.25,49.9,120.2,265.35,Single-ply,SBD,F
Girls,51.94,3,Jordan Alford,Splendora,51.8,81.65,34.02,86.18,201.85,Single-ply,SBD,F
Girls,51.94,4,Triston Shelton,Manvel,50.62,83.91,,99.79,183.7,Single-ply,SD,F
Girls,51.94,5,Alexis Woods,Freeport Brazosport,49.44,72.57,31.75,72.57,176.9,Single-ply,SBD,F
Girls,51.94,6,Megan Martin,Huffman Hargrave,50.17,58.97,29.48,70.31,158.76,Single-ply,SBD,F
Girls,51.94,7,Jordan Pickeny,Galveston Ball,48.53,47.63,34.02,61.23,142.88,Single-ply,SBD,F
Girls,51.94,8,Savannah Brakefield,Montgomery,49.99,43.09,24.95,63.5,131.54,Single-ply,SBD,F
Girls,51.94,9,Daisy Mayin,Galveston Ball,51.53,43.09,29.48,54.43,127.01,Single-ply,SBD,F
Girls,56.02,1,Yessica Ramos,Galveston Ball,52.89,111.13,43.09,108.86,263.08,Single-ply,SBD,F
Girls,56.02,2,Sissy Martinez,Palacios,54.98,99.79,47.63,102.06,249.48,Single-ply,SBD,F
Girls,56.02,3,Kaylee Lewis,Splendora,53.61,72.57,38.56,104.33,215.46,Single-ply,SBD,F
Girls,56.02,4,Priscilla Ramirez,Manvel,53.98,79.38,38.56,97.52,215.46,Single-ply,SBD,F
Girls,56.02,5,Marissa Duke,Splendora,53.89,81.65,40.82,88.45,210.92,Single-ply,SBD,F
Girls,56.02,6,Stephanie Perez,Clute Brazoswood,55.07,79.38,29.48,99.79,208.65,Single-ply,SBD,F
Girls,56.02,7,Ally Winter,Santa Fe,55.7,74.84,38.56,92.99,206.38,Single-ply,SBD,F
Girls,56.02,8,Hunter Kana,Santa Fe,52.16,79.38,29.48,88.45,197.31,Single-ply,SBD,F
Girls,56.02,9,Rocio Escobar,Galveston Ball,53.07,77.11,34.02,70.31,181.44,Single-ply,SBD,F
Girls,56.02,10,Rose Conner,Hitchcock,54.52,63.5,27.22,77.11,167.83,Single-ply,SBD,F
Girls,56.02,11,Marlene Montalvo,Dickinson,53.07,43.09,34.02,72.57,149.69,Single-ply,SBD,F
Girls,56.02,12,Kaleigh Odem,Clute Brazoswood,54.61,56.7,24.95,68.04,149.69,Single-ply,SBD,F
Girls,56.02,13,Madsion Milom,La Porte,54.88,83.91,34.02,,117.93,Single-ply,SB,F
Girls,56.02,DQ,Nathasha Richards,Beaumont Ozen,55.79,,,,,Single-ply,SBD,F
Girls,60.1,1,Valerie Madrigal,Freeport Brazosport,59.06,113.4,47.63,127.01,288.03,Single-ply,SBD,F
Girls,60.1,2,Eda Hnatek,Splendora,57.24,102.06,49.9,104.33,256.28,Single-ply,SBD,F
Girls,60.1,3,Jayden White,Freeport Brazosport,60.06,95.25,36.29,108.86,240.4,Single-ply,SBD,F
Girls,60.1,4,Summer Harris,Dickinson,57.24,113.4,38.56,83.91,235.87,Single-ply,SBD,F
Girls,60.1,5,Morgan Johnson,La Porte,60.06,95.25,34.02,104.33,233.6,Single-ply,SBD,F
Girls,60.1,6,Roni Fleming,Hitchcock,59.96,90.72,43.09,95.25,229.06,Single-ply,SBD,F
Girls,60.1,7,Dixee Earhart,Splendora,57.15,90.72,43.09,81.65,215.46,Single-ply,SBD,F
Girls,60.1,8,Kris Kindred,Pasadena Dobie,56.97,74.84,40.82,92.99,208.65,Single-ply,SBD,F
Girls,60.1,9,Madison Slade,Huffman Hargrave,56.25,56.7,47.63,83.91,188.24,Single-ply,SBD,F
Girls,60.1,10,Bianca Valdez,Santa Fe,56.97,61.23,36.29,86.18,183.7,Single-ply,SBD,F
Girls,60.1,11,Noelle Levantino,Montgomery,56.25,63.5,34.02,83.91,181.44,Single-ply,SBD,F
Girls,60.1,12,Caitlin Disiere,La Porte,60.06,56.7,29.48,74.84,161.03,Single-ply,SBD,F
Girls,60.1,13,Gabriela Estrada,Galveston Ball,58.69,40.82,29.48,56.7,127.01,Single-ply,SBD,F
Girls,60.1,14,Kyai Nopers,Galveston Ball,57.79,,38.56,72.57,111.13,Single-ply,BD,F
Girls,60.1,DQ,Tea Edwards,Hitchcock,59.87,,,,,Single-ply,SBD,F
Girls,67.36,1,Karina Ramon,Palacios,66.41,115.67,63.5,124.74,303.91,Single-ply,SBD,F
Girls,67.36,2,Paige Manzella,Splendora,64.68,99.79,38.56,111.13,249.48,Single-ply,SBD,F
Girls,67.36,3,Avery Lock,Splendora,63.87,97.52,40.82,99.79,238.14,Single-ply,SBD,F
Girls,67.36,4,Daelyn Frank,Hitchcock,62.78,86.18,34.02,104.33,224.53,Single-ply,SBD,F
Girls,67.36,5,Candice Monclova,Freeport Brazosport,63.59,77.11,49.9,92.99,219.99,Single-ply,SBD,F
Girls,67.36,6,Angelica Moreno,Manvel,65.41,83.91,36.29,97.52,217.72,Single-ply,SBD,F
Girls,67.36,7,Celeste Powell,Freeport Brazosport,67.13,79.38,34.02,97.52,210.92,Single-ply,SBD,F
Girls,67.36,8,Yelitza Martinez,Manvel,63.14,79.38,36.29,90.72,206.38,Single-ply,SBD,F
Girls,67.36,9,Andrea Lopez,Galveston Ball,65.05,74.84,36.29,65.77,176.9,Single-ply,SBD,F
Girls,67.36,10,Jazmine Spiller,Galveston Ball,66.77,58.97,40.82,74.84,174.63,Single-ply,SBD,F
Girls,67.36,11,Paxton Grimm,Conroe Oak Ridge,65.86,63.5,22.68,58.97,145.15,Single-ply,SBD,F
Girls,67.36,DQ,Derricka Johnson,Beaumont Ozen,67.13,,,,,Single-ply,SBD,F
Girls,67.36,DQ,Ronisha Jordan,Hitchcock,67.13,,,,,Single-ply,SBD,F
Girls,75.07,1,Jennifer Ramirez,Conroe Oak Ridge,72.67,136.08,79.38,147.42,362.87,Single-ply,SBD,F
Girls,75.07,2,Jessica Echegoyen,Manvel,69.22,138.35,54.43,147.42,340.19,Single-ply,SBD,F
Girls,75.07,3,Brenttany Birdow,Hitchcock,71.03,127.01,38.56,131.54,297.1,Single-ply,SBD,F
Girls,75.07,4,De'Jeanna Payne,Channelview,74.93,102.06,61.23,131.54,294.84,Single-ply,SBD,F
Girls,75.07,5,Phylane Smith,Freeport Brazosport,69.13,117.93,47.63,99.79,265.35,Single-ply,SBD,F
Girls,75.07,6,Mykalyah Florez-Lazay,Santa Fe,69.85,106.59,52.16,102.06,260.82,Single-ply,SBD,F
Girls,75.07,7,Karenna Castro,Santa Fe,72.03,90.72,49.9,104.33,244.94,Single-ply,SBD,F
Girls,75.07,8,Arielle Moore,Galveston Ball,74.39,90.72,43.09,111.13,244.94,Single-ply,SBD,F
Girls,75.07,9,Jaia Adams,Beaumont Ozen,73.75,124.74,,113.4,238.14,Single-ply,SD,F
Girls,75.07,10,Delia Lopez,Palacios,67.49,72.57,45.36,102.06,219.99,Single-ply,SBD,F
Girls,75.07,11,Kimberly Simmons,Hitchcock,67.95,70.31,34.02,95.25,199.58,Single-ply,SBD,F
Girls,75.07,12,Lillian Johnson,Clute Brazoswood,74.39,65.77,43.09,88.45,197.31,Single-ply,SBD,F
Girls,75.07,13,Baylee Dunn,Splendora,70.85,83.91,38.56,68.04,190.51,Single-ply,SBD,F
Girls,75.07,14,Adreanna Mendoza,Conroe Oak Ridge,70.4,79.38,40.82,52.16,172.37,Single-ply,SBD,F
Girls,75.07,15,Takiva Moore,Galveston Ball,69.85,56.7,,61.23,117.93,Single-ply,SD,F
Girls,75.07,DQ,Jessica Mccormick,Santa Fe,74.84,,,,,Single-ply,SBD,F
Girls,82.33,1,Madelynn Mahoney,Manvel,75.3,120.2,49.9,113.4,283.5,Single-ply,SBD,F
Girls,82.33,2,Leslie Perez,Channelview,80.74,104.33,43.09,102.06,249.48,Single-ply,SBD,F
Girls,82.33,3,Crystal Garcia,Splendora,75.39,104.33,38.56,102.06,244.94,Single-ply,SBD,F
Girls,82.33,4,Karla Caudillo,Freeport Brazosport,79.83,68.04,43.09,111.13,222.26,Single-ply,SBD,F
Girls,82.33,5,Georgi Thiem,Hitchcock,77.66,79.38,38.56,83.91,201.85,Single-ply,SBD,F
Girls,82.33,6,Ashley Coy,Conroe Oak Ridge,81.01,81.65,31.75,83.91,197.31,Single-ply,SBD,F
Girls,82.33,7,Samamtha Raine,Clute Brazoswood,77.29,65.77,45.36,74.84,185.97,Single-ply,SBD,F
Girls,82.33,8,Makayla Cruzan,Hitchcock,82.01,58.97,38.56,68.04,165.56,Single-ply,SBD,F
Girls,82.33,DQ,Andrewlena Bingham,Manvel,82.1,,,,,Single-ply,SBD,F
Girls,82.33,DQ,Bailey Zornes,Santa Fe,82.1,,,,,Single-ply,SBD,F
Girls,90.04,1,Quinessa Marshall,Freeport Brazosport,87.45,161.03,72.57,154.22,387.82,Single-ply,SBD,F
Girls,90.04,2,Taylor Barrow,Santa Fe,86.14,129.27,65.77,129.27,324.32,Single-ply,SBD,F
Girls,90.04,3,Victoria Martinez,Freeport Brazosport,87.63,102.06,61.23,131.54,294.84,Single-ply,SBD,F
Girls,90.04,4,Jessena Luna,Pasadena Dobie,85.73,99.79,47.63,113.4,260.82,Single-ply,SBD,F
Girls,90.04,5,Kathryn Langlois,Montgomery,89.63,97.52,49.9,104.33,251.74,Single-ply,SBD,F
Girls,90.04,6,Jailen Flores,Dickinson,86.27,99.79,34.02,95.25,229.06,Single-ply,SBD,F
Girls,90.04,7,Francisca Damian,Clute Brazoswood,89.99,92.99,47.63,79.38,219.99,Single-ply,SBD,F
Girls,90.04,8,Antoinette Anderson,Clute Brazoswood,84.91,70.31,43.09,102.06,215.46,Single-ply,SBD,F
Girls,90.04,9,Elavee Barrett,Dickinson,86,86.18,38.56,90.72,215.46,Single-ply,SBD,F
Girls,90.04,10,Chantaneece Richardson,Dickinson,83.01,79.38,,,79.38,Single-ply,S,F
Girls,100.02,1,Alyssa Morales,Clute Brazoswood,95.62,120.2,63.5,113.4,297.1,Single-ply,SBD,F
Girls,100.02,2,Brooke Beckham,Clute Brazoswood,97.43,106.59,54.43,104.33,265.35,Single-ply,SBD,F
Girls,100.02,3,Kass Gonzales,Montgomery,92.49,90.72,56.7,79.38,226.8,Single-ply,SBD,F
Girls,100.02,4,Britnay Adams,Manvel,94.44,,40.82,99.79,140.61,Single-ply,BD,F
Girls,100.02+,1,Nicki Ciesko,Montgomery,101.7,183.7,90.72,142.88,417.3,Single-ply,SBD,F
Girls,100.02+,2,Jerrika McDonald,Clute Brazoswood,106.87,136.08,70.31,131.54,337.93,Single-ply,SBD,F
Girls,100.02+,3,Krystal Gonzalez,Manvel,106.05,142.88,61.23,129.27,333.39,Single-ply,SBD,F
Girls,100.02+,4,Taylor Swartz,Santa Fe,121.65,102.06,61.23,140.61,303.91,Single-ply,SBD,F
Girls,100.02+,5,Jordan Buestillos,Freeport Brazosport,110.5,115.67,54.43,124.74,294.84,Single-ply,SBD,F
Girls,100.02+,6,Alyssa Millian,Clute Brazoswood,101.15,102.06,47.63,92.99,242.67,Single-ply,SBD,F
Girls,100.02+,7,Ryann Brown,Stafford,107.59,61.23,38.56,92.99,192.78,Single-ply,SBD,F
