Division,WeightClassKg,Place,Name,Team,BodyweightKg,Best3SquatKg,Best3BenchKg,Best3DeadliftKg,TotalKg,Equipment,Event,Sex
Boys,51.71,1,Kevin Angus,Port Neches-Groves,50.62,127.01,74.84,140.61,342.46,Single-ply,SBD,M
Boys,51.71,2,Anthony Galvan,Channelview,50.17,102.06,61.23,120.2,283.5,Single-ply,SBD,M
Boys,51.71,3,Austin Leger,Lumberton,51.07,99.79,58.97,117.93,276.69,Single-ply,SBD,M
Boys,51.71,4,Bryant Carruth,Lumberton,49.35,83.91,61.23,117.93,263.08,Single-ply,SBD,M
Boys,51.71,5,Melvin Turman,Channelview,46.63,90.72,58.97,104.33,254.01,Single-ply,SBD,M
Boys,51.71,6,Gary Metts,Nederland,49.49,68.04,52.16,102.06,222.26,Single-ply,SBD,M
Boys,51.71,7,Tanner Royal,Bridge City,49.4,77.11,43.09,68.04,188.24,Single-ply,SBD,M
Boys,55.79,1,Sergio Vences,La Porte,54.2,142.88,74.84,151.95,369.68,Single-ply,SBD,M
Boys,55.79,2,Devon Oceguera,Bridge City,53.57,124.74,90.72,117.93,333.39,Single-ply,SBD,M
Boys,55.79,3,Hunter Stout,Bridge City,54.98,136.08,65.77,129.27,331.12,Single-ply,SBD,M
Boys,55.79,4,Blake Smith,Nederland,53.16,102.06,36.29,124.74,263.08,Single-ply,SBD,M
Boys,59.87,DQ,Joel Lozano,Port Neches-Groves,55.84,111.13,,,,Single-ply,SBD,M
Boys,67.13,1,Rodney Bigham,Channelview,60.1,170.1,120.2,195.04,485.34,Single-ply,SBD,M
Boys,67.13,2,Troy Soileau,Lumberton,60.1,149.69,86.18,154.22,390.09,Single-ply,SBD,M
Boys,59.87,3,Kevon Johnson,Port Arthur Memorial,59.01,142.88,81.65,136.08,360.61,Single-ply,SBD,M
Boys,59.87,4,Luis McDaniel,La Porte,59.69,136.08,92.99,129.27,358.34,Single-ply,SBD,M
Boys,59.87,5,Sean Longmire,Bridge City,59.56,127.01,81.65,122.47,331.12,Single-ply,SBD,M
Boys,59.87,6,K. Robinson,Beaumont Central,56.84,111.13,65.77,151.95,328.85,Single-ply,SBD,M
Boys,59.87,7,Ron Lee,Beaumont West Brook,59.69,79.38,54.43,97.52,231.33,Single-ply,SBD,M
Boys,67.13,1,Nick Dockens,Orange Little Cypress-Mauriceville,65.32,170.1,97.52,181.44,449.06,Single-ply,SBD,M
Boys,67.13,2,Bret Chamblee,Nederland,65.05,163.29,97.52,183.7,444.52,Single-ply,SBD,M
Boys,67.13,3,A. Powell,Vidor,66.81,158.76,90.72,176.9,426.38,Single-ply,SBD,M
Boys,67.13,4,M Godeaux,Vidor,66.68,165.56,86.18,165.56,417.3,Single-ply,SBD,M
Boys,67.13,5,D Cologne,Beaumont Ozen,61.51,133.81,86.18,181.44,401.43,Single-ply,SBD,M
Boys,67.13,6,Stephen Balsano,Bridge City,66.9,163.29,74.84,163.29,401.43,Single-ply,SBD,M
Boys,67.13,7,M. Thomas,Vidor,65.05,154.22,97.52,142.88,394.63,Single-ply,SBD,M
Boys,67.13,8,Matt Gerald,Port Neches-Groves,67.04,145.15,102.06,142.88,390.09,Single-ply,SBD,M
Boys,67.13,9,Cyrus Walters,Port Arthur Memorial,66.54,124.74,88.45,170.1,383.29,Single-ply,SBD,M
Boys,67.13,10,Jalen Johnson,Port Arthur Memorial,65.82,124.74,74.84,149.69,349.27,Single-ply,SBD,M
Boys,67.13,11,Quincy Honeycutt,Lumberton,63.32,104.33,90.72,142.88,337.93,Single-ply,SBD,M
Boys,67.13,12,Bryce Carroll,Lumberton,60.69,104.33,81.65,136.08,322.05,Single-ply,SBD,M
Boys,67.13,13,Noah Ogrydziak,Nederland,65.45,104.33,74.84,113.4,292.57,Single-ply,SBD,M
Boys,67.13,14,Chris Hagner,Nederland,63.59,95.25,52.16,99.79,247.21,Single-ply,SBD,M
Boys,67.13,15,Payton Honeycutt,Lumberton,61.92,54.43,43.09,81.65,179.17,Single-ply,SBD,M
Boys,67.13,DQ,Darvin Gatlin,Beaumont West Brook,66,158.76,,,,Single-ply,SBD,M
Boys,67.13,DQ,Terrell Raville,Beaumont Ozen,66.77,,,,,Single-ply,SBD,M
Boys,74.84,1,Robert Johnson,Nederland,74.8,263.08,127.01,258.55,648.64,Single-ply,SBD,M
Boys,74.84,2,Austin Simmons,Hamshire-Fannett,69.04,192.78,133.81,185.97,512.56,Single-ply,SBD,M
Boys,74.84,3,K. Powell,Vidor,71.94,192.78,120.2,185.97,498.95,Single-ply,SBD,M
Boys,74.84,4,Jeremy McNeil,La Porte,68.72,174.63,129.27,192.78,496.68,Single-ply,SBD,M
Boys,74.84,5,Danzel Granderson,Channelview,67.77,158.76,106.59,226.8,492.15,Single-ply,SBD,M
Boys,74.84,6,Dylan Harvey,Beaumont West Brook,72.89,188.24,120.2,183.7,492.15,Single-ply,SBD,M
Boys,74.84,7,Christian Andrews,Beaumont Ozen,74.12,181.44,117.93,181.44,480.81,Single-ply,SBD,M
Boys,74.84,8,Colton Boudreaux,Orange Little Cypress-Mauriceville,74.34,197.31,102.06,181.44,480.81,Single-ply,SBD,M
Boys,74.84,9,Dalton Horn,Sour Lake Hardin-Jefferson,73.48,156.49,102.06,181.44,439.98,Single-ply,SBD,M
Boys,74.84,10,Nicholas Green,Bridge City,73.62,174.63,102.06,145.15,421.84,Single-ply,SBD,M
Boys,74.84,11,X Markland,Hamshire-Fannett,72.57,158.76,106.59,145.15,410.5,Single-ply,SBD,M
Boys,74.84,12,Tracy Oliver,Port Arthur Memorial,67.54,140.61,79.38,174.63,394.63,Single-ply,SBD,M
Boys,74.84,13,Lawrence Wise,Port Arthur Memorial,70.35,147.42,74.84,165.56,387.82,Single-ply,SBD,M
Boys,74.84,14,Karl Terrebonne,La Porte,72.98,142.88,92.99,149.69,385.55,Single-ply,SBD,M
Boys,74.84,15,Montez Scott,La Porte,73.48,142.88,102.06,129.27,374.21,Single-ply,SBD,M
Boys,74.84,16,Kenneth Mitchel,Port Arthur Memorial,68.08,111.13,83.91,156.49,351.53,Single-ply,SBD,M
Boys,74.84,17,Harry Wiltz,Port Arthur Memorial,69.99,136.08,72.57,142.88,351.53,Single-ply,SBD,M
Boys,74.84,18,E Carter,Beaumont Central,70.72,113.4,81.65,149.69,344.73,Single-ply,SBD,M
Boys,74.84,19,Joshua Hines,Port Arthur Memorial,70.17,102.06,74.84,158.76,335.66,Single-ply,SBD,M
Boys,74.84,20,S Chessher,Vidor,69.94,113.4,70.31,145.15,328.85,Single-ply,SBD,M
Boys,74.84,21,Jamaal Hilliard,Beaumont West Brook,72.57,88.45,72.57,129.27,290.3,Single-ply,SBD,M
Boys,74.84,22,Brock Belanger,Deweyville,68.17,97.52,72.57,115.67,285.76,Single-ply,SBD,M
Boys,74.84,23,X Mitchell,Beaumont Central,68.54,74.84,58.97,111.13,244.94,Single-ply,SBD,M
Boys,74.84,DQ,K Vallier,Beaumont Central,67.54,102.06,74.84,,,Single-ply,SBD,M
Boys,74.84,DQ,J. Guillory,Beaumont Central,69.26,,,,,Single-ply,SBD,M
Boys,74.84,DQ,Jordan Prevost,Port Arthur Memorial,71.53,,,,,Single-ply,SBD,M
Boys,82.1,1,Josh Wilson,Beaumont West Brook,78.02,249.48,117.93,229.06,596.47,Single-ply,SBD,M
Boys,82.1,2,Ryan Asher,Lumberton,81.06,204.12,145.15,226.8,576.06,Single-ply,SBD,M
Boys,82.1,3,Colton Carter,Nederland,80.51,224.53,127.01,215.46,566.99,Single-ply,SBD,M
Boys,82.1,4,Bruce Reyes,Beaumont West Brook,77.79,224.53,99.79,210.92,535.24,Single-ply,SBD,M
Boys,89.81,5,Justin Potter,Lumberton,82.28,158.76,124.74,185.97,469.47,Single-ply,SBD,M
Boys,82.1,6,J Dinh,Beaumont Central,81.69,158.76,127.01,165.56,451.32,Single-ply,SBD,M
Boys,82.1,7,D Wiggins,Stafford,79.61,174.63,97.52,170.1,442.25,Single-ply,SBD,M
Boys,82.1,8,Tim Mitchell,Sour Lake Hardin-Jefferson,80.24,165.56,97.52,163.29,426.38,Single-ply,SBD,M
Boys,82.1,9,Chase Bertrand,Port Neches-Groves,81.6,183.7,111.13,129.27,424.11,Single-ply,SBD,M
Boys,89.81,10,Austin Broussard,Bridge City,82.24,145.15,111.13,163.29,419.57,Single-ply,SBD,M
Boys,82.1,11,Elandon Roberts,Port Arthur Memorial,81.51,142.88,90.72,158.76,392.36,Single-ply,SBD,M
Boys,82.1,12,Walter Pratt,Houston Sam Houston,82.1,113.4,81.65,147.42,342.46,Single-ply,SBD,M
Boys,82.1,13,Raul Gama,Houston Sam Houston,77.56,102.06,77.11,156.49,335.66,Single-ply,SBD,M
Boys,82.1,14,Robert Tutton,Lumberton,81.6,113.4,81.65,117.93,312.98,Single-ply,SBD,M
Boys,82.1,DQ,Taylor McDonald,Lumberton,81.33,176.9,,,,Single-ply,SBD,M
Boys,82.1,DQ,David Grantham,Port Neches-Groves,75.39,,,,,Single-ply,SBD,M
Boys,82.1,DQ,Ashton Smith,Channelview,81.78,215.46,129.27,,,Single-ply,SBD,M
Boys,82.1,DQ,Dj Swhwartz,Deweyville,75.8,129.27,,,,Single-ply,SBD,M
Boys,82.1,DQ,Reggie Begelton,Beaumont West Brook,75.84,165.56,,,,Single-ply,SBD,M
Boys,89.81,1,Jonathan Fontenot,Orange Little Cypress-Mauriceville,87.68,226.8,145.15,226.8,598.74,Single-ply,SBD,M
Boys,89.81,2,Dustin Hicks,Channelview,88.13,219.99,142.88,215.46,578.33,Single-ply,SBD,M
Boys,89.81,3,Jason Ramirez,Channelview,87.86,192.78,131.54,226.8,551.11,Single-ply,SBD,M
Boys,89.81,4,Trevin Sechler,Sour Lake Hardin-Jefferson,84.37,206.38,117.93,222.26,546.58,Single-ply,SBD,M
Boys,89.81,5,Roy Allen,Beaumont West Brook,89.09,219.99,117.93,204.12,542.04,Single-ply,SBD,M
Boys,89.81,6,Marcus Moody,Stafford,86.23,192.78,122.47,215.46,530.7,Single-ply,SBD,M
Boys,89.81,7,Johny Gay,Port Neches-Groves,88.45,240.4,111.13,165.56,517.1,Single-ply,SBD,M
Boys,89.81,8,Billy Pier,Beaumont West Brook,88.99,188.24,115.67,195.04,498.95,Single-ply,SBD,M
Boys,89.81,9,Matt Moore,Beaumont West Brook,88.31,188.24,111.13,195.04,494.42,Single-ply,SBD,M
Boys,89.81,10,F Beard,Vidor,85.32,199.58,129.27,163.29,492.15,Single-ply,SBD,M
Boys,89.81,11,Adam Prosperie,Bridge City,88.81,188.24,113.4,190.51,492.15,Single-ply,SBD,M
Boys,89.81,12,O Kenebrew,Beaumont Central,88.36,181.44,108.86,197.31,487.61,Single-ply,SBD,M
Boys,89.81,13,Torian Kennerson,Port Arthur Memorial,85.82,170.1,104.33,201.85,476.27,Single-ply,SBD,M
Boys,89.81,14,Lance Loviere,Port Neches-Groves,86.77,195.04,113.4,167.83,476.27,Single-ply,SBD,M
Boys,89.81,15,R. Smith,Vidor,88.95,183.7,127.01,163.29,474,Single-ply,SBD,M
Boys,89.81,16,T. Murray,Beaumont Ozen,86.82,161.03,113.4,195.04,469.47,Single-ply,SBD,M
Boys,89.81,17,Martin Keyon,Beaumont Ozen,82.64,172.37,108.86,181.44,462.66,Single-ply,SBD,M
Boys,89.81,18,Edmund Horn,Lumberton,87.77,176.9,120.2,158.76,455.86,Single-ply,SBD,M
Boys,89.81,19,Dean Whitfield,Deweyville,89.49,183.7,108.86,161.03,453.59,Single-ply,SBD,M
Boys,89.81,20,Kenneth Clark,Beaumont Ozen,82.37,145.15,102.06,181.44,428.64,Single-ply,SBD,M
Boys,89.81,21,Richard Pastorella,Nederland,88.22,161.03,95.25,172.37,428.64,Single-ply,SBD,M
Boys,89.81,22,Tyrone Graves,La Porte,87.36,156.49,104.33,161.03,421.84,Single-ply,SBD,M
Boys,89.81,23,Desmond Pickens,Beaumont West Brook,85.46,133.81,65.77,142.88,342.46,Single-ply,SBD,M
Boys,89.81,DQ,Bryceton Hughes,Beaumont West Brook,83.87,106.59,,,,Single-ply,SBD,M
Boys,89.81,DQ,Jacob Burris,Deweyville,83.37,190.51,,,,Single-ply,SBD,M
Boys,89.81,DQ,Justin Hicks,Channelview,88.13,,,,,Single-ply,SBD,M
Boys,89.81,DQ,Jakiel Tyler,Port Arthur Memorial,87.91,,,,,Single-ply,SBD,M
Boys,99.79,1,Ricky Francis,Beaumont Ozen,93.03,242.67,142.88,285.76,671.32,Single-ply,SBD,M
Boys,99.79,2,C. Hill,Vidor,99.74,226.8,136.08,201.85,564.72,Single-ply,SBD,M
Boys,99.79,3,A. Harris,Beaumont Central,97.48,181.44,129.27,233.6,544.31,Single-ply,SBD,M
Boys,99.79,4,Mason Archer,Lumberton,95.89,204.12,124.74,208.65,537.51,Single-ply,SBD,M
Boys,99.79,5,Terchan Newman,Beaumont West Brook,92.67,215.46,113.4,190.51,519.36,Single-ply,SBD,M
Boys,99.79,6,X Richard,Hamshire-Fannett,93.03,199.58,115.67,188.24,503.49,Single-ply,SBD,M
Boys,99.79,7,Kenneth Quintana,Channelview,95.93,181.44,122.47,176.9,480.81,Single-ply,SBD,M
Boys,99.79,8,Cody Robinson,Lumberton,97.79,181.44,102.06,185.97,469.47,Single-ply,SBD,M
Boys,99.79,9,Davonte Mcmillian,Port Arthur Memorial,90.49,188.24,97.52,174.63,460.4,Single-ply,SBD,M
Boys,99.79,10,Shane Wilson,Bridge City,96.52,192.78,102.06,147.42,442.25,Single-ply,SBD,M
Boys,99.79,11,William Coffman,Lumberton,95.53,142.88,72.57,142.88,358.34,Single-ply,SBD,M
Boys,99.79,12,Blake Trejo,Nederland,90.76,131.54,81.65,142.88,356.07,Single-ply,SBD,M
Boys,99.79,13,Jemi Villa,Houston Sam Houston,99.79,102.06,142.88,99.79,344.73,Single-ply,SBD,M
Boys,99.79,14,Nick Davis,Deweyville,98.84,92.99,81.65,106.59,281.23,Single-ply,SBD,M
Boys,99.79,DQ,J McCOWAN,Beaumont Central,93.08,145.15,,,,Single-ply,SBD,M
Boys,99.79,DQ,Jake Laredo,Beaumont West Brook,98.38,124.74,,,,Single-ply,SBD,M
Boys,109.77,1,Josue Toledo,Channelview,107.68,242.67,136.08,249.48,628.23,Single-ply,SBD,M
Boys,109.77,2,Matt Douglas,Beaumont West Brook,101.65,238.14,158.76,206.38,603.28,Single-ply,SBD,M
Boys,109.77,3,Sean Sparks,Lumberton,104.01,210.92,133.81,235.87,580.6,Single-ply,SBD,M
Boys,109.77,4,K Holmes,Beaumont Central,100.24,170.1,108.86,206.38,485.34,Single-ply,SBD,M
Boys,109.77,5,Shawndre Brown,Port Arthur Memorial,101.51,174.63,99.79,204.12,478.54,Single-ply,SBD,M
Boys,109.77,6,Justin Brook,Beaumont West Brook,102.29,172.37,102.06,183.7,458.13,Single-ply,SBD,M
Boys,109.77,7,Bill Kwon,Port Arthur Memorial,102.06,149.69,92.99,161.03,403.7,Single-ply,SBD,M
Boys,109.77,8,Brock Prior,Nederland,102.29,124.74,92.99,136.08,353.8,Single-ply,SBD,M
Boys,109.77,9,T Britt,Vidor,109.72,111.13,95.25,147.42,353.8,Single-ply,SBD,M
Boys,109.77,10,Zach Burkhalter,Lumberton,103.92,102.06,97.52,147.42,347,Single-ply,SBD,M
Boys,109.77,DQ,Arron Easly,Port Neches-Groves,108.82,249.48,129.27,,,Single-ply,SBD,M
Boys,109.77,DQ,Vincent Whittington,Beaumont West Brook,103.46,229.06,,,,Single-ply,SBD,M
Boys,109.77,DQ,Aaron Williams,Vidor,108.82,142.88,,,,Single-ply,SBD,M
Boys,124.74,1,Gerzain Picaz,Channelview,110.9,238.14,133.81,204.12,576.06,Single-ply,SBD,M
Boys,124.74,2,Patrick Braud,Port Neches-Groves,116.71,217.72,127.01,190.51,535.24,Single-ply,SBD,M
Boys,124.74,3,Josh Byrd,Nederland,118.3,201.85,133.81,181.44,517.1,Single-ply,SBD,M
Boys,124.74,4,Cole Ralston,La Porte,121.52,201.85,102.06,210.92,514.83,Single-ply,SBD,M
Boys,124.74,5,Glenn Smith,Port Arthur Memorial,121.06,174.63,102.06,201.85,478.54,Single-ply,SBD,M
Boys,124.74,6,Aaron Taylor,Nederland,112.9,179.17,131.54,165.56,476.27,Single-ply,SBD,M
Boys,124.74,7,Ben Parks,Port Neches-Groves,113.62,179.17,99.79,190.51,469.47,Single-ply,SBD,M
Boys,124.74,8,Ryan Marks,Port Arthur Memorial,120.75,179.17,111.13,170.1,460.4,Single-ply,SBD,M
Boys,124.74,9,A Lai,Stafford,123.97,158.76,83.91,190.51,433.18,Single-ply,SBD,M
Boys,124.74,10,Cj Brownlow,Lumberton,116.44,138.35,88.45,158.76,385.55,Single-ply,SBD,M
Boys,124.74,DQ,Jeffrey Reno,Port Arthur Memorial,121.34,,,,,Single-ply,SBD,M
Boys,124.74,DQ,Nick Bishop,Port Neches-Groves,112.63,,,,,Single-ply,SBD,M
Boys,124.74,DQ,Shomari Delaney,Port Arthur Memorial,115.35,,,,,Single-ply,SBD,M
Boys,124.74,DQ,Cassius Griffin,Port Arthur Memorial,116.26,,,,,Single-ply,SBD,M
Boys,124.74,DQ,Kenneth Milo,Port Arthur Memorial,124.65,,,,,Single-ply,SBD,M
Boys,124.74,DQ,Andy Beaumont,Bridge City,120.25,165.56,,,,Single-ply,SBD,M
Boys,124.74+,1,Revis Davis,La Porte,139.84,229.06,181.44,249.48,659.98,Single-ply,SBD,M
Boys,124.74+,2,Josh Trahan,Orange Little Cypress-Mauriceville,148.37,219.99,140.61,226.8,587.4,Single-ply,SBD,M
Boys,124.74+,3,Justin Lummus,Deweyville,136.94,215.46,149.69,204.12,569.26,Single-ply,SBD,M
Boys,124.74+,4,Jherick Campbell,Beaumont Ozen,134.44,219.99,102.06,190.51,512.56,Single-ply,SBD,M
Boys,124.74+,5,Nashawn Edwards,Beaumont Ozen,162.25,188.24,111.13,213.19,512.56,Single-ply,SBD,M
Boys,124.74+,6,Brandon Dennis,Port Arthur Memorial,133.58,188.24,129.27,179.17,496.68,Single-ply,SBD,M
Boys,124.74+,7,Lucas Mackan,Beaumont West Brook,136.26,185.97,102.06,183.7,471.74,Single-ply,SBD,M
Boys,124.74+,8,Geremi Powell,Port Arthur Memorial,135.58,158.76,133.81,158.76,451.32,Single-ply,SBD,M
Boys,124.74+,DQ,Trey Walker,Beaumont Ozen,161.03,185.97,99.79,,,Single-ply,SBD,M
Boys,124.74+,DQ,Kenneth White,Beaumont Ozen,132.63,231.33,156.49,,,Single-ply,SBD,M
Boys,124.74+,DQ,Jonathan Ned,Port Arthur Memorial,128.59,,,,,Single-ply,SBD,M
Boys,124.74+,DQ,M. Hager,Port Arthur Memorial,175.54,,,,,Single-ply,SBD,M
Boys,124.74+,DQ,Felix Aguirre,Houston Sam Houston,146.06,,,,,Single-ply,SBD,M
