Division,WeightClassKg,Place,Name,Team,BodyweightKg,Best3SquatKg,Best3BenchKg,Best3DeadliftKg,TotalKg,Equipment,Event,Sex
Boys,51.71,1,Carlos Rodriguez,Olton,51.26,124.74,61.23,136.08,322.05,Single-ply,SBD,M
Boys,51.71,2,Zach Gilbert,Lubbock Roosevelt,51.71,104.33,63.5,122.47,290.3,Single-ply,SBD,M
Boys,51.71,3,Rowdy Huffaker,Abernathy,49.44,90.72,47.63,97.52,235.87,Single-ply,SBD,M
Boys,51.71,4,Jordan Garcia,Slaton,49.44,83.91,43.09,102.06,229.06,Single-ply,SBD,M
Boys,51.71,5,Desmond Williams,Slaton,45.81,79.38,40.82,95.25,215.46,Single-ply,SBD,M
Boys,55.79,1,Philip Rocha,Slaton,54.88,129.27,70.31,145.15,344.73,Single-ply,SBD,M
Boys,55.79,2,Jose Perez #6,Sundown,52.62,97.52,52.16,120.2,269.89,Single-ply,SBD,M
Boys,59.87,1,Gavin Schniers,Slaton,57.61,120.2,74.84,158.76,353.8,Single-ply,SBD,M
Boys,59.87,2,Seth Salinas,Olton,59.87,108.86,68.04,149.69,326.59,Single-ply,SBD,M
Boys,59.87,3,Santos Yanez,Slaton,58.51,115.67,70.31,138.35,324.32,Single-ply,SBD,M
Boys,59.87,4,Jesus Garza,Brownfield,58.97,124.74,61.23,124.74,310.71,Single-ply,SBD,M
Boys,59.87,5,Donovan Gomez,Lubbock Roosevelt,59.87,111.13,72.57,124.74,308.44,Single-ply,SBD,M
Boys,59.87,6,Alfredo Martinez,Tahoka,57.15,106.59,52.16,124.74,283.5,Single-ply,SBD,M
Boys,59.87,DQ,Mason Walker,Tahoka,59.42,61.23,,,,Single-ply,SBD,M
Boys,59.87,DQ,Peyton Lowdermilk,Tahoka,59.87,102.06,,,,Single-ply,SBD,M
Boys,67.13,1,JD Rojas,Lubbock Roosevelt,63.5,167.83,120.2,197.31,485.34,Single-ply,SBD,M
Boys,67.13,2,Johnny Hernandez,Sundown,63.05,204.12,90.72,188.24,483.08,Single-ply,SBD,M
Boys,67.13,3,Hadley Reynolds,Tahoka,64.86,167.83,97.52,149.69,415.04,Single-ply,SBD,M
Boys,67.13,4,Ray Ortega,Brownfield,63.5,158.76,90.72,142.88,392.36,Single-ply,SBD,M
Boys,67.13,5,Marco Godinez,Sudan,67.13,145.15,90.72,145.15,381.02,Single-ply,SBD,M
Boys,67.13,6,Hondo Hinojosa,Sundown,66.68,140.61,72.57,151.95,365.14,Single-ply,SBD,M
Boys,67.13,7,Derek Tovar,Sudan,62.14,127.01,90.72,136.08,353.8,Single-ply,SBD,M
Boys,67.13,8,Matthew Diaz,Tahoka,67.13,129.27,70.31,145.15,344.73,Single-ply,SBD,M
Boys,67.13,9,Zach Mendoza,Abernathy,62.6,136.08,74.84,124.74,335.66,Single-ply,SBD,M
Boys,67.13,10,George Flores,Abernathy,62.6,113.4,74.84,129.27,317.51,Single-ply,SBD,M
Boys,67.13,11,Deshawn Tyler,Lubbock Roosevelt,63.05,115.67,65.77,124.74,306.17,Single-ply,SBD,M
Boys,67.13,12,Brandon Ureste,Abernathy,60.33,108.86,61.23,117.93,288.03,Single-ply,SBD,M
Boys,67.13,13,Abel Tinajero,Sudan,65.77,99.79,65.77,102.06,267.62,Single-ply,SBD,M
Boys,67.13,14,Jacob Quintanilla,Brownfield,67.13,77.11,74.84,115.67,267.62,Single-ply,SBD,M
Boys,67.13,DQ,Bryan Valencia,Olton,67.13,138.35,,,,Single-ply,SBD,M
Boys,74.84,1,Blake Allen,Lubbock Roosevelt,73.94,165.56,104.33,199.58,469.47,Single-ply,SBD,M
Boys,74.84,2,Jayton Grisham,Abernathy,74.84,176.9,102.06,176.9,455.86,Single-ply,SBD,M
Boys,74.84,3,Ethan Donahoo,Lubbock Roosevelt,69.4,136.08,120.2,161.03,417.3,Single-ply,SBD,M
Boys,74.84,4,Noah Baker,Sudan,70.76,154.22,83.91,172.37,410.5,Single-ply,SBD,M
Boys,74.84,5,Parker Redwine,Abernathy,73.48,163.29,81.65,165.56,410.5,Single-ply,SBD,M
Boys,74.84,6,Caleb Scott,Lubbock Roosevelt,71.67,142.88,77.11,158.76,378.75,Single-ply,SBD,M
Boys,74.84,7,Xavier Rosales,Olton,70.76,138.35,86.18,129.27,353.8,Single-ply,SBD,M
Boys,74.84,8,Zach Gonzales,Sudan,74.84,117.93,72.57,136.08,326.59,Single-ply,SBD,M
Boys,74.84,9,Daniel Tinajero,Sudan,68.04,117.93,77.11,127.01,322.05,Single-ply,SBD,M
Boys,74.84,10,Seth Rennels,Slaton,68.04,102.06,72.57,131.54,306.17,Single-ply,SBD,M
Boys,74.84,11,Josh Flores,Slaton,74.39,102.06,61.23,140.61,303.91,Single-ply,SBD,M
Boys,74.84,12,Dylan Holt,Lubbock Roosevelt,68.04,104.33,72.57,111.13,288.03,Single-ply,SBD,M
Boys,74.84,DQ,Collin Elam,Sundown,74.84,,,,,Single-ply,SBD,M
Boys,82.1,1,Braxton Creager,Slaton,82.1,204.12,113.4,215.46,532.97,Single-ply,SBD,M
Boys,82.1,2,Mark Pando,Abernathy,78.02,199.58,120.2,210.92,530.7,Single-ply,SBD,M
Boys,82.1,3,Steven Cabrera,Sundown,75.3,190.51,120.2,174.63,485.34,Single-ply,SBD,M
Boys,82.1,4,John Quinonez,Tahoka,81.65,181.44,92.99,190.51,464.93,Single-ply,SBD,M
Boys,82.1,5,Jeremy L Hernandez,Sundown,81.19,167.83,92.99,188.24,449.06,Single-ply,SBD,M
Boys,82.1,6,David DeLaRosa,Olton,78.02,136.08,92.99,190.51,419.57,Single-ply,SBD,M
Boys,82.1,7,Justyn McCarty,Tahoka,81.19,147.42,97.52,149.69,394.63,Single-ply,SBD,M
Boys,82.1,8,Aiden Jumper,Abernathy,79.83,149.69,81.65,140.61,371.95,Single-ply,SBD,M
Boys,82.1,9,Brody Black,Sundown,81.65,136.08,83.91,149.69,369.68,Single-ply,SBD,M
Boys,82.1,10,Steven Cortez,Abernathy,79.83,102.06,61.23,99.79,263.08,Single-ply,SBD,M
Boys,89.81,1,Ladd Wilkes,Sundown,88,215.46,136.08,215.46,566.99,Single-ply,SBD,M
Boys,89.81,2,Nathan Sullivan,Abernathy,87.09,208.65,113.4,192.78,514.83,Single-ply,SBD,M
Boys,89.81,3,Nathan Besler,Brownfield,88,170.1,122.47,204.12,496.68,Single-ply,SBD,M
Boys,89.81,4,Noah Hernandez,Abernathy,88.9,188.24,102.06,190.51,480.81,Single-ply,SBD,M
Boys,89.81,5,Andy Canales,Lubbock Roosevelt,83.91,165.56,113.4,181.44,460.4,Single-ply,SBD,M
Boys,89.81,6,Esaiah Rodriguez,Lubbock Roosevelt,84.82,181.44,111.13,158.76,451.32,Single-ply,SBD,M
Boys,89.81,7,Brayden Castillion,Tahoka,86.18,165.56,95.25,174.63,435.45,Single-ply,SBD,M
Boys,89.81,8,Brit Lockaby,Tahoka,83.91,151.95,97.52,156.49,405.97,Single-ply,SBD,M
Boys,89.81,9,David Cox,Sundown,82.55,122.47,77.11,165.56,365.14,Single-ply,SBD,M
Boys,89.81,10,Austin Bramlett,Slaton,83.91,129.27,74.84,161.03,365.14,Single-ply,SBD,M
Boys,99.79,1,Xavier Garza,Sundown,97.07,290.3,158.76,265.35,714.41,Single-ply,SBD,M
Boys,99.79,2,Isaia Montgomery,Lubbock Roosevelt,93.89,213.19,136.08,215.46,564.72,Single-ply,SBD,M
Boys,99.79,3,Bryson Kitchens,Abernathy,97.98,213.19,136.08,213.19,562.45,Single-ply,SBD,M
Boys,99.79,4,Harley Simpson,Slaton,98.43,251.74,122.47,183.7,557.92,Single-ply,SBD,M
Boys,99.79,5,Jacob Jalomo,Olton,99.79,204.12,127.01,213.19,544.31,Single-ply,SBD,M
Boys,99.79,6,Diego Garcia,Brownfield,94.8,181.44,111.13,208.65,501.22,Single-ply,SBD,M
Boys,99.79,7,Ruben Quinonez,Tahoka,95.25,199.58,115.67,170.1,485.34,Single-ply,SBD,M
Boys,99.79,8,Blake Harmon,Tahoka,99.34,142.88,83.91,142.88,369.68,Single-ply,SBD,M
Boys,109.77,1,Roy Rodriguez,Sundown,100.24,226.8,136.08,226.8,589.67,Single-ply,SBD,M
Boys,109.77,2,EJ Salinas,Abernathy,101.6,192.78,115.67,172.37,480.81,Single-ply,SBD,M
Boys,109.77,3,Ian Ponce,Abernathy,104.78,206.38,102.06,165.56,474,Single-ply,SBD,M
Boys,109.77,4,Jonah Lopez,Abernathy,107.5,176.9,104.33,156.49,437.72,Single-ply,SBD,M
Boys,109.77,5,Israel Rodriguez,Slaton,104.33,181.44,72.57,174.63,428.64,Single-ply,SBD,M
Boys,109.77,6,Joseph Trevino,Brownfield,104.78,158.76,83.91,161.03,403.7,Single-ply,SBD,M
Boys,109.77,7,Isaiah Montes,Sudan,107.05,136.08,92.99,170.1,399.16,Single-ply,SBD,M
Boys,124.74,1,Jet Grant,Sundown,118.84,226.8,167.83,213.19,607.81,Single-ply,SBD,M
Boys,124.74,2,Daniel Coronado,Olton,122.02,158.76,131.54,181.44,471.74,Single-ply,SBD,M
Boys,124.74,3,Oscar Aguilar,Lubbock Roosevelt,119.75,170.1,117.93,165.56,453.59,Single-ply,SBD,M
Boys,124.74,4,Julian Rodriguez,Tahoka,113.4,181.44,90.72,149.69,421.84,Single-ply,SBD,M
Boys,124.74+,1,Bull Smith,Sundown,131.54,181.44,147.42,226.8,555.65,Single-ply,SBD,M
Boys,124.74+,2,Alek Garcia,Slaton,162.84,233.6,99.79,222.26,555.65,Single-ply,SBD,M
Boys,124.74+,3,Francisco Saenz,Olton,133.81,197.31,113.4,208.65,519.36,Single-ply,SBD,M
Boys,124.74+,4,Cristian Rivera,Olton,138.8,226.8,92.99,188.24,508.02,Single-ply,SBD,M
Boys,124.74+,5,Tony Garcia,Tahoka,165.56,199.58,102.06,192.78,494.42,Single-ply,SBD,M
Boys,124.74+,6,Kevin Shoemaker,Lubbock Roosevelt,128.82,181.44,113.4,170.1,464.93,Single-ply,SBD,M
Boys,124.74+,7,Jayden Edwards,Lubbock Roosevelt,131.54,165.56,108.86,183.7,458.13,Single-ply,SBD,M
Boys,124.74+,8,Josh Salas,Slaton,139.25,165.56,90.72,172.37,428.64,Single-ply,SBD,M
Boys,124.74+,9,Victor Soto,Slaton,138.35,138.35,92.99,165.56,396.89,Single-ply,SBD,M
Boys,124.74+,10,Bobby Johnson,Brownfield,127.01,61.23,70.31,158.76,290.3,Single-ply,SBD,M
