Division,WeightClassKg,Place,Name,Team,BodyweightKg,Best3SquatKg,Best3BenchKg,Best3DeadliftKg,TotalKg,Equipment,Event,Sex
Boys,51.71,1,Edward Hernandez,Eldorado,51.17,165.56,77.11,149.69,392.36,Single-ply,SBD,M
Boys,51.71,2,Reid Clanton,Midland Greenwood,51.53,129.27,77.11,147.42,353.8,Single-ply,SBD,M
Boys,51.71,3,Jonathan Estes,San Angelo Grape Creek,48.94,49.9,40.82,81.65,172.37,Single-ply,SBD,M
Boys,51.71,DQ,Trevor Fisher,San Angelo Grape Creek,49.21,58.97,,,,Single-ply,SBD,M
Boys,51.71,DQ,Juan Mejia,San Angelo Grape Creek,51.62,106.59,,,,Single-ply,SBD,M
Boys,55.79,1,Jesse Ramirez,San Angelo Lake View,55.52,138.35,86.18,163.29,387.82,Single-ply,SBD,M
Boys,55.79,2,Gunnar McNeill,San Angelo Grape Creek,55.7,145.15,68.04,145.15,358.34,Single-ply,SBD,M
Boys,55.79,3,Taylor White,San Angelo Grape Creek,55.7,117.93,61.23,133.81,312.98,Single-ply,SBD,M
Boys,55.79,4,Jacob Shultz,San Angelo Grape Creek,55.75,117.93,58.97,133.81,310.71,Single-ply,SBD,M
Boys,55.79,5,Brandon Rhea,Andrews,55.25,106.59,65.77,136.08,308.44,Single-ply,SBD,M
Boys,55.79,6,Nate Martinez,Loraine,54.98,106.59,68.04,131.54,306.17,Single-ply,SBD,M
Boys,55.79,7,Matt Anderson,Coleman,54.25,108.86,61.23,129.27,299.37,Single-ply,SBD,M
Boys,55.79,8,Henry Pulido,Rankin,53.8,104.33,52.16,117.93,274.42,Single-ply,SBD,M
Boys,55.79,9,Jordan Wilson,Coahoma,53.61,88.45,54.43,99.79,242.67,Single-ply,SBD,M
Boys,55.79,10,Preston Perez,Midland Greenwood,54.34,61.23,61.23,74.84,197.31,Single-ply,SBD,M
Boys,59.87,1,Ryan Hurst,San Angelo Grape Creek,59.19,204.12,81.65,204.12,489.88,Single-ply,SBD,M
Boys,59.87,2,Michael Vargas,Ozona,58.88,172.37,86.18,174.63,433.18,Single-ply,SBD,M
Boys,59.87,3,Josh Martinez,Midland Greenwood,59.24,145.15,83.91,165.56,394.63,Single-ply,SBD,M
Boys,59.87,4,Taylor Baum,Coleman,59.6,145.15,90.72,140.61,376.48,Single-ply,SBD,M
Boys,67.13,5,Chris McPhereson,Coahoma,60.06,117.93,83.91,156.49,358.34,Single-ply,SBD,M
Boys,59.87,6,Aaron Kelly,San Angelo Grape Creek,59.15,115.67,81.65,151.95,349.27,Single-ply,SBD,M
Boys,59.87,7,Cole Byerly,Midland Greenwood,56.15,124.74,79.38,133.81,337.93,Single-ply,SBD,M
Boys,59.87,8,Trenton Crenshaw,Coahoma,57.33,111.13,70.31,136.08,317.51,Single-ply,SBD,M
Boys,59.87,9,Danny Muro,San Angelo Lake View,57.97,97.52,56.7,124.74,278.96,Single-ply,SBD,M
Boys,59.87,10,Manuel Vazquez,Coleman,57.97,90.72,52.16,127.01,269.89,Single-ply,SBD,M
Boys,67.13,11,Till Siebert,Loraine,60.06,86.18,54.43,129.27,269.89,Single-ply,SBD,M
Boys,67.13,1,Austin Martinez,Mertzon Irion County,60.96,197.31,115.67,185.97,498.95,Single-ply,SBD,M
Boys,67.13,2,John Hernandez,San Angelo Lake View,66.68,170.1,102.06,199.58,471.74,Single-ply,SBD,M
Boys,67.13,3,Luis Rangel,Ballinger,66.95,165.56,104.33,181.44,451.32,Single-ply,SBD,M
Boys,67.13,4,Alex Valdez,Andrews,66.86,151.95,97.52,174.63,424.11,Single-ply,SBD,M
Boys,67.13,5,Cody Ortiz,Big Lake Reagan County,67.13,172.37,90.72,158.76,421.84,Single-ply,SBD,M
Boys,67.13,6,Joey Prieto,Andrews,65.05,172.37,79.38,163.29,415.04,Single-ply,SBD,M
Boys,67.13,7,Joaquin Prieto,San Angelo Central,62.14,170.1,102.06,136.08,408.23,Single-ply,SBD,M
Boys,67.13,8,Ryan Kennedy,Ozona,62.87,161.03,79.38,161.03,401.43,Single-ply,SBD,M
Boys,67.13,9,Rodrigo Saldana,San Angelo Grape Creek,66.86,136.08,83.91,181.44,401.43,Single-ply,SBD,M
Boys,74.84,10,Hunter Enloe,Tuscola Jim Ned,67.22,145.15,92.99,154.22,392.36,Single-ply,SBD,M
Boys,67.13,11,Victor Muro,San Angelo Lake View,63.96,129.27,92.99,167.83,390.09,Single-ply,SBD,M
Boys,74.84,12,Jose Armendariz,San Angelo Grape Creek,67.22,154.22,74.84,154.22,383.29,Single-ply,SBD,M
Boys,67.13,13,Tim Garza,Loraine,65.95,131.54,83.91,151.95,367.41,Single-ply,SBD,M
Boys,67.13,14,Stephen Medrano,San Angelo Grape Creek,65.95,145.15,65.77,151.95,362.87,Single-ply,SBD,M
Boys,67.13,15,Ethan Trotter,Andrews,65.77,142.88,81.65,136.08,360.61,Single-ply,SBD,M
Boys,67.13,16,Jose Hernandez,Midland Greenwood,60.15,124.74,70.31,154.22,349.27,Single-ply,SBD,M
Boys,67.13,17,Jared Trubenstein,San Angelo Lake View,66.86,120.2,68.04,147.42,335.66,Single-ply,SBD,M
Boys,67.13,18,Willie Collins,Ballinger,61.78,136.08,72.57,124.74,333.39,Single-ply,SBD,M
Boys,67.13,19,Randall High,San Angelo Lake View,61.6,97.52,52.16,113.4,263.08,Single-ply,SBD,M
Boys,67.13,20,Damian Cate,Coahoma,66.95,106.59,49.9,102.06,258.55,Single-ply,SBD,M
Boys,67.13,DQ,Jeff Reese,Tuscola Jim Ned,66.13,,,,,Single-ply,SBD,M
Boys,74.84,1,Justin Coker,Coahoma,73.75,213.19,129.27,204.12,546.58,Single-ply,SBD,M
Boys,74.84,2,Caleb Saldavar,San Angelo Grape Creek,70.31,170.1,97.52,204.12,471.74,Single-ply,SBD,M
Boys,74.84,3,Devon Hoelscher,Ballinger,73.94,181.44,113.4,176.9,471.74,Single-ply,SBD,M
Boys,74.84,4,Angel Moreno,San Angelo Lake View,71.03,188.24,106.59,174.63,469.47,Single-ply,SBD,M
Boys,74.84,5,Maurico Valdez,San Angelo Lake View,74.66,172.37,97.52,188.24,458.13,Single-ply,SBD,M
Boys,74.84,6,Richerd Rushenberg,San Angelo Grape Creek,72.76,179.17,88.45,181.44,449.06,Single-ply,SBD,M
Boys,74.84,7,Joe Macias,Andrews,72.57,165.56,102.06,167.83,435.45,Single-ply,SBD,M
Boys,82.1,8,George Silva,San Angelo Lake View,75.02,154.22,81.65,188.24,424.11,Single-ply,SBD,M
Boys,74.84,9,Trenton Gardner,Big Lake Reagan County,74.84,158.76,88.45,172.37,419.57,Single-ply,SBD,M
Boys,74.84,10,Caleb Drake,San Angelo Lake View,68.31,147.42,86.18,172.37,405.97,Single-ply,SBD,M
Boys,74.84,11,Brent Thompson,Andrews,74.21,158.76,88.45,156.49,403.7,Single-ply,SBD,M
Boys,74.84,12,Adrian Revell,San Angelo Grape Creek,74.48,149.69,92.99,158.76,401.43,Single-ply,SBD,M
Boys,74.84,13,Eli Peterson,San Angelo Lake View,68.58,145.15,90.72,158.76,394.63,Single-ply,SBD,M
Boys,74.84,14,Joaquin Rivero,San Angelo Central,74.57,151.95,88.45,142.88,383.29,Single-ply,SBD,M
Boys,74.84,15,Colton Honea,Tuscola Jim Ned,68.86,138.35,90.72,149.69,378.75,Single-ply,SBD,M
Boys,74.84,16,Morgan Smith,Tuscola Jim Ned,72.94,140.61,88.45,149.69,378.75,Single-ply,SBD,M
Boys,82.1,17,Kevin O'Dell,San Angelo Grape Creek,74.93,133.81,79.38,156.49,369.68,Single-ply,SBD,M
Boys,74.84,18,Brackston Buck,Midland Greenwood,72.57,140.61,77.11,138.35,356.07,Single-ply,SBD,M
Boys,74.84,19,Jalin Gilbert,Coahoma,71.85,122.47,74.84,151.95,349.27,Single-ply,SBD,M
Boys,74.84,20,Carson Edmonds,Loraine,68.22,86.18,74.84,147.42,308.44,Single-ply,SBD,M
Boys,74.84,21,Calvin Gibbs,Coahoma,68.76,120.2,74.84,113.4,308.44,Single-ply,SBD,M
Boys,74.84,22,Vicente Urbina,Andrews,71.67,113.4,56.7,106.59,276.69,Single-ply,SBD,M
Boys,74.84,23,Francisco Hernandez,Coahoma,68.04,58.97,43.09,65.77,167.83,Single-ply,SBD,M
Boys,82.1,DQ,Fernando Saucedo,Big Lake Reagan County,74.93,,,,,Single-ply,SBD,M
Boys,74.84,DQ,Luis Sanchez,Eldorado,74.03,156.49,,,,Single-ply,SBD,M
Boys,74.84,DQ,Justin Hensley,Coleman,71.12,136.08,,,,Single-ply,SBD,M
Boys,74.84,DQ,Kenny Gonzales,San Angelo Lake View,70.13,142.88,,,,Single-ply,SBD,M
Boys,74.84,DQ,Dylan Johnston,Tuscola Jim Ned,68.22,,,,,Single-ply,SBD,M
Boys,74.84,DQ,Aaron Castillo,Rankin,72.85,,,,,Single-ply,SBD,M
Boys,82.1,1,Peyton Rodriguez,Coahoma,82.01,217.72,131.54,208.65,557.92,Single-ply,SBD,M
Boys,82.1,2,Jesse Daniels,Ballinger,77.93,204.12,122.47,210.92,537.51,Single-ply,SBD,M
Boys,89.81,3,Joseph Melendez,Coahoma,82.28,192.78,102.06,192.78,487.61,Single-ply,SBD,M
Boys,89.81,4,Rickey Harcrow,Midland Greenwood,82.19,167.83,99.79,181.44,449.06,Single-ply,SBD,M
Boys,82.1,5,Dustin Rea,Midland Greenwood,76.11,154.22,104.33,181.44,439.98,Single-ply,SBD,M
Boys,82.1,6,Kevin Revell,San Angelo Grape Creek,80.97,154.22,86.18,195.04,435.45,Single-ply,SBD,M
Boys,82.1,7,Josh Neri,Mertzon Irion County,76.2,145.15,97.52,179.17,421.84,Single-ply,SBD,M
Boys,82.1,8,Branson Kennedy,Coahoma,77.02,158.76,81.65,179.17,419.57,Single-ply,SBD,M
Boys,82.1,9,Adrian Castillo,Andrews,81.47,158.76,83.91,176.9,419.57,Single-ply,SBD,M
Boys,82.1,10,Pj Hammonds,Coleman,76.11,142.88,83.91,172.37,399.16,Single-ply,SBD,M
Boys,89.81,11,Hunter Gibson,Tuscola Jim Ned,82.28,145.15,83.91,158.76,387.82,Single-ply,SBD,M
Boys,82.1,12,Daniel Lombrana,Ozona,80.92,147.42,83.91,147.42,378.75,Single-ply,SBD,M
Boys,82.1,13,Caleb Allison,San Angelo Lake View,78.29,124.74,79.38,172.37,376.48,Single-ply,SBD,M
Boys,82.1,14,Braden Smith,Tuscola Jim Ned,75.39,142.88,83.91,136.08,362.87,Single-ply,SBD,M
Boys,82.1,15,Cody Phillips,Rankin,78.65,113.4,65.77,136.08,315.25,Single-ply,SBD,M
Boys,89.81,1,Marcos Rodarte,San Angelo Grape Creek,88.22,238.14,102.06,231.33,571.53,Single-ply,SBD,M
Boys,89.81,2,Ryan Thomas,Rankin,89.72,215.46,133.81,197.31,546.58,Single-ply,SBD,M
Boys,89.81,3,Azel Alvidrez,Andrews,88.81,188.24,122.47,201.85,512.56,Single-ply,SBD,M
Boys,89.81,4,Auggie Woodruff,Ballinger,88,213.19,122.47,172.37,508.02,Single-ply,SBD,M
Boys,99.79,5,Eric Thomas,Ballinger,89.99,195.04,113.4,197.31,505.76,Single-ply,SBD,M
Boys,89.81,6,Angel Barrios,Coleman,89.72,188.24,138.35,170.1,496.68,Single-ply,SBD,M
Boys,89.81,7,Hector Reyes,Eldorado,87.09,176.9,95.25,199.58,471.74,Single-ply,SBD,M
Boys,89.81,8,Derek Fitzpatrick,Midland Greenwood,83.19,179.17,97.52,172.37,449.06,Single-ply,SBD,M
Boys,89.81,9,Brandon Dominguez,Ozona,84.55,181.44,90.72,172.37,444.52,Single-ply,SBD,M
Boys,89.81,10,Taylor Hunt,San Angelo Central,89.81,170.1,99.79,174.63,444.52,Single-ply,SBD,M
Boys,89.81,11,Isaac Saucedo,Andrews,85.73,140.61,106.59,142.88,390.09,Single-ply,SBD,M
Boys,89.81,12,Wesley Haman,San Angelo Grape Creek,89.63,138.35,99.79,133.81,371.95,Single-ply,SBD,M
Boys,89.81,13,James Stamper,Coleman,87.82,106.59,79.38,147.42,333.39,Single-ply,SBD,M
Boys,99.79,1,Shelton Zarate,Coleman,97.43,213.19,133.81,204.12,551.11,Single-ply,SBD,M
Boys,99.79,2,Charlie Thomas,Coleman,97.7,192.78,124.74,217.72,535.24,Single-ply,SBD,M
Boys,99.79,3,Jose Gallegos,Ballinger,99.61,199.58,122.47,210.92,532.97,Single-ply,SBD,M
Boys,99.79,4,Matt Garcia,Mertzon Irion County,92.44,185.97,129.27,199.58,514.83,Single-ply,SBD,M
Boys,99.79,5,Hazael Damian,Ozona,95.62,183.7,97.52,192.78,474,Single-ply,SBD,M
Boys,99.79,6,Eldon Niblett,Midland Greenwood,96.62,195.04,102.06,161.03,458.13,Single-ply,SBD,M
Boys,99.79,7,Josh Smith,San Angelo Lake View,96.8,181.44,97.52,176.9,455.86,Single-ply,SBD,M
Boys,99.79,8,Jacob Nino,San Angelo Central,97.52,172.37,129.27,154.22,455.86,Single-ply,SBD,M
Boys,99.79,9,Daulton Allen,Coleman,92.26,172.37,106.59,167.83,446.79,Single-ply,SBD,M
Boys,99.79,10,Alejandro Dominguez,Eldorado,97.16,151.95,92.99,199.58,444.52,Single-ply,SBD,M
Boys,99.79,11,Rigo Rodriguez,Ozona,94.98,183.7,86.18,156.49,426.38,Single-ply,SBD,M
Boys,99.79,12,Zac Smurphat,Tuscola Jim Ned,90.26,158.76,102.06,158.76,419.57,Single-ply,SBD,M
Boys,99.79,13,Dustin Smith,Midland Greenwood,98.61,131.54,70.31,161.03,362.87,Single-ply,SBD,M
Boys,99.79,14,Fabian Rondan,Andrews,93.98,136.08,81.65,140.61,358.34,Single-ply,SBD,M
Boys,99.79,15,Nathan Hill,Rankin,95.07,145.15,77.11,131.54,353.8,Single-ply,SBD,M
Boys,99.79,16,Emilio Mendez,Ozona,91.26,115.67,74.84,120.2,310.71,Single-ply,SBD,M
Boys,99.79,DQ,Aj Ramos,Ozona,94.17,136.08,,,,Single-ply,SBD,M
Boys,109.77,DQ,Tevin Brown,San Angelo Lake View,99.97,,,,,Single-ply,SBD,M
Boys,109.77,1,Jordan Stokes,Coahoma,100.15,226.8,142.88,247.21,616.89,Single-ply,SBD,M
Boys,109.77,2,Shaquille Walters,Midland Greenwood,104.42,231.33,129.27,238.14,598.74,Single-ply,SBD,M
Boys,109.77,3,Sterling Strickland,San Angelo Central,106.23,226.8,129.27,190.51,546.58,Single-ply,SBD,M
Boys,109.77,4,Rudy Brito,Coahoma,109.41,213.19,108.86,181.44,503.49,Single-ply,SBD,M
Boys,109.77,5,Zak Walton,Coahoma,107.86,172.37,108.86,181.44,462.66,Single-ply,SBD,M
Boys,109.77,6,Dax Cave,Midland Greenwood,108.14,176.9,79.38,161.03,417.3,Single-ply,SBD,M
Boys,109.77,DQ,Joseph Brooks,San Angelo Central,108.32,,,,,Single-ply,SBD,M
Boys,109.77,DQ,Billy Jones,Tuscola Jim Ned,108.32,,,,,Single-ply,SBD,M
Boys,124.74,1,Ricky Ciuba,Mertzon Irion County,119.29,272.16,165.56,249.48,687.19,Single-ply,SBD,M
Boys,124.74,2,Riley Woodruff,Ballinger,110.04,254.01,117.93,231.33,603.28,Single-ply,SBD,M
Boys,124.74,3,Christian Delgado,San Angelo Lake View,122.2,215.46,120.2,188.24,523.9,Single-ply,SBD,M
Boys,124.74,4,Brandon Lopez,San Angelo Lake View,113.22,208.65,120.2,179.17,508.02,Single-ply,SBD,M
Boys,124.74,5,Conner Willis,Tuscola Jim Ned,123.2,197.31,115.67,181.44,494.42,Single-ply,SBD,M
Boys,124.74,6,Daniel Ramirez,San Angelo Lake View,120.75,170.1,108.86,195.04,474,Single-ply,SBD,M
Boys,124.74,DQ,Dustin Fontana,Coahoma,114.21,224.53,136.08,,,Single-ply,SBD,M
Boys,124.74,DQ,Angel Aguilera,Big Lake Reagan County,112.22,247.21,,,,Single-ply,SBD,M
Boys,124.74+,1,Bowdy Thompson,San Angelo Lake View,163.38,267.62,163.29,247.21,678.12,Single-ply,SBD,M
Boys,124.74+,2,Hayden Vinson,San Angelo Central,136.8,226.8,120.2,233.6,580.6,Single-ply,SBD,M
Boys,124.74+,3,Caleb Wrinkle,Rankin,128.09,208.65,131.54,231.33,571.53,Single-ply,SBD,M
Boys,124.74+,4,Dj Schlather,San Angelo Lake View,133.08,215.46,122.47,195.04,532.97,Single-ply,SBD,M
Boys,124.74+,5,Max Rivero,San Angelo Central,136.71,219.99,127.01,181.44,528.44,Single-ply,SBD,M
