Division,WeightClassKg,Place,Name,Team,BodyweightKg,Best3SquatKg,Best3BenchKg,Best3DeadliftKg,TotalKg,Equipment,Event,Sex
Boys,51.71,1,Philip Alvarado,Blanco,51.71,117.93,79.38,136.08,333.39,Single-ply,SBD,M
Boys,55.79,1,Julio Ramirez,Comal Canyon,54.43,158.76,79.38,158.76,396.89,Single-ply,SBD,M
Boys,55.79,2,Chirs Lopez,Three Rivers,53.89,102.06,58.97,111.13,272.16,Single-ply,SBD,M
Boys,59.87,1,Mario Cano,Pleasanton,59.6,124.74,77.11,151.95,353.8,Single-ply,SBD,M
Boys,59.87,DQ,Weston Huff,Three Rivers,59.87,77.11,,,,Single-ply,SBD,M
Boys,67.13,1,Albert Terrazas,San Antonio Southside,62.87,131.54,83.91,142.88,358.34,Single-ply,SBD,M
Boys,67.13,2,Tyler Gould,Pleasanton,63.68,127.01,72.57,145.15,344.73,Single-ply,SBD,M
Boys,67.13,3,Charlie Johnston,Three Rivers,66.32,102.06,81.65,138.35,322.05,Single-ply,SBD,M
Boys,67.13,4,Marcus Cruz,Three Rivers,61.51,113.4,61.23,136.08,310.71,Single-ply,SBD,M
Boys,67.13,5,Harley Garcia,Karnes City,64.14,97.52,63.5,122.47,283.5,Single-ply,SBD,M
Boys,67.13,6,Coleman Williams,Karnes City,67.04,102.06,56.7,113.4,272.16,Single-ply,SBD,M
Boys,67.13,7,Leonard Barrientes,San Antonio Kennedy,66.41,72.57,61.23,102.06,235.87,Single-ply,SBD,M
Boys,67.13,DQ,Brandon Hand,Comal Canyon,67.13,,,,,Single-ply,SBD,M
Boys,67.13,DQ,Collin Lybarger,Karnes City,66.77,,,,,Single-ply,SBD,M
Boys,74.84,1,Randall Saenz,Three Rivers,69.4,167.83,90.72,167.83,426.38,Single-ply,SBD,M
Boys,82.1,2,Matthew Avalos,San Antonio Kennedy,75.02,149.69,97.52,174.63,421.84,Single-ply,SBD,M
Boys,74.84,3,Alex Juarez,Blanco,70.76,158.76,92.99,158.76,410.5,Single-ply,SBD,M
Boys,74.84,4,Miguel Cano,Pleasanton,73.12,149.69,90.72,161.03,401.43,Single-ply,SBD,M
Boys,74.84,5,Jeremy Del Toro,San Antonio Kennedy,68.49,142.88,72.57,165.56,381.02,Single-ply,SBD,M
Boys,74.84,6,Zenon Sanches,Three Rivers,70.58,136.08,88.45,151.95,376.48,Single-ply,SBD,M
Boys,74.84,7,Jake Breeding,Blanco,73.94,136.08,77.11,147.42,360.61,Single-ply,SBD,M
Boys,74.84,8,Justin Faulkner,Comfort,69.85,124.74,83.91,136.08,344.73,Single-ply,SBD,M
Boys,74.84,9,Ryan Schulmeier,San Antonio Southside,70.31,108.86,74.84,133.81,317.51,Single-ply,SBD,M
Boys,74.84,10,Pedro Aguila,Comfort,73.66,117.93,77.11,120.2,315.25,Single-ply,SBD,M
Boys,74.84,11,Caleb Lozano,Comfort,69.94,95.25,65.77,138.35,299.37,Single-ply,SBD,M
Boys,74.84,DQ,Devin Lopez,San Antonio Kennedy,74.84,,,,,Single-ply,SBD,M
Boys,74.84,DQ,Terrance Salazar,Pleasanton,74.84,,,,,Single-ply,SBD,M
Boys,74.84,DQ,Keller Hughes,Three Rivers,74.84,,,,,Single-ply,SBD,M
Boys,74.84,DQ,Adam Romero,Three Rivers,74.84,,,,,Single-ply,SBD,M
Boys,82.1,1,Lonnie Overturf,Comal Canyon,76.29,242.67,188.24,247.21,678.12,Single-ply,SBD,M
Boys,82.1,2,AJ Rice,Comal Canyon,79.11,161.03,104.33,181.44,446.79,Single-ply,SBD,M
Boys,82.1,3,Nicholas Villareal,Comal Canyon,80.1,147.42,106.59,188.24,442.25,Single-ply,SBD,M
Boys,89.81,4,Hagan Johnston,Three Rivers,82.19,142.88,68.04,147.42,358.34,Single-ply,SBD,M
Boys,82.1,5,Marco Hernandez,Three Rivers,76.29,133.81,70.31,147.42,351.53,Single-ply,SBD,M
Boys,82.1,6,Omar Guadarrama,San Antonio Southside,80.2,206.38,113.4,,319.78,Single-ply,SB,M
Boys,82.1,DQ,Thomas Trevino,Pleasanton,82.1,,,,,Single-ply,SB,M
Boys,82.1,DQ,Sam DeFazio,Comal Canyon,82.1,,,,,Single-ply,SB,M
Boys,82.1,DQ,Elias Estrada,Karnes City,82.1,,,,,Single-ply,SB,M
Boys,89.81,1,Jefferey Moreno,Comal Canyon,85.28,272.16,170.1,272.16,714.41,Single-ply,SBD,M
Boys,89.81,2,Mason LeBlanc,Blanco,83.46,204.12,113.4,201.85,519.36,Single-ply,SBD,M
Boys,89.81,3,Bryan Brecka,Blanco,88,138.35,95.25,142.88,376.48,Single-ply,SBD,M
Boys,99.79,1,Modey Sanchez,San Antonio Southside,94.62,197.31,142.88,183.7,523.9,Single-ply,SBD,M
Boys,99.79,2,Chris Barnett,Blanco,93.44,183.7,113.4,190.51,487.61,Single-ply,SBD,M
Boys,99.79,3,David Moyet,San Antonio Southside,95.89,204.12,108.86,165.56,478.54,Single-ply,SBD,M
Boys,99.79,4,Kalli Escamilla,Three Rivers,93.44,174.63,95.25,204.12,474,Single-ply,SBD,M
Boys,99.79,5,Jason Van Epps,Pleasanton,98.52,192.78,90.72,190.51,474,Single-ply,SBD,M
Boys,99.79,6,Brittain Wagner,Blanco,90.72,167.83,113.4,185.97,467.2,Single-ply,SBD,M
Boys,99.79,7,Jessie Ruiz,Blanco,92.53,183.7,120.2,156.49,460.4,Single-ply,SBD,M
Boys,99.79,8,Aaron Lopez,Karnes City,93.71,140.61,90.72,156.49,387.82,Single-ply,SBD,M
Boys,99.79,9,Garrett Seamans,Comfort,96.98,111.13,77.11,136.08,324.32,Single-ply,SBD,M
Boys,99.79,10,Juan Espinoza,San Antonio Kennedy,91.44,95.25,63.5,142.88,301.64,Single-ply,SBD,M
Boys,99.79,DQ,Paulino Bosquez,San Antonio Kennedy,99.79,,,,,Single-ply,SBD,M
Boys,99.79,DQ,Juan DeLeon,San Antonio Southside,99.79,,,,,Single-ply,SBD,M
Boys,99.79,DQ,Cody Perez,Blanco,99.79,,,,,Single-ply,SBD,M
Boys,109.77,1,Gilbert Garza,San Antonio Southside,107.05,199.58,115.67,151.95,467.2,Single-ply,SBD,M
Boys,124.74,2,John Rodriguez,San Antonio Kennedy,109.86,174.63,104.33,151.95,430.91,Single-ply,SBD,M
Boys,109.77,3,Marc Hubbard,Comfort,105.05,154.22,102.06,172.37,428.64,Single-ply,SBD,M
Boys,109.77,4,Damian Cantu,San Antonio Kennedy,104.78,136.08,90.72,158.76,385.55,Single-ply,SBD,M
Boys,124.74,5,Jesse Charo,San Antonio Kennedy,109.95,142.88,83.91,154.22,381.02,Single-ply,SBD,M
Boys,109.77,6,Robert Garza,San Antonio Kennedy,105.6,142.88,79.38,147.42,369.68,Single-ply,SBD,M
Boys,109.77,7,Jordan Kasper-Hines,Three Rivers,100.79,124.74,79.38,151.95,356.07,Single-ply,SBD,M
Boys,109.77,DQ,Noah Tresselt,Blanco,109.77,,,,,Single-ply,SBD,M
Boys,124.74,1,Hector Valadez,San Antonio Southside,114.58,183.7,113.4,158.76,455.86,Single-ply,SBD,M
Boys,124.74,2,Trent Enriquez,Karnes City,124.47,149.69,111.13,142.88,403.7,Single-ply,SBD,M
Boys,124.74,3,Dustin Terry,Three Rivers,113.49,142.88,81.65,156.49,381.02,Single-ply,SBD,M
Boys,124.74,4,Ruben Lomas,Comal Canyon,114.67,142.88,92.99,113.4,349.27,Single-ply,SBD,M
Boys,124.74,DQ,Jacob Guerra,San Antonio Southside,124.74,,,,,Single-ply,SBD,M
Boys,124.74+,1,Jacob Smith,Comal Canyon,134.99,254.01,145.15,238.14,637.3,Single-ply,SBD,M
Boys,124.74+,2,Jesus Angel,Pleasanton,134.08,190.51,122.47,192.78,505.76,Single-ply,SBD,M
Boys,124.74+,3,Cody Krampitz,Comal Canyon,128.82,161.03,92.99,174.63,428.64,Single-ply,SBD,M
Boys,124.74+,4,Earl Morin,Karnes City,153.4,161.03,81.65,154.22,396.89,Single-ply,SBD,M
Boys,124.74+,5,Zac Moore,Comfort,129.18,136.08,74.84,165.56,376.48,Single-ply,SBD,M
Boys,124.74+,DQ,Izaiha Ramirez,Comal Canyon,136.08,,,,,Single-ply,SBD,M
Boys,124.74+,DQ,Jesse Flores,Pleasanton,136.08,,,,,Single-ply,SBD,M
Boys,124.74+,DQ,James Lee,Three Rivers,136.08,,,,,Single-ply,SBD,M
