Division,WeightClassKg,Place,Name,Team,BodyweightKg,Best3SquatKg,Best3BenchKg,Best3DeadliftKg,TotalKg,Equipment,Event,Sex
Boys,51.71,1,Carl Lindley,Brownsboro,48.9,113.4,61.23,124.74,299.37,Single-ply,SBD,M
Boys,51.71,2,Will McCown,Bullard,50.35,92.99,40.82,117.93,251.74,Single-ply,SBD,M
Boys,51.71,3,Jonathan McWhorter,Lindale,45.9,86.18,40.82,86.18,213.19,Single-ply,SBD,M
Boys,55.79,4,Zach Thompson,Bullard,51.8,58.97,43.09,97.52,199.58,Single-ply,SBD,M
Boys,55.79,1,José Castillo,Grapeland,54.02,142.88,74.84,156.49,374.21,Single-ply,SBD,M
Boys,55.79,2,Omar Hernandez,Athens,53.12,129.27,83.91,151.95,365.14,Single-ply,SBD,M
Boys,55.79,3,Colton Lewis,Lindale,53.16,111.13,83.91,138.35,333.39,Single-ply,SBD,M
Boys,59.87,4,Bailey Kurtz,Bullard,55.88,120.2,65.77,124.74,310.71,Single-ply,SBD,M
Boys,55.79,5,Bobby Jackson,Jacksonville,55.38,113.4,54.43,115.67,283.5,Single-ply,SBD,M
Boys,59.87,1,Jose Rodriguez,Athens,57.33,210.92,127.01,181.44,519.36,Single-ply,SBD,M
Boys,59.87,2,Leo Rosales,Rusk,58.11,185.97,97.52,185.97,469.47,Single-ply,SBD,M
Boys,59.87,3,Cody McQueen,Fairfield,58.24,127.01,61.23,129.27,317.51,Single-ply,SBD,M
Boys,59.87,4,Zach Hartmann,Troup,56.74,104.33,65.77,111.13,281.23,Single-ply,SBD,M
Boys,67.13,1,Ja'Vontay Williams,Nacogdoches,66.68,240.4,97.52,226.8,564.72,Single-ply,SBD,M
Boys,74.84,2,Alberto Alvarado,Brownsboro,67.18,181.44,77.11,183.7,442.25,Single-ply,SBD,M
Boys,67.13,3,Richard Torrelli,Bullard,64.77,136.08,106.59,179.17,421.84,Single-ply,SBD,M
Boys,67.13,4,Bryce Stephens,Brownsboro,63.5,165.56,92.99,151.95,410.5,Single-ply,SBD,M
Boys,67.13,5,Ulises Ramirez,Fairfield,62.23,181.44,74.84,147.42,403.7,Single-ply,SBD,M
Boys,74.84,6,Matt Scruggs,Troup,67.18,149.69,99.79,149.69,399.16,Single-ply,SBD,M
Boys,67.13,7,Walt Mahoud,Athens,60.83,136.08,90.72,158.76,385.55,Single-ply,SBD,M
Boys,67.13,8,Montana Meador,Lindale,64.91,156.49,81.65,142.88,381.02,Single-ply,SBD,M
Boys,67.13,9,Mike Zuniga,Troup,64.46,138.35,83.91,147.42,369.68,Single-ply,SBD,M
Boys,67.13,10,Cameron Larson,Brownsboro,65.36,136.08,74.84,151.95,362.87,Single-ply,SBD,M
Boys,67.13,11,Shane Lewis,Frankston,64.46,113.4,70.31,133.81,317.51,Single-ply,SBD,M
Boys,74.84,12,Noah Marble,Frankston,67.22,113.4,74.84,122.47,310.71,Single-ply,SBD,M
Boys,67.13,13,James Marble,Frankston,65.68,102.06,68.04,136.08,306.17,Single-ply,SBD,M
Boys,67.13,DQ,Victor Rangel,Crockett,66.77,,,,,Single-ply,SBD,M
Boys,74.84,1,Toby Thatcher,Bullard,73.03,199.58,127.01,183.7,510.29,Single-ply,SBD,M
Boys,74.84,2,Deverick Tatum,Jacksonville,73.66,176.9,92.99,229.06,498.95,Single-ply,SBD,M
Boys,74.84,3,Pierce Adams,Nacogdoches,72.17,190.51,92.99,195.04,478.54,Single-ply,SBD,M
Boys,74.84,4,Hayden Dees,Lindale,73.98,176.9,99.79,190.51,467.2,Single-ply,SBD,M
Boys,82.1,5,Ramiro Martinez,Troup,74.89,165.56,95.25,185.97,446.79,Single-ply,SBD,M
Boys,74.84,6,Brysien Cross,Tyler Chapel Hill,73.48,147.42,97.52,190.51,435.45,Single-ply,SBD,M
Boys,74.84,7,Bryant King,Brownsboro,70.31,154.22,90.72,176.9,421.84,Single-ply,SBD,M
Boys,74.84,8,Mooneyham Nick,Fairfield,69.58,158.76,90.72,170.1,419.57,Single-ply,SBD,M
Boys,74.84,9,Cameron Riess,Grapeland,73.53,183.7,79.38,151.95,415.04,Single-ply,SBD,M
Boys,74.84,10,Lucas Roliff,Cushing,67.63,174.63,92.99,142.88,410.5,Single-ply,SBD,M
Boys,74.84,11,Jordan Robinson,Lindale,73.53,165.56,90.72,151.95,408.23,Single-ply,SBD,M
Boys,74.84,12,Luke LaCroix,Brownsboro,73.84,158.76,83.91,163.29,405.97,Single-ply,SBD,M
Boys,74.84,13,Jose Cerda,New London West Rusk,70.31,158.76,83.91,161.03,403.7,Single-ply,SBD,M
Boys,74.84,14,Robert Humphreys,Lindale,71.71,117.93,70.31,151.95,340.19,Single-ply,SBD,M
Boys,74.84,15,Taylor Jackson,Cushing,71.49,133.81,65.77,136.08,335.66,Single-ply,SBD,M
Boys,74.84,16,Jake Baxter,Cushing,72.21,102.06,74.84,147.42,324.32,Single-ply,SBD,M
Boys,82.1,17,Keelan Felts,Brownsboro,74.93,115.67,74.84,133.81,324.32,Single-ply,SBD,M
Boys,74.84,18,Pj Lewis,Grapeland,70.85,192.78,83.91,,276.69,Single-ply,SB,M
Boys,74.84,DQ,Josh Provost,Cushing,68.54,,,,,Single-ply,SB,M
Boys,74.84,DQ,Chamar Wiley-Harris,Crockett,68.76,,,,,Single-ply,SB,M
Boys,74.84,DQ,Zack Cook,New London West Rusk,71.71,158.76,86.18,,,Single-ply,SB,M
Boys,74.84,DQ,Brett Martin,Troup,71.4,,,,,Single-ply,SB,M
Boys,82.1,1,Michael Hansen,Lindale,80.1,217.72,131.54,215.46,564.72,Single-ply,SBD,M
Boys,82.1,2,Ryan Taylor,Lindale,77.61,213.19,122.47,201.85,537.51,Single-ply,SBD,M
Boys,82.1,3,Kyle Alexander #2,Bullard,81.19,188.24,117.93,195.04,501.22,Single-ply,SBD,M
Boys,82.1,4,Dedrick Tatum,Jacksonville,75.39,204.12,99.79,181.44,485.34,Single-ply,SBD,M
Boys,82.1,5,Nate Wright,Brownsboro,81.69,181.44,97.52,176.9,455.86,Single-ply,SBD,M
Boys,82.1,6,Saul Rios,Lindale,78.06,188.24,97.52,163.29,449.06,Single-ply,SBD,M
Boys,82.1,7,Clayton Hawley,Lindale,78.74,170.1,99.79,170.1,439.98,Single-ply,SBD,M
Boys,82.1,8,Tremel Preston,Frankston,75.57,165.56,83.91,183.7,433.18,Single-ply,SBD,M
Boys,82.1,9,Sergio Rodriguez #3,Fairfield,77.29,163.29,88.45,158.76,410.5,Single-ply,SBD,M
Boys,82.1,10,Demodrick Foreman,Rusk,76.2,117.93,77.11,138.35,333.39,Single-ply,SBD,M
Boys,82.1,DQ,Ryan Spellman,Lindale,78.83,174.63,,,,Single-ply,SBD,M
Boys,82.1,DQ,Darius Buckly,Cushing,77.93,,,,,Single-ply,SBD,M
Boys,82.1,DQ,Isiah Valasquez,Cushing,77.66,174.63,,,,Single-ply,SBD,M
Boys,82.1,DQ,Letreveonce Bell,Crockett,82.1,149.69,,,,Single-ply,SBD,M
Boys,89.81,1,John Groff,Pilot Point,89.72,281.23,165.56,249.48,696.26,Single-ply,SBD,M
Boys,89.81,2,James Seekford,Lindale,86.09,272.16,172.37,215.46,659.98,Single-ply,SBD,M
Boys,89.81,3,Ceasar Morales,Jacksonville,88.5,190.51,102.06,192.78,485.34,Single-ply,SBD,M
Boys,99.79,4,Jax Donohoo,Fairfield,89.86,181.44,95.25,190.51,467.2,Single-ply,SBD,M
Boys,89.81,5,Ben McFadden,Lindale,83.05,161.03,83.91,183.7,428.64,Single-ply,SBD,M
Boys,89.81,6,Jesse Head,Lindale,88.5,172.37,86.18,156.49,415.04,Single-ply,SBD,M
Boys,99.79,7,Bryce Carraway,Nacogdoches,89.9,136.08,90.72,149.69,376.48,Single-ply,SBD,M
Boys,99.79,8,Jace Rogers,Rusk,89.86,131.54,79.38,151.95,362.87,Single-ply,SBD,M
Boys,89.81,DQ,DeCorian Horton,Tyler Chapel Hill,86.23,204.12,,,,Single-ply,SBD,M
Boys,89.81,DQ,Josh Driver,New London West Rusk,82.74,,,,,Single-ply,SBD,M
Boys,99.79,1,Cole Beddingfield,Fairfield,99.61,260.82,158.76,204.12,623.69,Single-ply,SBD,M
Boys,99.79,2,Caleb Hallford,Bullard,98.25,249.48,149.69,210.92,610.08,Single-ply,SBD,M
Boys,99.79,3,Logan Fuller,Athens,91.08,256.28,140.61,204.12,601.01,Single-ply,SBD,M
Boys,99.79,4,Nick Wright,Brownsboro,98.25,231.33,124.74,183.7,539.77,Single-ply,SBD,M
Boys,99.79,5,Noah Bush,Athens,95.3,208.65,117.93,204.12,530.7,Single-ply,SBD,M
Boys,99.79,6,Blaylock David Mitchell,Winona,92.12,195.04,124.74,199.58,519.36,Single-ply,SBD,M
Boys,99.79,7,Arron Pfleeger,Fairfield,96.62,210.92,108.86,181.44,501.22,Single-ply,SBD,M
Boys,99.79,8,Matthew Davidson,New London West Rusk,99.38,208.65,97.52,192.78,498.95,Single-ply,SBD,M
Boys,99.79,9,Barrett Senycky,Athens,90.72,188.24,115.67,172.37,476.27,Single-ply,SBD,M
Boys,99.79,10,Austin Whitten,Tyler Chapel Hill,95.16,185.97,102.06,188.24,476.27,Single-ply,SBD,M
Boys,99.79,11,Henry Hernendez,Jacksonville,99.06,185.97,102.06,188.24,476.27,Single-ply,SBD,M
Boys,99.79,12,Brandon Osteen,New London West Rusk,92.99,174.63,95.25,174.63,444.52,Single-ply,SBD,M
Boys,99.79,13,Flavio Hernandez,Jacksonville,93.89,158.76,104.33,181.44,444.52,Single-ply,SBD,M
Boys,99.79,14,Jacob DeHart,Lindale,93.08,167.83,102.06,172.37,442.25,Single-ply,SBD,M
Boys,99.79,15,Grant Hirsch,Athens,91.81,163.29,115.67,161.03,439.98,Single-ply,SBD,M
Boys,99.79,16,Josia Jones,Athens,93.94,172.37,97.52,163.29,433.18,Single-ply,SBD,M
Boys,99.79,17,Shemar Willis,Athens,90.31,158.76,83.91,165.56,408.23,Single-ply,SBD,M
Boys,99.79,18,Chris Fletcher,Rusk,96.21,167.83,79.38,158.76,405.97,Single-ply,SBD,M
Boys,99.79,19,Travis Pepin,Rusk,90.99,147.42,77.11,131.54,356.07,Single-ply,SBD,M
Boys,99.79,20,Garrett Beamer,Rusk,96.66,108.86,74.84,151.95,335.66,Single-ply,SBD,M
Boys,109.77,DQ,Will Fredell,Rusk,99.88,,,,,Single-ply,SBD,M
Boys,109.77,1,Hunter Phelps,Bullard,102.97,303.91,165.56,226.8,696.26,Single-ply,SBD,M
Boys,109.77,2,Tyler Segrest,Lindale,107.09,254.01,145.15,258.55,657.71,Single-ply,SBD,M
Boys,109.77,3,Tyler Wilbanks,Rusk,102.87,256.28,145.15,195.04,596.47,Single-ply,SBD,M
Boys,109.77,4,Reece Clark,Troup,104.83,247.21,117.93,217.72,582.87,Single-ply,SBD,M
Boys,124.74,5,Mitchell Graham,Bullard,109.86,204.12,149.69,201.85,555.65,Single-ply,SBD,M
Boys,109.77,6,Josh Porter,Frankston,105.73,215.46,120.2,215.46,551.11,Single-ply,SBD,M
Boys,109.77,7,Jeremy Wood,Fairfield,106.19,204.12,127.01,170.1,501.22,Single-ply,SBD,M
Boys,109.77,8,Emmitt Eckler,Jacksonville,105.28,181.44,131.54,174.63,487.61,Single-ply,SBD,M
Boys,109.77,9,Cole Schick,Fairfield,107.95,199.58,108.86,151.95,460.4,Single-ply,SBD,M
Boys,109.77,DQ,Joe Wright,New London West Rusk,100.74,,,,,Single-ply,SBD,M
Boys,109.77,DQ,Gonzalo Arreguin,Tyler Chapel Hill,109.41,249.48,,,,Single-ply,SBD,M
Boys,124.74,1,Dorian Schutt,Bullard,121.61,249.48,165.56,251.74,666.78,Single-ply,SBD,M
Boys,124.74,2,Jake Allen,Bullard,122.92,260.82,156.49,235.87,653.17,Single-ply,SBD,M
Boys,124.74,3,Julio Hiracheto,Cushing,115.3,233.6,158.76,233.6,625.96,Single-ply,SBD,M
Boys,124.74,4,JW McFarland,Bullard,119.29,272.16,147.42,190.51,610.08,Single-ply,SBD,M
Boys,124.74,5,Chad Walker,Athens,117.12,233.6,163.29,210.92,607.81,Single-ply,SBD,M
Boys,124.74,6,Trebdell McWhirter,Crockett,114.76,226.8,111.13,204.12,542.04,Single-ply,SBD,M
Boys,124.74,7,Justin Crowe,Jacksonville,112.54,206.38,102.06,226.8,535.24,Single-ply,SBD,M
Boys,124.74,8,Sergio Cabrera,Jacksonville,113.04,213.19,102.06,195.04,510.29,Single-ply,SBD,M
Boys,124.74,9,Kerry Rivera,Nacogdoches,111.63,192.78,113.4,185.97,492.15,Single-ply,SBD,M
Boys,124.74,10,Joey Gray,Troup,114.8,195.04,106.59,185.97,487.61,Single-ply,SBD,M
Boys,124.74,11,Zach Banks,Rusk,111.49,213.19,86.18,174.63,474,Single-ply,SBD,M
Boys,124.74,12,Brandon Mcle,Brownsboro,112.08,174.63,104.33,183.7,462.66,Single-ply,SBD,M
Boys,124.74,13,Jose Arreguin,Tyler Chapel Hill,115.85,185.97,102.06,170.1,458.13,Single-ply,SBD,M
Boys,124.74,14,Juan Mercado,Nacogdoches,118.02,181.44,102.06,149.69,433.18,Single-ply,SBD,M
Boys,124.74,15,James Hardy,Troup,115.76,181.44,95.25,151.95,428.64,Single-ply,SBD,M
Boys,124.74,16,Dante Gatson,Nacogdoches,121.11,108.86,79.38,149.69,337.93,Single-ply,SBD,M
Boys,124.74,DQ,Cameron Fleming,Lindale,123.92,240.4,113.4,,,Single-ply,SBD,M
Boys,124.74,DQ,Jayln Jackson,Fairfield,118.43,,,,,Single-ply,SBD,M
Boys,124.74+,1,Taylor McBride,Cushing,142.79,317.51,151.95,235.87,705.34,Single-ply,SBD,M
Boys,124.74+,2,Bryce Hoffman,Rusk,126.73,274.42,145.15,215.46,635.03,Single-ply,SBD,M
Boys,124.74+,3,Josh West,Athens,137.44,256.28,138.35,226.8,621.42,Single-ply,SBD,M
Boys,124.74+,4,Corey Brister,New London West Rusk,127.46,226.8,145.15,238.14,610.08,Single-ply,SBD,M
Boys,124.74+,5,Chris Thompson,Frankston,128.87,235.87,127.01,219.99,582.87,Single-ply,SBD,M
Boys,124.74+,6,Kevin Ramirez,Nacogdoches,152.04,272.16,113.4,181.44,566.99,Single-ply,SBD,M
Boys,124.74+,7,Jaren Kubena,Jacksonville,135.26,244.94,113.4,188.24,546.58,Single-ply,SBD,M
Boys,124.74+,8,Matt Carr,Bullard,150.59,226.8,145.15,158.76,530.7,Single-ply,SBD,M
Boys,124.74+,9,Ben Gibbs,Nacogdoches,127.96,190.51,122.47,204.12,517.1,Single-ply,SBD,M
Boys,124.74+,10,Gradick Gaylon,Lindale,143.83,204.12,120.2,185.97,510.29,Single-ply,SBD,M
Boys,124.74+,11,John Campbell,Bullard,125.83,226.8,88.45,163.29,478.54,Single-ply,SBD,M
Boys,124.74+,DQ,Timothy Riley,Crockett,135.35,,,,,Single-ply,SBD,M
Boys,124.74+,DQ,Hud Allen,Cushing,131.27,,,,,Single-ply,SBD,M
Boys,124.74+,DQ,Coby Wilbanks,Rusk,130.23,158.76,102.06,,,Single-ply,SBD,M
Boys,124.74+,DQ,Jaylon White,Troup,181.44,,,,,Single-ply,SBD,M
