Division,WeightClassKg,Place,Name,Team,BodyweightKg,Best3SquatKg,Best3BenchKg,Best3DeadliftKg,TotalKg,Equipment,Event,Sex
Boys,51.71,1,Adan Silvas,McCamey,48.99,88.45,54.43,108.86,251.74,Single-ply,SBD,M
Boys,51.71,2,Connor Steel,Forsan,49.9,83.91,45.36,90.72,219.99,Single-ply,SBD,M
Boys,51.71,3,Callum Hurst,Coahoma,40.37,63.5,47.63,65.77,176.9,Single-ply,SBD,M
Boys,51.71,4,Omkar Suhktankar,Coahoma,50.8,63.5,36.29,70.31,170.1,Single-ply,SBD,M
Boys,51.71,5,Brett Ashley,Sweetwater,40.82,43.09,29.48,61.23,133.81,Single-ply,SBD,M
Boys,55.79,1,Tyler Narin,Big Spring,54.88,147.42,86.18,149.69,383.29,Single-ply,SBD,M
Boys,55.79,2,Byron Gryder,McCamey,55.79,127.01,61.23,120.2,308.44,Single-ply,SBD,M
Boys,55.79,3,Ezekiel Garcia,McCamey,54.43,108.86,74.84,113.4,297.1,Single-ply,SBD,M
Boys,55.79,4,Andrew Martinez,Coahoma,55.34,97.52,68.04,131.54,297.1,Single-ply,SBD,M
Boys,55.79,5,Tandon Jones,Levelland,54.43,88.45,63.5,108.86,260.82,Single-ply,SBD,M
Boys,55.79,6,Emilio Miranda,Levelland,54.43,102.06,43.09,102.06,247.21,Single-ply,SBD,M
Boys,59.87,1,Jesse Ramirez,San Angelo Lake View,57.15,140.61,86.18,167.83,394.63,Single-ply,SBD,M
Boys,59.87,2,Jay Lomas,Sweetwater,58.06,142.88,90.72,147.42,381.02,Single-ply,SBD,M
Boys,59.87,3,Mario Manquero,Garden City,59.87,138.35,88.45,151.95,378.75,Single-ply,SBD,M
Boys,59.87,4,Trenton Crenshaw,Coahoma,59.87,122.47,88.45,136.08,347,Single-ply,SBD,M
Boys,59.87,5,Brandon Lee,San Angelo Lake View,56.25,115.67,65.77,142.88,324.32,Single-ply,SBD,M
Boys,59.87,6,Oscar Barraza,Forsan,59.87,111.13,61.23,122.47,294.84,Single-ply,SBD,M
Boys,59.87,7,Ryan Pearson,Forsan,58.51,111.13,68.04,113.4,292.57,Single-ply,SBD,M
Boys,59.87,8,Isaiah Enriquez,Garden City,59.42,92.99,58.97,113.4,265.35,Single-ply,SBD,M
Boys,59.87,9,Michael Zambrano,Big Spring,58.06,74.84,61.23,68.04,204.12,Single-ply,SBD,M
Boys,67.13,1,Donald Baker,Sweetwater,65.77,167.83,106.59,170.1,444.52,Single-ply,SBD,M
Boys,67.13,2,Robert Martinez,Big Spring,66.22,154.22,92.99,165.56,412.77,Single-ply,SBD,M
Boys,67.13,3,Stephen Seely,San Angelo Lake View,60.78,131.54,81.65,158.76,371.95,Single-ply,SBD,M
Boys,67.13,4,Trey Harvey,Sweetwater,67.13,136.08,81.65,151.95,369.68,Single-ply,SBD,M
Boys,67.13,5,Max Nemir,Sweetwater,63.96,131.54,79.38,136.08,347,Single-ply,SBD,M
Boys,67.13,6,Alfredo Bueno,Colorado City Colorado,62.14,102.06,88.45,124.74,315.25,Single-ply,SBD,M
Boys,67.13,7,Nestor Castellanos,San Angelo Lake View,64.86,90.72,81.65,136.08,308.44,Single-ply,SBD,M
Boys,67.13,8,Branson Guelker,Sweetwater,67.13,99.79,68.04,120.2,288.03,Single-ply,SBD,M
Boys,67.13,9,Damian Cate,Coahoma,66.68,117.93,68.04,92.99,278.96,Single-ply,SBD,M
Boys,67.13,10,Jamie Nunez,McCamey,64.86,74.84,58.97,113.4,247.21,Single-ply,SBD,M
Boys,67.13,DQ,Christian Jimenez,McCamey,65.77,90.72,,,,Single-ply,SBD,M
Boys,67.13,DQ,Isaac Rodriguez,McCamey,60.78,52.16,,,,Single-ply,SBD,M
Boys,67.13,DQ,Will Gutierrez,McCamey,66.22,131.54,,,,Single-ply,SBD,M
Boys,67.13,DQ,Phillip Tinner,McCamey,67.13,151.95,,,,Single-ply,SBD,M
Boys,67.13,DQ,Tyler Witkowski,Coahoma,62.14,106.59,,,,Single-ply,SBD,M
Boys,74.84,1,Angel Moreno,San Angelo Lake View,71.21,199.58,115.67,199.58,514.83,Single-ply,SBD,M
Boys,74.84,2,John Hernandez,San Angelo Lake View,67.59,172.37,104.33,195.04,471.74,Single-ply,SBD,M
Boys,74.84,3,Austin Grantham,Forsan,73.03,158.76,102.06,174.63,435.45,Single-ply,SBD,M
Boys,74.84,4,Steven Le,Sweetwater,72.57,170.1,97.52,165.56,433.18,Single-ply,SBD,M
Boys,74.84,5,Paul Perez,Levelland,72.57,154.22,99.79,147.42,401.43,Single-ply,SBD,M
Boys,74.84,6,Jalin Gilbert,Coahoma,73.94,140.61,83.91,172.37,396.89,Single-ply,SBD,M
Boys,74.84,7,Jacob Ludwig,Colorado City Colorado,71.67,149.69,70.31,156.49,376.48,Single-ply,SBD,M
Boys,74.84,8,Christian Van Wey,Coahoma,70.31,131.54,68.04,170.1,369.68,Single-ply,SBD,M
Boys,74.84,9,Jordan Zarate,McCamey,72.12,115.67,104.33,142.88,362.87,Single-ply,SBD,M
Boys,74.84,10,Antonio Ramirez Jr,Garden City,73.48,127.01,83.91,151.95,362.87,Single-ply,SBD,M
Boys,74.84,11,Tyler Hasting,Levelland,74.39,129.27,90.72,136.08,356.07,Single-ply,SBD,M
Boys,74.84,12,Manuel Galvan,Big Spring,69.85,111.13,72.57,140.61,324.32,Single-ply,SBD,M
Boys,74.84,13,Perry Donnell,Colorado City Colorado,70.31,111.13,68.04,120.2,299.37,Single-ply,SBD,M
Boys,74.84,14,Frankie Hernandez,Coahoma,69.85,63.5,45.36,70.31,179.17,Single-ply,SBD,M
Boys,82.1,1,Peyton Rodriguez,Coahoma,82.1,204.12,138.35,204.12,546.58,Single-ply,SBD,M
Boys,82.1,2,Joe Melendez,Coahoma,82.1,204.12,113.4,192.78,510.29,Single-ply,SBD,M
Boys,82.1,3,Caleb Hudson,San Angelo Lake View,77.56,183.7,108.86,208.65,501.22,Single-ply,SBD,M
Boys,82.1,4,Jj Casarez,McCamey,78.93,195.04,120.2,174.63,489.88,Single-ply,SBD,M
Boys,82.1,5,Austin Marlett,Sweetwater,75.75,170.1,111.13,176.9,458.13,Single-ply,SBD,M
Boys,82.1,6,Josh Molina,McCamey,78.02,165.56,99.79,158.76,424.11,Single-ply,SBD,M
Boys,82.1,7,Jamen Sanchez,Coahoma,78.93,136.08,68.04,120.2,324.32,Single-ply,SBD,M
Boys,89.81,1,Shawn Walker,Garden City,89.81,183.7,131.54,183.7,498.95,Single-ply,SBD,M
Boys,89.81,2,Jahari Vanover,Big Spring,87.09,156.49,97.52,158.76,412.77,Single-ply,SBD,M
Boys,89.81,3,Roy Flores,Levelland,88,167.83,81.65,149.69,399.16,Single-ply,SBD,M
Boys,89.81,4,Evaristo Rodriguez,Levelland,83.46,136.08,104.33,147.42,387.82,Single-ply,SBD,M
Boys,89.81,5,Nathan Gonzales,Levelland,88.9,149.69,90.72,142.88,383.29,Single-ply,SBD,M
Boys,89.81,6,Eric Andrade,Garden City,85.73,131.54,77.11,149.69,358.34,Single-ply,SBD,M
Boys,89.81,7,Cj Adames,Sweetwater,88.45,111.13,77.11,145.15,333.39,Single-ply,SBD,M
Boys,99.79,1,Jesse Garza,Colorado City Colorado,99.34,190.51,124.74,206.38,521.63,Single-ply,SBD,M
Boys,99.79,2,Haddan Stokes,Coahoma,97.98,204.12,129.27,170.1,503.49,Single-ply,SBD,M
Boys,99.79,3,Taylor Morin,Forsan,96.62,192.78,97.52,179.17,469.47,Single-ply,SBD,M
Boys,99.79,4,Josh Smith,San Angelo Lake View,92.99,190.51,104.33,163.29,458.13,Single-ply,SBD,M
Boys,99.79,5,Pedro Ybarra,McCamey,97.07,183.7,97.52,167.83,449.06,Single-ply,SBD,M
Boys,99.79,6,Cory Menez,Sweetwater,92.53,174.63,90.72,158.76,424.11,Single-ply,SBD,M
Boys,99.79,7,Austin Cantu,Big Spring,98.88,142.88,97.52,183.7,424.11,Single-ply,SBD,M
Boys,99.79,8,Israel Beltran,Colorado City Colorado,99.79,136.08,92.99,142.88,371.95,Single-ply,SBD,M
Boys,109.77,1,Aaron Allen #2,San Angelo Lake View,108.41,263.08,140.61,272.16,675.85,Single-ply,SBD,M
Boys,109.77,2,Jordan Stokes,Coahoma,101.15,249.48,142.88,260.82,653.17,Single-ply,SBD,M
Boys,109.77,3,Kendall Rea,Sweetwater,102.51,192.78,136.08,183.7,512.56,Single-ply,SBD,M
Boys,109.77,4,Ausden Medrano,Forsan,108.41,201.85,111.13,192.78,505.76,Single-ply,SBD,M
Boys,109.77,5,Rudy Brito,Coahoma,106.14,195.04,117.93,176.9,489.88,Single-ply,SBD,M
Boys,109.77,6,Tomas Vidales,Levelland,107.05,154.22,83.91,151.95,390.09,Single-ply,SBD,M
Boys,109.77,7,Braden East,Big Spring,102.51,133.81,90.72,145.15,369.68,Single-ply,SBD,M
Boys,109.77,DQ,Collin Woodard,Big Spring,107.95,,,,,Single-ply,SBD,M
Boys,124.74,1,Christian Delgado,San Angelo Lake View,120.66,213.19,131.54,185.97,530.7,Single-ply,SBD,M
Boys,124.74,2,Dustin Fontana,Coahoma,111.58,181.44,149.69,195.04,526.17,Single-ply,SBD,M
Boys,124.74,3,Zak Walton,Coahoma,113.85,181.44,154.22,190.51,526.17,Single-ply,SBD,M
Boys,124.74,4,Aric Rutledge,Big Spring,120.2,197.31,115.67,199.58,512.56,Single-ply,SBD,M
Boys,124.74,5,Nic Conner,Big Spring,116.12,176.9,113.4,190.51,480.81,Single-ply,SBD,M
Boys,124.74,6,Nick Irwin,Snyder,114.31,170.1,111.13,185.97,467.2,Single-ply,SBD,M
Boys,124.74,7,Chris Simmons,Levelland,116.57,170.1,122.47,167.83,460.4,Single-ply,SBD,M
Boys,124.74,8,Brenon Brunson,Snyder,113.85,167.83,108.86,163.29,439.98,Single-ply,SBD,M
Boys,124.74,9,Aaron Steelman,Snyder,118.84,158.76,102.06,174.63,435.45,Single-ply,SBD,M
Boys,124.74,10,Jose Jiminez,Snyder,112.04,145.15,92.99,154.22,392.36,Single-ply,SBD,M
Boys,124.74,11,Val Presas,Big Spring,117.93,133.81,81.65,147.42,362.87,Single-ply,SBD,M
Boys,124.74+,1,Steven Manahan,McCamey,141.52,247.21,158.76,204.12,610.08,Single-ply,SBD,M
Boys,124.74+,2,Jeremy Garza,Snyder,125.19,219.99,154.22,210.92,585.13,Single-ply,SBD,M
Boys,124.74+,3,Daniel Schlather,San Angelo Lake View,125.65,204.12,136.08,215.46,555.65,Single-ply,SBD,M
Boys,124.74+,4,Damien Venegas,McCamey,135.17,208.65,133.81,188.24,530.7,Single-ply,SBD,M
Boys,124.74+,5,Thomas Rivera,Colorado City Colorado,173.27,136.08,111.13,147.42,394.63,Single-ply,SBD,M
