Division,WeightClassKg,Place,Name,Team,BodyweightKg,Best3SquatKg,Best3BenchKg,Best3DeadliftKg,TotalKg,Equipment,Event,Sex
Boys,51.71,1,Peter Loftus,Burkburnett,51.44,129.27,77.11,167.83,374.21,Single-ply,SBD,M
Boys,51.71,2,Emilio Carrizales,Iowa Park,51.62,138.35,72.57,140.61,351.53,Single-ply,SBD,M
Boys,51.71,3,Devin Johnson,Henrietta,51.07,111.13,68.04,122.47,301.64,Single-ply,SBD,M
Boys,51.71,4,Christian Privitt,Henrietta,51.53,79.38,61.23,104.33,244.94,Single-ply,SBD,M
Boys,51.71,DQ,Jeremy Lingle,Alvord,51.07,,,,,Single-ply,SBD,M
Boys,51.71,DQ,Jimmy Coffman,Paradise,50.44,92.99,,,,Single-ply,SBD,M
Boys,51.71,DQ,Jordan McConnell,Paradise,50.8,90.72,,,,Single-ply,SBD,M
Boys,55.79,1,Jd Franke,Henrietta,54.88,138.35,65.77,124.74,328.85,Single-ply,SBD,M
Boys,59.87,2,Brandon Gee,Ponder,55.88,127.01,65.77,113.4,306.17,Single-ply,SBD,M
Boys,59.87,3,Cameron Senters,Burkburnett,55.88,120.2,61.23,122.47,303.91,Single-ply,SBD,M
Boys,59.87,4,Ben Spruiell,Nocona,55.88,90.72,58.97,127.01,276.69,Single-ply,SBD,M
Boys,55.79,DQ,Sean Terry,Burkburnett,55.61,102.06,,,,Single-ply,SBD,M
Boys,67.13,1,Preston King,Burkburnett,59.96,192.78,102.06,208.65,503.49,Single-ply,SBD,M
Boys,59.87,2,Zack Remily,Bowie,58.33,167.83,83.91,158.76,410.5,Single-ply,SBD,M
Boys,59.87,3,Cole Clouse,Archer City,56.97,154.22,72.57,156.49,383.29,Single-ply,SBD,M
Boys,59.87,4,Taylor Ross,Nocona,59.78,145.15,88.45,149.69,383.29,Single-ply,SBD,M
Boys,59.87,5,Alex Greene,Henrietta,58.6,161.03,77.11,138.35,376.48,Single-ply,SBD,M
Boys,59.87,6,Justin McDonald,Burkburnett,59.78,142.88,72.57,133.81,349.27,Single-ply,SBD,M
Boys,67.13,7,John Phillips,Alvord,59.96,124.74,77.11,129.27,331.12,Single-ply,SBD,M
Boys,67.13,1,Laramie Stone,Bowie,66.04,181.44,102.06,174.63,458.13,Single-ply,SBD,M
Boys,67.13,2,Luke Hartman,Iowa Park,66.13,183.7,102.06,151.95,437.72,Single-ply,SBD,M
Boys,67.13,3,Dalton Day,Henrietta,65.59,170.1,90.72,149.69,410.5,Single-ply,SBD,M
Boys,67.13,4,Don Fauver,Henrietta,66.77,163.29,79.38,161.03,403.7,Single-ply,SBD,M
Boys,67.13,5,Thomas Trice,Alvord,63.41,136.08,81.65,147.42,365.14,Single-ply,SBD,M
Boys,67.13,6,Tj Coley,Nocona,63.78,136.08,77.11,122.47,335.66,Single-ply,SBD,M
Boys,67.13,7,Ryan Hughes,Ponder,61.51,127.01,68.04,127.01,322.05,Single-ply,SBD,M
Boys,67.13,8,Tj Ferryman,Ponder,67.13,131.54,68.04,122.47,322.05,Single-ply,SBD,M
Boys,67.13,9,Blake Voth,Muenster,65.23,106.59,61.23,120.2,288.03,Single-ply,SBD,M
Boys,67.13,10,Brantley Smith,Paradise,63.78,102.06,61.23,115.67,278.96,Single-ply,SBD,M
Boys,67.13,DQ,Dalton Pullin,Seymour,66.22,147.42,,,,Single-ply,SBD,M
Boys,67.13,DQ,Conner Neely,Nocona,63.68,145.15,,,,Single-ply,SBD,M
Boys,74.84,1,Kyle Frazier,Burkburnett,72.48,219.99,111.13,204.12,535.24,Single-ply,SBD,M
Boys,74.84,2,Colton Redman,Alvord,72.76,204.12,106.59,217.72,528.44,Single-ply,SBD,M
Boys,74.84,3,Colbey Watson,Iowa Park,71.21,199.58,104.33,199.58,503.49,Single-ply,SBD,M
Boys,74.84,4,Stoney Newberry,Henrietta,73.48,181.44,111.13,190.51,483.08,Single-ply,SBD,M
Boys,74.84,5,Sawyer Heugatter,Bowie,73.57,210.92,97.52,172.37,480.81,Single-ply,SBD,M
Boys,74.84,6,Wes Hastings,Archer City,73.48,170.1,104.33,188.24,462.66,Single-ply,SBD,M
Boys,74.84,7,Jesse Brown,Alvord,73.57,158.76,97.52,170.1,426.38,Single-ply,SBD,M
Boys,82.1,8,Cody Lemons,Nocona,74.93,140.61,97.52,151.95,390.09,Single-ply,SBD,M
Boys,74.84,9,Justin Kirkendall,Nocona,70.13,142.88,95.25,149.69,387.82,Single-ply,SBD,M
Boys,82.1,10,Chase Hammer,Muenster,74.93,140.61,74.84,149.69,365.14,Single-ply,SBD,M
Boys,74.84,11,Dillon Welch,Ponder,73.48,129.27,72.57,147.42,349.27,Single-ply,SBD,M
Boys,74.84,12,Mark Jones,Muenster,68.31,111.13,77.11,129.27,317.51,Single-ply,SBD,M
Boys,74.84,DQ,Zack Thompson,Henrietta,73.3,,,,,Single-ply,SBD,M
Boys,82.1,DQ,Isaiah Terry,Burkburnett,74.93,215.46,104.33,,,Single-ply,SBD,M
Boys,74.84,DQ,Zac Romine,Burkburnett,72.94,222.26,106.59,,,Single-ply,SBD,M
Boys,74.84,DQ,Kyle Bradshaw,Paradise,74.66,158.76,,,,Single-ply,SBD,M
Boys,74.84,DQ,Hayden Brown,Paradise,72.39,122.47,,,,Single-ply,SBD,M
Boys,74.84,DQ,Trevor Welch,Ponder,71.21,122.47,,,,Single-ply,SBD,M
Boys,82.1,1,Ryne Cozby,Burkburnett,82.01,263.08,124.74,213.19,601.01,Single-ply,SBD,M
Boys,82.1,2,Chris McIlvanie,Iowa Park,81.92,231.33,142.88,192.78,566.99,Single-ply,SBD,M
Boys,82.1,3,Jacob Herring,Henrietta,78.29,219.99,108.86,197.31,526.17,Single-ply,SBD,M
Boys,82.1,4,Cody Cossman,Ponder,80.38,195.04,113.4,185.97,494.42,Single-ply,SBD,M
Boys,82.1,5,Nick Lemmond,Seymour,80.01,176.9,106.59,181.44,464.93,Single-ply,SBD,M
Boys,82.1,6,Jd Cuatt,Iowa Park,80.56,170.1,104.33,185.97,460.4,Single-ply,SBD,M
Boys,82.1,7,Tyler Cobb,Paradise,78.2,179.17,102.06,174.63,455.86,Single-ply,SBD,M
Boys,82.1,8,Colton Carnes,Archer City,79.2,183.7,97.52,172.37,453.59,Single-ply,SBD,M
Boys,82.1,9,Caiden Fenoglio,Nocona,82.1,172.37,111.13,165.56,449.06,Single-ply,SBD,M
Boys,82.1,10,Kyle Kidwell,Iowa Park,78.38,170.1,99.79,165.56,435.45,Single-ply,SBD,M
Boys,82.1,11,Colten Henricks,Seymour,76.02,147.42,83.91,174.63,405.97,Single-ply,SBD,M
Boys,82.1,12,Hunter Hrncirik,Seymour,79.92,158.76,88.45,158.76,405.97,Single-ply,SBD,M
Boys,82.1,13,Jordan Carter,Paradise,80.92,151.95,83.91,140.61,376.48,Single-ply,SBD,M
Boys,82.1,14,Brady Mahler,Iowa Park,81.1,129.27,74.84,163.29,367.41,Single-ply,SBD,M
Boys,82.1,15,Tyler Gray,Nocona,80.01,138.35,72.57,133.81,344.73,Single-ply,SBD,M
Boys,82.1,16,Darrin Springs,Muenster,79.2,133.81,56.7,149.69,340.19,Single-ply,SBD,M
Boys,89.81,17,Cody Messer,Nocona,82.28,145.15,65.77,117.93,328.85,Single-ply,SBD,M
Boys,82.1,18,Patrick Riordan,Henrietta,75.84,97.52,63.5,140.61,301.64,Single-ply,SBD,M
Boys,82.1,DQ,Josh Lightsey,Iowa Park,77.56,,,,,Single-ply,SBD,M
Boys,82.1,DQ,Grant Biediger,Alvord,76.93,204.12,,,,Single-ply,SBD,M
Boys,99.79,1,Joseph Costa,Henrietta,89.99,215.46,124.74,188.24,528.44,Single-ply,SBD,M
Boys,89.81,2,Mason Wheeler,Bowie,87.82,183.7,117.93,192.78,494.42,Single-ply,SBD,M
Boys,89.81,3,Kyler Koch,Iowa Park,87.54,208.65,102.06,176.9,487.61,Single-ply,SBD,M
Boys,89.81,4,Tyler Johnson,Archer City,87,183.7,102.06,185.97,471.74,Single-ply,SBD,M
Boys,89.81,5,Luke Crabtree,Muenster,86.82,145.15,102.06,140.61,387.82,Single-ply,SBD,M
Boys,89.81,6,Joseph Rule,Muenster,84.82,102.06,79.38,124.74,306.17,Single-ply,SBD,M
Boys,89.81,DQ,Blake Tucker,Bowie,88.99,,,,,Single-ply,SBD,M
Boys,99.79,DQ,Sam Atwood,Seymour,89.99,199.58,,,,Single-ply,SBD,M
Boys,109.77,1,Corgan Andrews,Paradise,99.97,249.48,102.06,235.87,587.4,Single-ply,SBD,M
Boys,99.79,2,Isaiah Barnes,Burkburnett,99.52,226.8,136.08,204.12,566.99,Single-ply,SBD,M
Boys,99.79,3,Clay Futch,Ponder,98.52,192.78,120.2,151.95,464.93,Single-ply,SBD,M
Boys,99.79,4,Tory Ferryman,Ponder,91.44,192.78,102.06,149.69,444.52,Single-ply,SBD,M
Boys,99.79,DQ,Tod Jackson,Bowie,94.53,188.24,92.99,,,Single-ply,SBD,M
Boys,109.77,1,Scott Dobbins,Burkburnett,108.59,290.3,174.63,240.4,705.34,Single-ply,SBD,M
Boys,109.77,2,Clayton Pittman,Paradise,106.78,265.35,111.13,238.14,614.62,Single-ply,SBD,M
Boys,109.77,3,Sam Powers,Henrietta,108.41,238.14,115.67,226.8,580.6,Single-ply,SBD,M
Boys,109.77,4,Gary Suarez,Burkburnett,102.33,165.56,117.93,183.7,467.2,Single-ply,SBD,M
Boys,109.77,5,Justin Killen,Nocona,106.59,192.78,102.06,170.1,464.93,Single-ply,SBD,M
Boys,109.77,6,Caleb Anderson,Burkburnett,107.77,120.2,79.38,131.54,331.12,Single-ply,SBD,M
Boys,109.77,7,Paul Mouring,Muenster,102.6,156.49,79.38,92.99,328.85,Single-ply,SBD,M
Boys,124.74,1,Caleb England,Iowa Park,124.47,290.3,172.37,231.33,694,Single-ply,SBD,M
Boys,124.74,2,Jackson Cunningham,Paradise,113.04,272.16,113.4,238.14,623.69,Single-ply,SBD,M
Boys,124.74,3,Robert Hackney,Paradise,111.67,151.95,102.06,138.35,392.36,Single-ply,SBD,M
Boys,124.74,DQ,Bradley Bendure,Bowie,120.93,192.78,99.79,,,Single-ply,SBD,M
Boys,124.74+,1,Lorenzo Barnes,Burkburnett,143.97,353.8,231.33,276.69,861.83,Single-ply,SBD,M
Boys,124.74+,2,Reid Graves,Iowa Park,148.69,276.69,170.1,233.6,680.39,Single-ply,SBD,M
Boys,124.74+,3,Scott Buerger,Archer City,127.64,188.24,106.59,192.78,487.61,Single-ply,SBD,M
Boys,124.74+,4,Mason Fairchild,Iowa Park,133.99,113.4,68.04,127.01,308.44,Single-ply,SBD,M
Boys,124.74+,DQ,Nick Ward,Iowa Park,137.89,,,,,Single-ply,SBD,M
