Place,Name,Division,BodyweightKg,Squat1Kg,Squat2Kg,Squat3Kg,Best3SquatKg,Bench1Kg,Bench2Kg,Bench3Kg,Best3BenchKg,Deadlift1Kg,Deadlift2Kg,Deadlift3Kg,Best3DeadliftKg,TotalKg,WeightClassKg,Sex,CyrillicName,BirthYear,Equipment,Tested,Event
1,Aleksandra Avanesyan,O,74.1,140,150,157.5,157.5,95,100,-105,100,150,-160,-170,150,407.5,75,F,Александра Аванесян,1995,Raw,No,SBD
DQ,Aleksey Ezhov,J,53.4,-80,-90,-100,,,,,,,,,,,56,M,Алексей Ежов,1998,Raw,No,SBD
1,Maksim Denisov,T,72,-132.5,132.5,145,145,92.5,97.5,100,100,150,160,167.5,167.5,412.5,75,M,Максим Денисов,1999,Raw,No,SBD
1,Nikita Repin,J,82.1,215,225,230,230,142.5,-145,-145,142.5,-220,-232.5,232.5,232.5,605,82.5,M,Никита Репин,1995,Raw,No,SBD
1,Timur Bogdanov,O,81.8,190,205,215,215,140,150,-155,150,240,250,-270,250,615,82.5,M,Тимур Богданов,1988,Raw,No,SBD
1,Zhavokhir Askaraliev,O,90,195,205,-215,205,155,-165,170,170,225,235,-250,235,610,90,M,Жавохир Аскаралиев,1993,Raw,No,SBD
2,Anatoliy Shvetsov,O,89.8,205,215,-220,215,135,142.5,-150,142.5,205,215,225,225,582.5,90,M,Анатолий Швецов,1985,Raw,No,SBD
3,Stanislav Polyakov,O,88.7,-160,160,170,170,120,-127.5,-132.5,120,170,180,190,190,480,90,M,Станислав Поляков,1991,Raw,No,SBD
1,Aleksey Slabun,M1,89.8,210,-220,220,220,-165,165,-175,165,-200,200,210,210,595,90,M,Алексей Слабун,1976,Raw,No,SBD
2,Anton Kashentsev,M1,88.4,145,155,165,165,115,122.5,-127.5,122.5,-185,195,205,205,492.5,90,M,Антон Кашенцев,1976,Raw,No,SBD
1,Nikolay Petrichenko,M1,108.7,95,-105,105,105,90,95,100,100,-140,140,155,155,360,110,M,Николай Петриченко,1978,Raw,No,SBD
1,Vyacheslav Klimov,T,118.8,105,115,120,120,85,-90,90,90,110,120,130,130,340,125,M,Вячеслав Климов,2002,Raw,No,SBD
1,Aleksey Nemov,O,121.4,240,260,-270,260,180,192.5,200,200,-290,300,-310,300,760,125,M,Алексей Немов,1990,Raw,No,SBD
1,Inna Kalinichenko,T,47.3,72.5,-77.5,-77.5,72.5,50,52.5,-55,52.5,-115,115,117.5,117.5,242.5,48,F,Инна Калиниченко,1999,Raw,Yes,SBD
1,Mariya Lopukhova,J,46.6,-70,70,75,75,35,40,-42.5,40,80,85,90,90,205,48,F,Мария Лопухова,1997,Raw,Yes,SBD
1,Mariya Lopukhova,O,46.6,-70,70,75,75,35,40,-42.5,40,80,85,90,90,205,48,F,Мария Лопухова,1997,Raw,Yes,SBD
1,Zlata Smolyakova,T,54.7,50,-55,57.5,57.5,-27.5,30,32.5,32.5,50,60,70,70,160,56,F,Злата Смолякова,2002,Raw,Yes,SBD
1,Oksana Korchagina,O,56,80,85,-87.5,85,47.5,52.5,55,55,90,-97.5,-102.5,90,230,56,F,Оксана Корчагина,1984,Raw,Yes,SBD
2,Elena Yudina,O,54.2,65,72.5,-77.5,72.5,42.5,47.5,-50,47.5,72.5,80,-85,80,200,56,F,Елена Юдина,1985,Raw,Yes,SBD
1,Aleksandra Golban,T,58.9,80,-85,85,85,45,50,-52.5,50,135,140,145,145,280,60,F,Александра Голбан,1999,Raw,Yes,SBD
2,Elvira Chaykina,T,59.7,75,80,-82.5,80,45,47.5,50,50,80,85,-92.5,85,215,60,F,Эльвира Чайкина,2000,Raw,Yes,SBD
1,Valeriya Ushkova,O,58.2,92.5,97.5,100,100,47.5,52.5,55,55,120,125,-130,125,280,60,F,Валерия Ушкова,1992,Raw,Yes,SBD
2,Aleksandra Golban,O,58.9,80,-85,85,85,45,50,-52.5,50,135,140,145,145,280,60,F,Александра Голбан,1999,Raw,Yes,SBD
3,Tatyana Romanova,O,59.3,95,97.5,-100,97.5,52.5,55,57.5,57.5,107.5,112.5,-115,112.5,267.5,60,F,Татьяна Романова,1989,Raw,Yes,SBD
4,Irina Panina,O,59.1,85,-90,92.5,92.5,50,55,60,60,95,102.5,107.5,107.5,260,60,F,Ирина Панина,1985,Raw,Yes,SBD
5,Olga Sidorova,O,59.8,-80,85,95,95,50,55,-60,55,100,110,,110,260,60,F,Ольга Сидорова,1966,Raw,Yes,SBD
6,Olga Rysina,O,59.2,72.5,80,85,85,37.5,-42.5,42.5,42.5,85,92.5,97.5,97.5,225,60,F,Ольга Рысина,1981,Raw,Yes,SBD
7,Ekaterina Gavrina,O,57.9,75,85,,85,47.5,-50,-50,47.5,77.5,-85,87.5,87.5,220,60,F,Екатерина Гаврина,1983,Raw,Yes,SBD
8,Anna Golub,O,58.3,75,-80,-80,75,47.5,50,52.5,52.5,-80,80,90,90,217.5,60,F,Анна Голуб,1992,Raw,Yes,SBD
9,Elvira Chaykina,O,59.7,75,80,-82.5,80,45,47.5,50,50,80,85,-92.5,85,215,60,F,Эльвира Чайкина,2000,Raw,Yes,SBD
10,Yuliya Reveguk,O,57.1,60,-67.5,72.5,72.5,35,40,42.5,42.5,70,-77.5,82.5,82.5,197.5,60,F,Юлия Ревегук,1985,Raw,Yes,SBD
1,Olga Sidorova,M3,59.8,-80,85,95,95,50,55,-60,55,100,110,,110,260,60,F,Ольга Сидорова,1966,Raw,Yes,SBD
1,Anastasiya Melnik,J,65.7,100,107.5,110,110,55,60,-65,60,-125,130,135,135,305,67.5,F,Анастасия Мельник,1996,Raw,Yes,SBD
1,Anastasiya Melnik,O,65.7,100,107.5,110,110,55,60,-65,60,-125,130,135,135,305,67.5,F,Анастасия Мельник,1996,Raw,Yes,SBD
1,Olesya Nikolaeva,M1,64.8,90,95,97.5,97.5,52.5,55,57.5,57.5,115,125,130,130,285,67.5,F,Олеся Николаева,1978,Raw,Yes,SBD
1,Anastasiya Klyuchevskaya-Kabanova,O,74.9,55,60,65,65,32.5,35,37.5,37.5,-60,70,-75,70,172.5,75,F,Анастасия Ключевская-Кабанова,1982,Raw,Yes,SBD
1,Anna Ivanenko,O,81,120,-130,135,135,80,85,90,90,130,142.5,155,155,380,82.5,F,Анна Иваненко,1986,Raw,Yes,SBD
2,Elena Polonetskaya,O,81.1,-100,-100,100,100,55,60,-65,60,115,120,-125,120,280,82.5,F,Елена Полонецкая,1989,Raw,Yes,SBD
DQ,Tatyana Yarukova,O,79.3,-85,-85,-85,,,,,,,,,,,82.5,F,Татьяна Ярукова,1990,Raw,Yes,SBD
1,Aleksandr Rek,O,66.3,190,200,-207.5,200,120,-125,,120,190,200,205,205,525,67.5,M,Александр Рек,1987,Raw,Yes,SBD
1,Evgeniy Karpov,O,72.4,180,190,-195,190,135,140,-142.5,140,-185,195,-202.5,195,525,75,M,Евгений Карпов,1979,Raw,Yes,SBD
2,Sergey Arzumanov,O,72.9,165,-175,180,180,125,130,-135,130,190,200,-222.5,200,510,75,M,Сергей Арзуманов,1990,Raw,Yes,SBD
DQ,Aleksandr Vostrikov,T,80.2,120,-130,140,140,-95,-105,-105,,,,,,,82.5,M,Александр Востриков,2001,Raw,Yes,SBD
1,Nikita Kalinin,J,80.9,130,145,-160,145,80,90,-95,90,120,130,140,140,375,82.5,M,Никита Калинин,1996,Raw,Yes,SBD
1,Artem Martynyuk,O,80.5,155,160,165,165,125,130,-132.5,130,190,200,215,215,510,82.5,M,Артем Мартынюк,1985,Raw,Yes,SBD
DQ,Dmitriy Karpeev,O,80.6,190,205,207.5,207.5,-135,-135,-135,,,,,,,82.5,M,Дмитрий Карпеев,1984,Raw,Yes,SBD
1,Aleksey Shlychkov,J,87.3,170,-180,-180,170,107.5,115,120,120,200,212.5,220,220,510,90,M,Алексей Шлычков,1996,Raw,Yes,SBD
2,Sergey Fomenko,J,85.5,160,170,175,175,110,120,125,125,180,-190,-190,180,480,90,M,Сергей Фоменко,1996,Raw,Yes,SBD
1,Vadim Malov,O,89.1,190,-205,205,205,110,-120,-120,110,232.5,-250,252.5,252.5,567.5,90,M,Вадим Малов,1990,Raw,Yes,SBD
2,Dmitriy Suprunov,O,88,180,190,195,195,145,-150,-150,145,210,220,-235,220,560,90,M,Дмитрий Супрунов,1989,Raw,Yes,SBD
3,Mikhail Pashev,O,89.3,160,172.5,-177.5,172.5,-130,-130,130,130,195,212.5,-220,212.5,515,90,M,Михаил Пашев,1986,Raw,Yes,SBD
4,Dmitriy Kochanov,O,88.5,-155,155,165,165,110,-115,-115,110,170,185,-190,185,460,90,M,Дмитрий Кочанов,1980,Raw,Yes,SBD
5,Aleksey Lobachev,O,88.9,125,132.5,137.5,137.5,-117.5,120,125,125,175,182.5,190,190,452.5,90,M,Алексей Лобачев,1984,Raw,Yes,SBD
6,Aleksey Kalibernov,O,86.5,-150,-150,150,150,-120,125,-130,125,150,-160,-160,150,425,90,M,Алексей Калибернов,1988,Raw,Yes,SBD
1,Mikhail Rublev,O,98,170,177.5,185,185,160,165,170,170,200,217.5,-225,217.5,572.5,100,M,Михаил Рублев,1979,Raw,Yes,SBD
2,Dmitriy Kastov,O,95.3,160,-165,,160,90,100,-105,100,170,185,200,200,460,100,M,Дмитрий Кастов,1992,Raw,Yes,SBD
3,Igor Gorshkov,O,99.2,95,105,-117.5,105,-80,82.5,85,85,120,132.5,-140,132.5,322.5,100,M,Игорь Горшков,1983,Raw,Yes,SBD
1,Aleksandr Efimov,O,108,225,235,240,240,155,-160,160,160,245,255,260,260,660,110,M,Александр Ефимов,1979,Raw,Yes,SBD
1,Aleksandr Kornev,O,116.8,130,140,150,150,125,130,135,135,170,182.5,195,195,480,125,M,Александр Корнев,1990,Raw,Yes,SBD
1,Vadim Khmelev,M1,122.9,155,162.5,167.5,167.5,145,-150,-150,145,150,162.5,172.5,172.5,485,125,M,Вадим Хмелев,1975,Raw,Yes,SBD
1,Konstantin Tikhomirov,O,78.9,220,235,245,245,130,-140,140,140,-230,235,-250,235,620,82.5,M,Константин Тихомиров,1982,Wraps,No,SBD
2,Vladimir Solovyev,O,77.8,190,200,-207.5,200,115,125,127.5,127.5,200,210,-215,210,537.5,82.5,M,Владимир Соловьев,1987,Wraps,No,SBD
3,Ivan Mochalov,O,81.3,160,180,-200,180,90,100,-110,100,160,-170,-170,160,440,82.5,M,Иван Мочалов,1986,Wraps,No,SBD
1,Aleksey Markin,O,89.1,-270,-270,270,270,160,170,-175,170,240,-252.5,-252.5,240,680,90,M,Алексей Маркин,1986,Wraps,No,SBD
2,Aleksandr Lebedev,O,87.7,190,207.5,-220,207.5,120,127.5,137.5,137.5,190,210,-225,210,555,90,M,Александр Лебедев,1993,Wraps,No,SBD
3,Valeriy Kuzmichev,O,83.8,160,-170,-170,160,90,100,110,110,160,180,-200,180,450,90,M,Валерий Кузьмичев,1980,Wraps,No,SBD
DQ,Stanislav Yarukov,O,89.6,235,242.5,,242.5,150,-155,,150,-305,-305,-305,,,90,M,Станислав Яруков,1990,Wraps,No,SBD
1,Andrey Medvedev,M5,85.5,125,130,135,135,95,100,102.5,102.5,135,145,155,155,392.5,90,M,Андрей Медведев,1954,Wraps,No,SBD
1,Aleksey Sokolov,O,97.1,230,250,-262.5,250,130,140,145,145,240,250,257.5,257.5,652.5,100,M,Алексей Соколов,1990,Wraps,No,SBD
2,Mikhail Prikhodko,O,99.7,210,-225,230,230,-120,125,132.5,132.5,250,270,285,285,647.5,100,M,Михаил Приходько,1992,Wraps,No,SBD
3,Sergey Varfolomeev,O,99,-210,210,-225,210,155,160,-165,160,220,230,-250,230,600,100,M,Сергей Варфоломеев,1981,Wraps,No,SBD
DQ,Igor Chernyavskiy,O,96.1,-210,-210,-210,,,,,,,,,,,100,M,Игорь Чернявский,1984,Wraps,No,SBD
1,Pavel Petrakov,O,108.8,245,255,,255,165,177.5,182.5,182.5,260,285,-300,285,722.5,110,M,Павел Петраков,1990,Wraps,No,SBD
DQ,Daniil Konyukhov,O,109.1,-275,-275,-275,,,,,,,,,,,110,M,Даниил Конюхов,1994,Wraps,No,SBD
1,Nadezhda Mochalova,T,45.1,-55,55,-65,55,47.5,-50,52.5,52.5,70,72.5,75,75,182.5,48,F,Надежда Мочалова,2007,Wraps,Yes,SBD
1,Viktoriya Kononenko,J,51.7,95,-105,-105,95,55,60,,60,120,-130,,120,275,52,F,Виктория Кононенко,1996,Wraps,Yes,SBD
1,Anna Orlova,O,54.5,75,80,-85,80,40,45,50,50,-90,90,100,100,230,56,F,Анна Орлова,1994,Wraps,Yes,SBD
DQ,Darya Shtanko,J,57.3,-100,-105,105,105,,,,,,,,,,60,F,Дарья Штанько,1998,Wraps,Yes,SBD
1,Natalya Shilina,T,64.9,95,-100,-100,95,40,-45,-45,40,95,-100,,95,230,67.5,F,Наталья Шилина,1999,Wraps,Yes,SBD
1,Yana Zenkova,J,101.2,-130,130,140,140,55,60,-62.5,60,130,140,,140,340,90+,F,Яна Зенькова,1998,Wraps,Yes,SBD
1,Stanislav Vanyukhanov,J,67.5,210,-222.5,225,225,112.5,120,125,125,175,190,-195,190,540,67.5,M,Станислав Ванюханов,1996,Wraps,Yes,SBD
1,Stanislav Vanyukhanov,O,67.5,210,-222.5,225,225,112.5,120,125,125,175,190,-195,190,540,67.5,M,Станислав Ванюханов,1996,Wraps,Yes,SBD
DQ,Evgeniy Lebedikov,O,72.7,190,200,210,210,100,-110,110,110,-230,-230,-230,,,75,M,Евгений Лебедиков,1992,Wraps,Yes,SBD
1,Vladislav Urzhumtsev,T,76.8,170,-180,180,180,90,100,110,110,170,180,190,190,480,82.5,M,Владислав Уржумцев,2000,Wraps,Yes,SBD
1,Vladislav Zlobin,O,80.9,-160,160,-170,160,90,-100,-100,90,160,170,180,180,430,82.5,M,Владислав Злобин,1992,Wraps,Yes,SBD
1,Dmitriy Golubev,O,88.5,170,185,-200,185,120,130,137.5,137.5,180,200,-210,200,522.5,90,M,Дмитрий Голубев,1992,Wraps,Yes,SBD
1,Valeriy Mishakov,J,94.9,210,230,-240,230,135,150,,150,220,240,-250,240,620,100,M,Валерий Мишаков,1998,Wraps,Yes,SBD
1,Yuriy Marenkov,O,96.7,220,230,-240,230,150,155,-160,155,220,230,-235,230,615,100,M,Юрий Маренков,1976,Wraps,Yes,SBD
2,Vasiliy Sukharev,O,98.5,-240,240,-245,240,155,165,-170,165,200,-220,-220,200,605,100,M,Василий Сухарев,1980,Wraps,Yes,SBD
3,Roman Aniskin,O,99.2,160,170,-180,170,100,107.5,110,110,160,170,180,180,460,100,M,Роман Аниськин,1992,Wraps,Yes,SBD
1,Yuriy Marenkov,M1,96.7,220,230,-240,230,150,155,-160,155,220,230,-235,230,615,100,M,Юрий Маренков,1976,Wraps,Yes,SBD
1,Sergey Kiselev,J,107.5,240,-250,-250,240,160,170,,170,240,-255,,240,650,110,M,Сергей Киселев,1995,Wraps,Yes,SBD
1,Dmitriy Ilyukhin,O,104.3,-200,200,210,210,140,150,-155,150,220,-240,240,240,600,110,M,Дмитрий Илюхин,1982,Wraps,Yes,SBD
1,Daniil Sinyakov,O,117.1,180,200,215,215,145,-152.5,157.5,157.5,-170,180,200,200,572.5,125,M,Даниил Синяков,1994,Wraps,Yes,SBD
DQ,Inna Imenyeva,O,73,,,,,47.5,50,55,55,115,120,125,125,,75,F,Инна Именьева,1994,Raw,No,BD
DQ,Stanislav Yarukov,O,89.6,,,,,150,-155,,150,-305,-305,-305,,,90,M,Станислав Яруков,1990,Raw,No,BD
DQ,Grigoriy Sarkisov,J,97.7,,,,,150,-155,155,155,-200,210,225,225,,100,M,Григорий Саркисов,1996,Raw,No,BD
DQ,Aleksey Gruzin,O,108.1,,,,,182.5,-192.5,-195,182.5,285,300,-322.5,300,,110,M,Алексей Грузин,1983,Raw,No,BD
DQ,Daniil Konyukhov,O,109.1,,,,,182.5,190,200,200,275,-290,,275,,110,M,Даниил Конюхов,1994,Raw,No,BD
DQ,Andrey Imenyev,O,106,,,,,185,192.5,-200,192.5,245,-257.5,,245,,110,M,Андрей Именьев,1989,Raw,No,BD
DQ,Leonid Novikov,O,113.6,,,,,-140,145,150,150,220,-230,-230,220,,125,M,Леонид Новиков,1983,Raw,No,BD
DQ,Inna Kalinichenko,T,47.3,,,,,50,52.5,-55,52.5,-115,115,117.5,117.5,,48,F,Инна Калиниченко,1999,Raw,Yes,BD
DQ,Eseniya Komlyakova,T,58.9,,,,,40,-42.5,-42.5,40,-90,90,-100,90,,60,F,Есения Комлякова,2001,Raw,Yes,BD
DQ,Olga Sidorova,O,59.8,,,,,55,,,55,110,,,110,,60,F,Ольга Сидорова,1966,Raw,Yes,BD
DQ,Irina Vinokurova,O,58.8,,,,,40,45,-50,45,100,105,-110,105,,60,F,Ирина Винокурова,1987,Raw,Yes,BD
DQ,Ivan Pashintsev,T,44.1,,,,,-35,35,-40,35,70,75,80,80,,52,M,Иван Пашинцев,2006,Raw,Yes,BD
DQ,Ovik Andreasyan,T,54.1,,,,,55,-57.5,-57.5,55,85,90,100,100,,56,M,Овик Андреасян,2000,Raw,Yes,BD
DQ,Maksim Ozherelyev,T,65.7,,,,,70,75,-77.5,75,155,160,165,165,,67.5,M,Максим Ожерельев,2002,Raw,Yes,BD
DQ,Mikhail Nikishov,T,65.8,,,,,-60,60,-72.5,60,110,-120,-120,110,,67.5,M,Михаил Никишов,2003,Raw,Yes,BD
DQ,Sergey Kovalev,T,71,,,,,80,85,-87.5,85,-160,160,-165,160,,75,M,Сергей Ковалев,2001,Raw,Yes,BD
DQ,Anton Medvednikov,O,71.1,,,,,122.5,-130,130,130,170,182.5,190,190,,75,M,Антон Медведников,1988,Raw,Yes,BD
DQ,Dmitriy Kuzmichev,J,86,,,,,-130,130,-135,130,220,230,-235,230,,90,M,Дмитрий Кузьмичев,1997,Raw,Yes,BD
DQ,Sergey Lukyanov,O,88.7,,,,,105,110,-115,110,230,-240,242.5,242.5,,90,M,Сергей Лукьянов,1983,Raw,Yes,BD
DQ,Sergey Mischenko,O,99.7,,,,,140,152.5,-162.5,152.5,-242.5,242.5,-275,242.5,,100,M,Сергей Мищенко,1988,Raw,Yes,BD
1,Aleksey Emelyanov,O,79.9,275,280,300,300,185,-192.5,192.5,192.5,250,262.5,267.5,267.5,760,82.5,M,Алексей Емельянов,1983,Single-ply,No,SBD
1,Lyubov Znamenskaya,M1,59.8,,,,,70,77.5,80,80,,,,,80,60,F,Любовь Знаменская,1977,Raw,No,B
DQ,Aleksandr Matveev,O,67.4,,,,,-130,,,,,,,,,67.5,M,Александр Матвеев,1974,Raw,No,B
1,Nikolay Belikov,O,74,,,,,135,140,142.5,142.5,,,,,142.5,75,M,Николай Беликов,1989,Raw,No,B
1,Artem Rukavishnikov,T,78.3,,,,,140,145,-150,145,,,,,145,82.5,M,Артем Рукавишников,1999,Raw,No,B
1,Konstantin Penko,M4,81.5,,,,,105,-110,-110,105,,,,,105,82.5,M,Константин Пенько,1962,Raw,No,B
1,Evgeniy Glotov,J,89.9,,,,,195,-202.5,-202.5,195,,,,,195,90,M,Евгений Глотов,1995,Raw,No,B
1,Vladislav Volchanov,O,86.8,,,,,170,180,185,185,,,,,185,90,M,Владислав Волчанов,1975,Raw,No,B
2,Aleksey Kondakov,O,89.1,,,,,167.5,175,-180,175,,,,,175,90,M,Алексей Кондаков,1970,Raw,No,B
3,Evgeniy Rumyantsev,O,88.8,,,,,152.5,160,-165,160,,,,,160,90,M,Евгений Румянцев,1988,Raw,No,B
4,Ilya Kapin,O,89.5,,,,,142.5,152.5,-155,152.5,,,,,152.5,90,M,Илья Капин,1981,Raw,No,B
5,Anton Sosunov,O,85.3,,,,,140,-142.5,-142.5,140,,,,,140,90,M,Антон Сосунов,1980,Raw,No,B
1,Vladislav Volchanov,M1,86.8,,,,,170,180,185,185,,,,,185,90,M,Владислав Волчанов,1975,Raw,No,B
2,Aleksey Slabun,M1,89.8,,,,,-165,165,-175,165,,,,,165,90,M,Алексей Слабун,1976,Raw,No,B
1,Aleksey Kondakov,M2,89.1,,,,,167.5,175,-180,175,,,,,175,90,M,Алексей Кондаков,1970,Raw,No,B
1,Oleg Krylov,J,96.5,,,,,150,155,160,160,,,,,160,100,M,Олег Крылов,1996,Raw,No,B
2,Grigoriy Sarkisov,J,97.7,,,,,150,-155,155,155,,,,,155,100,M,Григорий Саркисов,1996,Raw,No,B
1,Aleksey Nikolaenko,O,92.3,,,,,200,-205,205,205,,,,,205,100,M,Алексей Николаенко,1989,Raw,No,B
2,Sergey Gavrilyuk,O,98.6,,,,,180,185,192.5,192.5,,,,,192.5,100,M,Сергей Гаврилюк,1988,Raw,No,B
3,Dmitriy Panasenko,O,99.5,,,,,-165,172.5,-185,172.5,,,,,172.5,100,M,Дмитрий Панасенко,1993,Raw,No,B
4,Ilya Kononov,O,98.5,,,,,155,160,162.5,162.5,,,,,162.5,100,M,Илья Кононов,1986,Raw,No,B
1,Andrey Imenyev,O,106,,,,,185,192.5,-200,192.5,,,,,192.5,110,M,Андрей Именьев,1989,Raw,No,B
2,Aleksey Gruzin,O,108.1,,,,,192.5,,,192.5,,,,,192.5,110,M,Алексей Грузин,1983,Raw,No,B
1,Artem Golovin,M1,107.7,,,,,197.5,207.5,-215,207.5,,,,,207.5,110,M,Артем Головин,1977,Raw,No,B
2,Sergey Kolganov,M1,108.4,,,,,197.5,207.5,-215,207.5,,,,,207.5,110,M,Сергей Колганов,1978,Raw,No,B
3,Vladimir Kazakov,M1,106,,,,,150,160,167.5,167.5,,,,,167.5,110,M,Владимир Казаков,1974,Raw,No,B
1,Andrey Korolev,O,118.5,,,,,-202.5,202.5,207.5,207.5,,,,,207.5,125,M,Андрей Королев,1993,Raw,No,B
2,Aleksey Nemov,O,121.4,,,,,180,192.5,200,200,,,,,200,125,M,Алексей Немов,1990,Raw,No,B
3,Aleksandr Pozdnyakov,O,117.8,,,,,180,-190,190,190,,,,,190,125,M,Александр Поздняков,1988,Raw,No,B
DQ,Aleksey Smirnov,O,124.6,,,,,-175,-175,-175,,,,,,,125,M,Алексей Смирнов,1988,Raw,No,B
DQ,Vadim Zaytsev,M1,111.5,,,,,-195,,,,,,,,,125,M,Вадим Зайцев,1977,Raw,No,B
1,Andrey Vysotskiy,O,134,,,,,210,217.5,222.5,222.5,,,,,222.5,140,M,Андрей Высоцкий,1977,Raw,No,B
1,Andrey Vysotskiy,M1,134,,,,,210,217.5,222.5,222.5,,,,,222.5,140,M,Андрей Высоцкий,1977,Raw,No,B
1,Inna Kalinichenko,T,47.3,,,,,50,52.5,-55,52.5,,,,,52.5,48,F,Инна Калиниченко,1999,Raw,Yes,B
1,Tatyana Yaremaka,O,55.3,,,,,67.5,-72.5,-72.5,67.5,,,,,67.5,56,F,Татьяна Яремака,1983,Raw,Yes,B
2,Elena Yudina,O,54.2,,,,,42.5,47.5,-50,47.5,,,,,47.5,56,F,Елена Юдина,1985,Raw,Yes,B
1,Anna Golub,O,58.3,,,,,47.5,50,52.5,52.5,,,,,52.5,60,F,Анна Голуб,1992,Raw,Yes,B
1,Irina Bukhantseva,M2,58.1,,,,,42.5,47.5,-55,47.5,,,,,47.5,60,F,Ирина Буханцева,1971,Raw,Yes,B
1,Olga Sidorova,M3,59.8,,,,,50,55,-60,55,,,,,55,60,F,Ольга Сидорова,1966,Raw,Yes,B
1,Natalya Markovich,M1,73.9,,,,,45,50,55,55,,,,,55,75,F,Наталья Маркович,1976,Raw,Yes,B
1,Valentin Bukhantsev,J,57,,,,,80,82.5,-85,82.5,,,,,82.5,60,M,Валентин Буханцев,1998,Raw,Yes,B
1,Aleksey Koktash,T,67.4,,,,,100,107.5,-112.5,107.5,,,,,107.5,67.5,M,Алексей Кокташ,2002,Raw,Yes,B
1,Maksim Zharkoy,O,67,,,,,-90,90,97.5,97.5,,,,,97.5,67.5,M,Максим Жаркой,1993,Raw,Yes,B
DQ,Aleksandr Matveev,O,67.4,,,,,-130,-130,-130,,,,,,,67.5,M,Александр Матвеев,1974,Raw,Yes,B
1,Aleksandr Yakupov,T,73.5,,,,,117.5,122.5,-135,122.5,,,,,122.5,75,M,Александр Якупов,1999,Raw,Yes,B
2,Sergey Olkhovskiy,T,73.2,,,,,-105,105,-110,105,,,,,105,75,M,Сергей Ольховский,1999,Raw,Yes,B
1,Konstantin Nechipurenko,J,72.5,,,,,125,-135,135,135,,,,,135,75,M,Константин Нечипуренко,1996,Raw,Yes,B
2,Aleksey Gerasimov,J,74.4,,,,,-130,130,135,135,,,,,135,75,M,Алексей Герасимов,1997,Raw,Yes,B
3,Sergey Kitavnin,J,74.6,,,,,120,-135,135,135,,,,,135,75,M,Сергей Китавнин,1996,Raw,Yes,B
4,Artem Khusainov,J,68.3,,,,,120,125,130,130,,,,,130,75,M,Артем Хусаинов,1997,Raw,Yes,B
5,Gennadiy Mikhailyan,J,72.4,,,,,117.5,125,-130,125,,,,,125,75,M,Геннадий Михаилян,1996,Raw,Yes,B
6,Yan Gordobin,J,74.5,,,,,117.5,122.5,125,125,,,,,125,75,M,Ян Гордобин,1996,Raw,Yes,B
7,Sergey Zotov,J,71.9,,,,,117.5,122.5,-127.5,122.5,,,,,122.5,75,M,Сергей Зотов,1996,Raw,Yes,B
8,Ivan Denisov,J,73.4,,,,,110,117.5,-125,117.5,,,,,117.5,75,M,Иван Денисов,1998,Raw,Yes,B
9,Georgiy Manvelidze,J,74.1,,,,,117.5,-125,-125,117.5,,,,,117.5,75,M,Георгий Манвелидзе,1995,Raw,Yes,B
1,Georgiy Davidyan,O,73.7,,,,,125,-135,135,135,,,,,135,75,M,Георгий Давидян,1986,Raw,Yes,B
2,Anton Bukhantsev,O,72.9,,,,,115,120,-125,120,,,,,120,75,M,Антон Буханцев,1991,Raw,Yes,B
3,Pavel Tovin,O,73.7,,,,,112.5,117.5,120,120,,,,,120,75,M,Павел Товин,1990,Raw,Yes,B
4,Daniil Sushkov,O,70.7,,,,,100,-107.5,-107.5,100,,,,,100,75,M,Даниил Сушков,,Raw,Yes,B
DQ,Ivan Goncharov,O,72,,,,,-117.5,-117.5,-117.5,,,,,,,75,M,Иван Гончаров,1987,Raw,Yes,B
1,Nikita Mizonov,T,82.3,,,,,110,115,120,120,,,,,120,82.5,M,Никита Мизонов,1999,Raw,Yes,B
1,Maksim Platonov,J,79.2,,,,,130,-140,-140,130,,,,,130,82.5,M,Максим Платонов,1995,Raw,Yes,B
DQ,Ilya Stefashin,J,80.9,,,,,-117.5,-117.5,,,,,,,,82.5,M,Илья Стефашин,1995,Raw,Yes,B
1,Oleg Gabidulin,O,80.2,,,,,140,-145,-145,140,,,,,140,82.5,M,Олег Габидулин,1994,Raw,Yes,B
2,Stepan Dupenko,O,82.5,,,,,115,122.5,-127.5,122.5,,,,,122.5,82.5,M,Степан Дупенко,1989,Raw,Yes,B
3,Aleksey Tokarev,O,82.1,,,,,-120,120,-127.5,120,,,,,120,82.5,M,Алексей Токарев,1991,Raw,Yes,B
DQ,Vladimir Popov,O,80.2,,,,,-135,-145,-145,,,,,,,82.5,M,Владимир Попов,1986,Raw,Yes,B
DQ,Yuriy Emelin,O,82,,,,,-135,-140,-140,,,,,,,82.5,M,Юрий Емелин,1986,Raw,Yes,B
1,Stanislav Frolov,O,89.6,,,,,-160,167.5,170,170,,,,,170,90,M,Станислав Фролов,1986,Raw,Yes,B
2,Ivan Yankin,O,89.1,,,,,-152.5,152.5,-157.5,152.5,,,,,152.5,90,M,Иван Янкин,1986,Raw,Yes,B
3,Maksim Eliseev,O,88.8,,,,,127.5,132.5,-137.5,132.5,,,,,132.5,90,M,Максим Елисеев,1991,Raw,Yes,B
4,Rustam Fomin,O,89.6,,,,,125,132.5,-135,132.5,,,,,132.5,90,M,Рустам Фомин,1992,Raw,Yes,B
5,Aleksandr Tayurskiy,O,88.1,,,,,110,-120,-120,110,,,,,110,90,M,Александр Таюрский,1979,Raw,Yes,B
DQ,Vitaliy Fedin,O,87.8,,,,,-120,-120,-120,,,,,,,90,M,Виталий Федин,1987,Raw,Yes,B
1,Ivan Kislitsyn,T,97.1,,,,,-55,55,-65,55,,,,,55,100,M,Иван Кислицын,2003,Raw,Yes,B
1,Evgeniy Boytsov,O,96.5,,,,,175,185,190,190,,,,,190,100,M,Евгений Бойцов,1988,Raw,Yes,B
2,Maksim Pchelkin,O,99.7,,,,,-162.5,162.5,-165,162.5,,,,,162.5,100,M,Максим Пчелкин,1983,Raw,Yes,B
3,Maksim Sadykov,O,98.1,,,,,145,155,157.5,157.5,,,,,157.5,100,M,Максим Садыков,1990,Raw,Yes,B
4,Sergey Mischenko,O,99.7,,,,,140,152.5,-162.5,152.5,,,,,152.5,100,M,Сергей Мищенко,1988,Raw,Yes,B
5,Ilya Prokhorov,O,99.6,,,,,142.5,150,-162.5,150,,,,,150,100,M,Илья Прохоров,1987,Raw,Yes,B
1,Igor Klimanov,M1,95.6,,,,,160,165,-170,165,,,,,165,100,M,Игорь Климанов,1974,Raw,Yes,B
1,Yuriy Shurygin,M2,99.2,,,,,155,-162.5,,155,,,,,155,100,M,Юрий Шурыгин,1971,Raw,Yes,B
1,Pavel Bukhantsev,O,107.7,,,,,177.5,-182.5,-182.5,177.5,,,,,177.5,110,M,Павел Буханцев,1969,Raw,Yes,B
2,Igor Klochkov,O,107.6,,,,,150,160,167.5,167.5,,,,,167.5,110,M,Игорь Клочков,1990,Raw,Yes,B
3,Vitaliy Kostin,O,100.9,,,,,110,135,147.5,147.5,,,,,147.5,110,M,Виталий Костин,1989,Raw,Yes,B
1,Ilya Gridnev,M1,109.7,,,,,160,-167.5,-167.5,160,,,,,160,110,M,Илья Гриднев,1976,Raw,Yes,B
1,Pavel Bukhantsev,M2,107.7,,,,,177.5,-182.5,-182.5,177.5,,,,,177.5,110,M,Павел Буханцев,1969,Raw,Yes,B
2,Vladimir Stepanov,M2,105.7,,,,,170,172.5,-175,172.5,,,,,172.5,110,M,Владимир Степанов,1970,Raw,Yes,B
DQ,Ivan Burlov,M2,108.9,,,,,-177.5,-177.5,-177.5,,,,,,,110,M,Иван Бурлов,1970,Raw,Yes,B
1,Viktor Pavlov,O,121,,,,,180,187.5,-192.5,187.5,,,,,187.5,125,M,Виктор Павлов,1988,Raw,Yes,B
1,Dmitriy Kalyakin,O,135.9,,,,,185,192.5,-200,192.5,,,,,192.5,140,M,Дмитрий Калякин,1984,Raw,Yes,B
1,Valeriy Kurochkin,O,99.1,,,,,280,-300,-300,280,,,,,280,100,M,Валерий Курочкин,1978,Multi-ply,No,B
1,Olga Rozhkova,O,58.4,,,,,115,122.5,-127.5,122.5,,,,,122.5,60,F,Ольга Рожкова,1974,Single-ply,No,B
1,Irina Volova,J,51,-75,-75,80,80,,,,,,,,,80,52,F,Ирина Волова,1997,Raw,Yes,S
1,Yuliya Govricheva,O,51.3,75,-82.5,82.5,82.5,,,,,,,,,82.5,52,F,Юлия Говричева,1990,Raw,Yes,S
1,Olga Sidorova,M5,59.8,-80,85,95,95,,,,,,,,,95,60,F,Ольга Сидорова,1966,Raw,Yes,S
1,Elena Polonetskaya,O,81.1,-100,-100,100,100,,,,,,,,,100,82.5,F,Елена Полонецкая,1989,Raw,Yes,S
1,Aleksandr Rek,O,66.3,190,200,-207.5,200,,,,,,,,,200,67.5,M,Александр Рек,1987,Raw,Yes,S
1,Roman Asanov,O,81.1,150,152.5,,152.5,,,,,,,,,152.5,82.5,M,Роман Асанов,1992,Raw,Yes,S
1,Eslam Soliman,J,73.8,,,,,,,,,-210,-210,210,210,210,75,M,Еслам Солиман,1996,Raw,No,D
DQ,Vladimir Sidorov,O,72.1,,,,,,,,,-200,-200,-200,,,75,M,Владимир Сидоров,1982,Raw,No,D
1,Aleksandr Ilyenko,J,77.8,,,,,,,,,235,250,-265,250,250,82.5,M,Александр Ильенко,1996,Raw,No,D
1,Yuriy Agafonov,O,81.7,,,,,,,,,-250,250,260,260,260,82.5,M,Юрий Агафонов,1993,Raw,No,D
2,Timur Bogdanov,O,81.8,,,,,,,,,240,250,-270,250,250,82.5,M,Тимур Богданов,1988,Raw,No,D
1,Dmitry Gorelikov,O,89.1,,,,,,,,,220,240,-260,240,240,90,M,Дмитрий Гореликов,1968,Raw,No,D
DQ,Stanislav Yarukov,O,89.6,,,,,,,,,-305,-305,-305,,,90,M,Станислав Яруков,1990,Raw,No,D
DQ,Ilya Fedorov,O,89.7,,,,,,,,,-370,-380,,,,90,M,Илья Фёдоров,1992,Raw,No,D
1,Dmitry Gorelikov,M3,89.1,,,,,,,,,220,240,-260,240,240,90,M,Дмитрий Гореликов,1968,Raw,No,D
1,Grigoriy Sarkisov,J,97.7,,,,,,,,,-200,210,225,225,225,100,M,Григорий Саркисов,1996,Raw,No,D
1,Mikhail Prikhodko,O,99.7,,,,,,,,,285,,,285,285,100,M,Михаил Приходько,1992,Raw,No,D
2,Vladimir Brusov,O,97.1,,,,,,,,,265,275,-285,275,275,100,M,Владимир Брусов,1983,Raw,No,D
DQ,Aleksandr Medvedev,O,99.9,,,,,,,,,-272.5,-272.5,-272.5,,,100,M,Александр Медведев,1989,Raw,No,D
1,Aleksey Gruzin,O,108.1,,,,,,,,,285,300,-322.5,300,300,110,M,Алексей Грузин,1983,Raw,No,D
2,Pavel Petrakov,O,108.8,,,,,,,,,260,285,-300,285,285,110,M,Павел Петраков,1990,Raw,No,D
1,Nikolay Petrichenko,M1,108.7,,,,,,,,,-140,140,155,155,155,110,M,Николай Петриченко,1978,Raw,No,D
1,Aleksey Nemov,O,121.4,,,,,,,,,-290,300,-310,300,300,125,M,Алексей Немов,1990,Raw,No,D
1,Sergey Shiryaev,O,132.9,,,,,,,,,320,-345,,320,320,140,M,Сергей Ширяев,1975,Raw,No,D
1,Inna Kalinichenko,T,47.3,,,,,,,,,-115,115,117.5,117.5,117.5,48,F,Инна Калиниченко,1999,Raw,Yes,D
1,Inna Kalinichenko,O,47.3,,,,,,,,,-115,115,117.5,117.5,117.5,48,F,Инна Калиниченко,1999,Raw,Yes,D
1,Dina Karpova,O,51,,,,,,,,,82.5,90,95,95,95,52,F,Дина Карпова,1980,Raw,Yes,D
2,Taisiya Sokolova,O,51.7,,,,,,,,,90,-95,-95,90,90,52,F,Таисия Соколова,1992,Raw,Yes,D
1,Valeriya Zdorova,O,55.5,,,,,,,,,90,100,110,110,110,56,F,Валерия Здорова,1993,Raw,Yes,D
1,Vera Strokina,J,58.7,,,,,,,,,105,115,122.5,122.5,122.5,60,F,Вера Строкина,1995,Raw,Yes,D
1,Anastasiya Barkova,O,59.4,,,,,,,,,105,115,120,120,120,60,F,Анастасия Баркова,1983,Raw,Yes,D
2,Alina Myasoedova,O,58.5,,,,,,,,,-107.5,112.5,-120,112.5,112.5,60,F,Алина Мясоедова,1988,Raw,Yes,D
3,Yuliya Panina,O,59.7,,,,,,,,,60,-70,-70,60,60,60,F,Юлия Панина,1984,Raw,Yes,D
1,Olga Sidorova,M3,59.8,,,,,,,,,100,110,,110,110,60,F,Ольга Сидорова,1966,Raw,Yes,D
1,Anastasiya Melnik,J,65.7,,,,,,,,,-125,130,135,135,135,67.5,F,Анастасия Мельник,1996,Raw,Yes,D
1,Alisa Fedyunina,J,75,,,,,,,,,100,-115,115,115,115,75,F,Алиса Федюнина,1997,Raw,Yes,D
1,Ivan Pashintsev,T,44.1,,,,,,,,,70,75,80,80,80,52,M,Иван Пашинцев,2006,Raw,Yes,D
1,Aleksandr Skvortsov,T,60,,,,,,,,,150,155,-162.5,155,155,60,M,Александр Скворцов,2004,Raw,Yes,D
1,Maksim Ozherelyev,T,65.7,,,,,,,,,155,160,165,165,165,67.5,M,Максим Ожерельев,2002,Raw,Yes,D
1,Sergey Kovalev,T,71,,,,,,,,,-160,160,-165,160,160,75,M,Сергей Ковалев,2001,Raw,Yes,D
1,Filipp Gadalov,T,80.5,,,,,,,,,190,195,200,200,200,82.5,M,Филипп Гадалов,1999,Raw,Yes,D
1,Roman Yakovlev,J,80.7,,,,,,,,,170,180,195,195,195,82.5,M,Роман Яковлев,1996,Raw,Yes,D
DQ,Dmitriy Karpeev,O,80.6,,,,,,,,,225,-240,-240,225,,82.5,M,Дмитрий Карпеев,1984,Raw,Yes,D
1,Stepan Dupenko,O,82.5,,,,,,,,,200,210,-220,210,210,82.5,M,Степан Дупенко,1989,Raw,Yes,D
2,Yuriy Ryabinin,O,81.9,,,,,,,,,190,-200,200,200,200,82.5,M,Юрий Рябинин,1980,Raw,Yes,D
1,Dmitriy Kuzmichev,J,86,,,,,,,,,220,230,-235,230,230,90,M,Дмитрий Кузьмичев,1997,Raw,Yes,D
1,Shakhin Aliev,O,87.5,,,,,,,,,235,250,-262.5,250,250,90,M,Шахин Алиев,1997,Raw,Yes,D
2,Sergey Lukyanov,O,88.7,,,,,,,,,230,-240,242.5,242.5,242.5,90,M,Сергей Лукьянов,1983,Raw,Yes,D
3,Dmitriy Suprunov,O,88,,,,,,,,,210,220,-235,220,220,90,M,Дмитрий Супрунов,1989,Raw,Yes,D
DQ,Anton Gasparyan,O,86.6,,,,,,,,,-180,-190,-190,,,90,M,Антон Гаспарян,1984,Raw,Yes,D
1,Grigoriy Sarkisov,J,97.7,,,,,,,,,210,225,232.5,232.5,232.5,100,M,Григорий Саркисов,1996,Raw,Yes,D
2,Nikita Nor,J,96.4,,,,,,,,,-230,230,-245,230,230,100,M,Никита Нор,1996,Raw,Yes,D
3,Aleksey Sergeev,J,93.4,,,,,,,,,190,210,-215,210,210,100,M,Алексей Сергеев,1998,Raw,Yes,D
4,D Marye,J,91.8,,,,,,,,,160,170,180,180,180,100,M,Д Марье,1998,Raw,Yes,D
1,Sergey Mischenko,O,99.7,,,,,,,,,-242.5,242.5,-275,242.5,242.5,100,M,Сергей Мищенко,1988,Raw,Yes,D
2,Nikita Nor,O,96.4,,,,,,,,,-230,230,-245,230,230,100,M,Никита Нор,1996,Raw,Yes,D
1,Vitaliy Kostin,O,100.9,,,,,,,,,215,230,-247.5,230,230,110,M,Виталий Костин,1989,Raw,Yes,D
1,Vladimir Stepanov,M2,105.7,,,,,,,,,230,240,250,250,250,110,M,Владимир Степанов,1970,Raw,Yes,D
