Place,Sex,Name,CyrillicName,BodyweightKg,Squat1Kg,Squat2Kg,Squat3Kg,Best3SquatKg,Squat4Kg,Bench1Kg,Bench2Kg,Bench3Kg,Best3BenchKg,Bench4Kg,Deadlift1Kg,Deadlift2Kg,Deadlift3Kg,Best3DeadliftKg,Deadlift4Kg,TotalKg,WeightClassKg,Event,Equipment,Tested,Division,Age,BirthDate
1,M,Artem Butin,Артем Бутин,79.9,145,150,160,160,,100,102.5,105,105,,-170,170,-180,170,,435,82.5,SBD,Wraps,Yes,Amateur Teen 17-19,19,1999-03-28
1,M,Dmitriy Zakharov,Дмитрий Захаров,80.8,175,185,,185,,135,142.5,147.5,147.5,,210,220,230,230,,562.5,82.5,SBD,Wraps,Yes,Amateur Open,39,1978-12-01
2,M,Viktor Malyonkin,Виктор Малёнкин,82.4,-165,-165,165,165,,115,120,-125,120,,180,192.5,205,205,,490,82.5,SBD,Wraps,Yes,Amateur Open,30,1988-06-30
1,F,Alena Ulbutova,Алена Улбутова,50.7,72.5,80,-82.5,80,,42.5,-45,-45,42.5,,85,92.5,95,95,,217.5,52,SBD,Wraps,No,Pro Open,24,1994-01-24
1,F,Anastasiya Potemkina,Анастасия Потемкина,65.8,90,95,100,100,,50,57.5,-62.5,57.5,,125,135,-140,135,,292.5,67.5,SBD,Wraps,No,Pro Juniors,23,1994-12-19
1,M,Artur Avetisyan,Артур Аветисян,65.5,95,105,110,110,,65,70,-72.5,70,,105,112.5,-117.5,112.5,,292.5,67.5,SBD,Wraps,No,Pro Teen 17-19,17,2001-06-19
1,M,Yuriy Dragunov,Юрий Драгунов,72.9,130,140,150,150,,90,100,110,110,,170,190,205,205,,465,75,SBD,Wraps,No,Pro Masters 40-49,41,1977-08-05
1,M,Dmitriy Pyokin,Дмитрий Пёкин,79.9,105,115,125,125,,-90,90,-92.5,90,,130,-137.5,-137.5,130,,345,82.5,SBD,Wraps,No,Pro Teen 17-19,17,2001-08-15
1,M,Aleksey Mamonov,Алексей Мамонов,109.8,230,250,,250,,150,160,165,165,,280,300,,300,,715,110,SBD,Wraps,No,Pro Masters 40-49,42,1976-06-16
DQ,M,Roman Arkhipov,Роман Архипов,96.7,-225,-225,-230,,,,,,,,,,,,,,100,SBD,Wraps,Yes,Amateur Open,33,1985-02-26
1,M,Anton Kraynikov,Антон Крайников,101.5,-180,180,,180,,120,-125,125,125,,190,-200,200,200,,505,110,SBD,Wraps,Yes,Amateur Open,28,1990-02-11
1,F,Dilyara Shitova,Диляра Шитова,63.8,-80,85,90,90,,47.5,50,-52.5,50,,90,100,-110,100,,240,67.5,SBD,Wraps,No,Pro Masters 40-49,43,1975-02-14
DQ,M,Ali Dovletov,Али Довлетов,80.5,-182.5,-190,-192.5,,,,,,,,,,,,,,82.5,SBD,Wraps,No,Pro Juniors,20,1997-11-30
1,M,Anton Tsvetkov,Антон Цветков,79.6,-150,160,175,175,,-120,120,-130,120,,170,185,200,200,,495,82.5,SBD,Wraps,No,Pro Open,29,1989-07-12
1,M,Konstantin Terekhin,Константин Терехин,88.4,230,245,250,250,,155,165,170,170,,230,242.5,250,250,,670,90,SBD,Wraps,No,Pro Open,32,1985-12-21
2,M,Ivan Ryazantsev,Иван Рязанцев,86.5,180,-190,-190,180,,130,140,150,150,,205,215,225,225,,555,90,SBD,Wraps,No,Pro Open,27,1991-04-18
1,M,Dmitriy Dragunov,Дмитрий Драгунов,86.6,160,180,-200,180,,120,130,135,135,,170,190,200,200,,515,90,SBD,Wraps,No,Pro Masters 40-49,43,1975-06-11
1,M,Ruben Sagatelyan,Рубэн Сагателян,96.1,130,140,150,150,,-80,80,85,85,,135,150,165,165,,400,100,SBD,Wraps,No,Pro Teen 17-19,17,2001-08-27
1,M,Sergey Savochkin,Сергей Савочкин,98.8,-230,240,-250,240,,160,-170,170,170,,250,270,-280,270,,680,100,SBD,Wraps,No,Pro Open,34,1984-10-09
1,F,Kseniya Moldovanova,Ксения Молдованова,45.15,,,,,,40,45,-52.5,45,,,,,,,45,48,B,Raw,Yes,Amateur Girls 14-16,13,2004-12-19
1,F,Elena Naumova,Елена Наумова,55.5,,,,,,57.5,62.5,-65,62.5,,,,,,,62.5,56,B,Raw,Yes,Amateur Open,29,1989-05-17
1,F,Mariya Nikolaeva,Мария Николаева,60,,,,,,65,-67.5,-67.5,65,,,,,,,65,60,B,Raw,Yes,Amateur Juniors,21,1997-06-15
1,F,Anastasiya Balandina,Анастасия Баландина,67.1,,,,,,57.5,60,-65,60,,,,,,,60,67.5,B,Raw,Yes,Amateur Juniors,19,1999-10-03
DQ,F,Svetlana Shikhanova,Светлана Шиханова,65,,,,,,-57.5,-60,-60,,,,,,,,,67.5,B,Raw,Yes,Amateur Masters 40-49,43,1975-10-22
1,M,Vladislav Petkin,Владислав Петькин,67.5,,,,,,90,-95,-95,90,,,,,,,90,67.5,B,Raw,Yes,Amateur Teen 17-19,18,2000-09-23
1,M,Kirill Kuryshov,Кирилл Курышов,70.6,,,,,,110,-117.5,117.5,117.5,,,,,,,117.5,75,B,Raw,Yes,Amateur Teen 14-16,16,2002-08-04
1,M,Aleksandr Seleznev,Александр Селезнев,81,,,,,,70,75,-80,75,,,,,,,75,82.5,B,Raw,Yes,Amateur Teen 14-16,13,2005-01-31
1,M,Valeriy Konyaev,Валерий Коняев,81,,,,,,120,127.5,130,130,,,,,,,130,82.5,B,Raw,Yes,Amateur Teen 17-19,19,1999-10-11
1,M,Sergey Alekseev,Сергей Алексеев,81.6,,,,,,145,147.5,-150,147.5,,,,,,,147.5,82.5,B,Raw,Yes,Amateur Open,24,1994-06-14
1,M,Baris Khachatryan,Барис Хачатрян,88.9,,,,,,125,132.5,-152.5,132.5,,,,,,,132.5,90,B,Raw,Yes,Amateur Masters 50-59,55,1963-09-01
1,M,Roman Vysochkin,Роман Высочкин,98.1,,,,,,155,162.5,-167.5,162.5,,,,,,,162.5,100,B,Raw,Yes,Amateur Open,26,1992-10-02
2,M,Viktor Elin,Виктор Елин,96.6,,,,,,145,155,-160,155,,,,,,,155,100,B,Raw,Yes,Amateur Open,39,1979-08-22
3,M,Andrey Rybchinskiy,Андрей Рыбчинский,97.6,,,,,,125,140,-145,140,,,,,,,140,100,B,Raw,Yes,Amateur Open,30,1988-05-24
1,M,Aleksey Podtorzhnov,Алексей Подторжнов,107.3,,,,,,150,-160,-160,150,,,,,,,150,110,B,Raw,Yes,Amateur Open,39,1979-04-06
DQ,M,Aleksandr Loginov,Александр Логинов,108.6,,,,,,-160,-160,-167.5,,,,,,,,,110,B,Raw,Yes,Amateur Masters 40-49,49,1969-02-16
1,M,Georgiy Gorbachev,Георгий Горбачев,118.3,,,,,,165,-172.5,-172.5,165,,,,,,,165,125,B,Raw,Yes,Amateur Juniors,23,1995-02-25
1,F,Viktoriya Orlova,Виктория Орлова,52.1,,,,,,50,52.5,-55,52.5,,,,,,,52.5,56,B,Raw,No,Pro Girls 14-16,15,2003-05-22
1,M,Dmitriy Zhukov,Дмитрий Жуков,47.55,,,,,,27.5,-32.5,35,35,,,,,,,35,52,B,Raw,No,Pro Teen 14-16,10,2008-05-30
2,M,Kirill Zhukov,Кирилл Жуков,35.45,,,,,,25,27.5,-30,27.5,,,,,,,27.5,52,B,Raw,No,Pro Teen 14-16,11,2007-02-09
1,M,Rinat Imanbaev,Ринат Иманбаев,64.3,,,,,,65,70,72.5,72.5,,,,,,,72.5,67.5,B,Raw,No,Pro Teen 17-19,17,2001-07-24
1,M,Aleksandr Sorokin,Александр Сорокин,65.7,,,,,,75,-80,-80,75,,,,,,,75,67.5,B,Raw,No,Pro Open,33,1985-01-22
1,M,Vadim Starodubtsev,Вадим Стародубцев,83.1,,,,,,140,145,150,150,,,,,,,150,90,B,Raw,No,Pro Open,26,1992-10-03
2,M,Maksim Zemskov,Максим Земсков,88.9,,,,,,130,-135,-135,130,,,,,,,130,90,B,Raw,No,Pro Open,31,1987-04-29
DQ,M,Sergey Gusev,Сергей Гусев,86.6,,,,,,-170,-180,-180,,,,,,,,,90,B,Raw,No,Pro Open,44,1974-11-01
1,M,Aleksey Zhuravlev,Алексей Журавлев,97.9,,,,,,190,195,197.5,197.5,,,,,,,197.5,100,B,Raw,No,Pro Open,29,1989-09-15
2,M,Dmitriy Naumov,Дмитрий Наумов,99.8,,,,,,170,-180,-185,170,,,,,,,170,100,B,Raw,No,Pro Open,30,1988-04-03
DQ,M,Nikita Kulygin,Никита Кулыгин,97.1,,,,,,-185,-185,-185,,,,,,,,,100,B,Raw,No,Pro Open,27,1991-09-29
1,M,Vladimir Savranov,Владимир Савранов,91.4,,,,,,155,165,-167.5,165,,,,,,,165,100,B,Raw,No,Pro Masters 40-49,41,1977-05-09
1,M,Maksim Kalinin,Максим Калинин,102.6,,,,,,195,-210,210,210,,,,,,,210,110,B,Raw,No,Pro Open,25,1993-06-01
2,M,Sergey Milantev,Сергей Милантьев,103.9,,,,,,190,197.5,205,205,,,,,,,205,110,B,Raw,No,Pro Open,37,1981-10-19
DQ,M,Aleksandr Zhukov,Александр Жуков,102.3,,,,,,-195,-195,-195,,,,,,,,,110,B,Raw,No,Pro Open,35,1983-03-13
1,M,Viktor Elin,Виктор Елин,96.55,,,,,,200,210,215,215,,,,,,,215,100,B,Multi-ply,Yes,Amateur Open,39,1979-08-22
1,M,Ivan Semenikhin,Иван Семенихин,87.85,,,,,,-265,265,280,280,,,,,,,280,90,B,Multi-ply,No,Pro Open,27,1991-03-30
DQ,M,Aleksandr Borshchev,Александр Борщев,98.75,,,,,,-280,-280,-290,,,,,,,,,100,B,Multi-ply,No,Pro Open,32,1986-03-24
1,M,Aleksandr Zhukov,Александр Жуков,102.3,,,,,,-285,285,-305,285,,,,,,,285,110,B,Multi-ply,No,Pro Open,35,1983-03-13
1,M,Anton Volodin,Антон Володин,92.5,,,,,,-260,260,-270,260,,,,,,,260,100,B,Multi-ply,No,Pro Open,35,1983-06-26
1,F,Yuliya Artemova,Юлия Артемова,49.6,,,,,,,,,,,95,-102.5,102.5,102.5,,102.5,52,D,Raw,Yes,Amateur Open,35,1983-02-06
1,M,Ivan Krutov,Иван Крутов,64.3,,,,,,,,,,,170,182.5,-195,182.5,,182.5,67.5,D,Raw,Yes,Amateur Teen 14-16,15,2002-11-21
1,M,Vladislav Petkin,Владислав Петькин,64.5,,,,,,,,,,,125,140,150,150,,150,67.5,D,Raw,Yes,Amateur Teen 17-19,18,2000-09-23
1,M,Sergey Alkhov,Сергей Альхов,98.4,,,,,,,,,,,240,247.5,-250,247.5,,247.5,100,D,Raw,Yes,Amateur Open,34,1984-10-08
1,M,Ivan Ryazantsev,Иван Рязанцев,86.5,,,,,,,,,,,220,230,240,240,,240,90,D,Raw,No,Pro Open,27,1991-04-18
1,M,Aleksandr Losuchenko,Александр Лосученко,89.8,,,,,,,,,,,240,260,267.5,267.5,,267.5,90,D,Raw,No,Pro Masters 60-69,63,1955-02-06
1,M,Ruslan Shabaev,Руслан Шабаев,95,,,,,,,,,,,215,225,-230,225,,225,100,D,Raw,No,Pro Open,28,1990-06-03
1,M,Pavel Ermolaev,Павел Ермолаев,107.2,,,,,,,,,,,280,-300,-300,280,,280,110,D,Raw,No,Pro Open,27,1991-01-17
