Place,Name,State,WeightClassKg,BodyweightKg,Age,Best3SquatKg,Best3BenchKg,Best3DeadliftKg,TotalKg,Sex,Division,Equipment,Event
1,Cynthia Hoang,CA,48,46.75,22,92.5,40,105,237.5,F,Juniors 20-23,Raw,SBD
1,Shey Quadra,CA,52,50.1,21,92.5,37.5,137.5,267.5,F,Juniors 20-23,Raw,SBD
1,Melissa Vejar,CA,56,54.7,20,102.5,45,125,272.5,F,Juniors 20-23,Raw,SBD
1,Ann Dang,CA,60,58.65,22,87.5,40,110,237.5,F,Juniors 20-23,Raw,SBD
1,Rosie Tores,CA,82.5,77.6,20,90,52.5,137.5,280,F,Juniors 20-23,Raw,SBD
1,Shelby Heath,CA,60,59.85,29,140,67.5,172.5,380,F,Open,Raw,SBD
2,Delfina Franco,CA,60,59.85,40,97.5,52.5,120,270,F,Open,Raw,SBD
3,Ann Dang,CA,60,58.65,22,87.5,40,110,237.5,F,Open,Raw,SBD
1,Sheena Parker,CA,67.5,63.65,32,135,72.5,162.5,370,F,Open,Raw,SBD
1,Michelle Vandeburgh,CA,82.5,78.45,32,142.5,92.5,152.5,387.5,F,Open,Raw,SBD
2,Melissa Weng,CA,82.5,80.2,27,110,47.5,105,262.5,F,Open,Raw,SBD
1,Michielle Ouk,CA,90+,94.3,24,150,70,155,375,F,Open,Raw,SBD
2,Jessica Chitwood,CA,90+,151.9,29,132.5,70,137.5,340,F,Open,Raw,SBD
1,Delfina Franco,CA,60,59.85,40,97.5,52.5,120,270,F,Masters 40-44,Raw,SBD
1,Cindy Gonzales,CA,90+,96.4,37,147.5,87.5,182.5,417.5,F,Submasters 35-39,Raw,SBD
1,Seyonn Chin,CA,60,60,23,165,117.5,202.5,485,M,Juniors 20-23,Raw,SBD
1,Luke Fortin,CA,67.5,67.35,23,160,102.5,215,477.5,M,Juniors 20-23,Raw,SBD
1,Kevin Torres,CA,75,73.95,19,187.5,112.5,215,515,M,Juniors 18-19,Raw,SBD
1,Niccolo Galvan,CA,75,71.75,21,180,125,210,515,M,Juniors 20-23,Raw,SBD
1,Max Dang,CA,82.5,75.3,23,192.5,92.5,220,505,M,Juniors 20-23,Raw,SBD
2,Johnathan Forsythe,CA,82.5,80.7,21,185,115,200,500,M,Juniors 20-23,Raw,SBD
3,Neville Mathews,CA,82.5,79.5,22,187.5,125,185,497.5,M,Juniors 20-23,Raw,SBD
1,Philip Pohle,CA,90,87.4,23,185,130,242.5,557.5,M,Juniors 20-23,Raw,SBD
2,Jacob Sandy,CA,90,87.9,22,207.5,112.5,215,535,M,Juniors 20-23,Raw,SBD
3,Andrew Vasquez,CA,90,86.6,23,155,115,170,440,M,Juniors 20-23,Raw,SBD
1,Joseph Guzikowski,CA,100,94.4,18,187.5,125,215,527.5,M,Juniors 18-19,Raw,SBD
2,Ethan McNeelan,CA,100,98.05,18,140,80,202.5,422.5,M,Juniors 18-19,Raw,SBD
1,Doug Terry,CA,110,107.35,20,150,110,177.5,437.5,M,Juniors 20-23,Raw,SBD
1,Max Dang,CA,82.5,75.3,23,192.5,92.5,220,505,M,Open,Raw,SBD
1,Austin Boom,CA,90,89.35,27,205,170,222.5,597.5,M,Open,Raw,SBD
2,Mike DiManno,CA,90,89.2,25,227.5,132.5,197.5,557.5,M,Open,Raw,SBD
3,Juan Navarro,CA,90,84.05,25,150,90,182.5,422.5,M,Open,Raw,SBD
1,Andrew Coett,CA,100,99.95,34,267.5,165,282.5,715,M,Open,Raw,SBD
2,Cody Teer,CA,100,91.05,32,227.5,227.5,232.5,687.5,M,Open,Raw,SBD
3,Dave Murphy,CA,100,99.9,42,205,160,225,590,M,Open,Raw,SBD
4,Joseph Shepard,CA,100,94.65,21,200,150,235,585,M,Open,Raw,SBD
DQ,Josh Robinson,CA,100,99.5,42,210,130,-280,,M,Open,Raw,SBD
1,Josh Gee,CA,110,103.5,27,265,150,255,670,M,Open,Raw,SBD
2,Thomas Greene,CA,110,104.2,30,187.5,120,215,522.5,M,Open,Raw,SBD
1,Robert Weng,CA,125,123.6,30,192.5,137.5,220,550,M,Open,Raw,SBD
1,Dave Murphy,CA,100,99.9,42,205,160,225,590,M,Masters 40-44,Raw,SBD
DQ,Josh Robinson,CA,100,99.5,42,210,130,-280,,M,Masters 40-44,Raw,SBD
1,Lizette Salgado,CA,60,59.6,21,137.5,60,165,362.5,F,Juniors,Wraps,SBD
1,Emily Davidson,CA,90,88.25,25,147.5,70,142.5,360,F,Open,Wraps,SBD
1,Andres Salgado,CA,82.5,82.2,23,182.5,107.5,220,510,M,Juniors 20-23,Wraps,SBD
1,Andre Blugh,CA,90,88.8,19,227.5,150,215,592.5,M,Juniors 18-19,Wraps,SBD
1,Nicholas Pigulski,CA,90,88.05,23,250,170,272.5,692.5,M,Juniors 20-23,Wraps,SBD
1,Jasper Juan,CA,110,107.5,21,260,172.5,272.5,705,M,Juniors 20-23,Wraps,SBD
1,Cheng Salee,CA,82.5,81.6,34,237.5,137.5,257.5,632.5,M,Open,Wraps,SBD
1,John Reynolds,CA,125,114.85,30,232.5,170,235,637.5,M,Open,Wraps,SBD
1,Trevor Myhre,CA,125,123.95,36,272.5,215,275,762.5,M,Submasters 35-39,Wraps,SBD
1,Gary Loyd,CA,90,85,48,182.5,132.5,217.5,532.5,M,Masters 45-49,Wraps,SBD
1,JD Whitelow,CA,125,115.1,51,227.5,180,247.5,655,M,Masters 50-54,Wraps,SBD
1,Betty Heriford,CA,67.5,66.4,65,,,137.5,137.5,F,Open,Raw,D
1,Betty Heriford,CA,75,66.4,65,,,137.5,137.5,F,Masters 65-69,Raw,D
1,Max Dang,CA,82.5,75.3,23,,,220,220,M,Juniors 20-23,Raw,D
1,Philip Pohle,CA,90,87.4,23,,,242.5,242.5,M,Juniors 20-23,Raw,D
1,Max Dang,CA,82.5,75.3,23,,,220,220,M,Open,Raw,D
1,Gary Alexander,CA,82.5,80.1,40,,,232.5,232.5,M,Masters 40-44,Raw,D
1,Robert Heriford,CA,100,90.6,72,,,137.5,137.5,M,Masters 70-74,Raw,D
1,Betty Heriford,CA,67.5,66.4,65,,91,,91,F,Open,Raw,B
1,Michelle Vandeburgh,CA,82.5,78.45,32,,92.5,,92.5,F,Open,Raw,B
2,Melissa Weng,CA,82.5,80.2,27,,47.5,,47.5,F,Open,Raw,B
1,Cara Westin,CA,67.5,67,53,,97.5,,97.5,F,Masters 50-54,Raw,B
1,Betty Heriford,CA,67.5,66.4,65,,91,,91,F,Masters 65-69,Raw,B
1,Michael Yates,CA,100,97.35,50,,175,,175,M,Open,Raw,B
2,Kyle McDonald,CA,100,97.2,33,,147.5,,147.5,M,Open,Raw,B
1,Marcus Riggs,CA,110,102.3,25,,165,,165,M,Open,Raw,B
1,Ronny Scott,CA,125,111.2,30,,147.5,,147.5,M,Open,Raw,B
1,Jeremy Flores,CA,110,108.35,37,,175,,175,M,Submasters 35-39,Raw,B
1,Trevor Myhre,CA,125,123.95,36,,215,,215,M,Submasters 35-39,Raw,B
1,Michael Yates,CA,100,97.35,50,,175,,175,M,Masters 50-54,Raw,B
DQ,Bob Rudge,CA,90,86,74,,-147.5,,,M,Masters 70-74,Raw,B
1,Robert Heriford,CA,100,90.6,72,,102.5,,102.5,M,Masters 70-74,Raw,B
1,Niko Bidanian,CA,110,103.35,15,145,97.5,185,427.5,M,Juniors 13-15,Single-ply,SBD
