Division,WeightClassKg,Place,Name,Team,BodyweightKg,Best3SquatKg,Best3BenchKg,Best3DeadliftKg,TotalKg,Equipment,Event,Sex
Boys,51.71,1,Clayton Johnson,Keller Central,49.58,79.38,40.82,95.25,215.46,Single-ply,SBD,M
Boys,55.79,1,Zane Parker,Keller Central,55.66,83.91,49.9,108.86,242.67,Single-ply,SBD,M
Boys,59.87,1,Carlos Davila,Keller Central,58.29,138.35,79.38,133.81,351.53,Single-ply,SBD,M
Boys,59.87,2,Kasey Courtney,Keller Central,57.52,120.2,61.23,131.54,312.98,Single-ply,SBD,M
Boys,,NS,Koby Johnston,Keller Fossil Ridge,,,,,,Single-ply,SBD,M
Boys,67.13,1,Koji Mendoza,Keller Timber Creek,66.09,156.49,111.13,210.92,478.54,Single-ply,SBD,M
Boys,67.13,2,Jett Ertle,Keller,66.54,172.37,95.25,183.7,451.32,Single-ply,SBD,M
Boys,67.13,3,Brenton Perez,Keller Central,65.77,167.83,99.79,165.56,433.18,Single-ply,SBD,M
Boys,67.13,4,Erik Goodman,Keller Fossil Ridge,66.77,120.2,92.99,158.76,371.95,Single-ply,SBD,M
Boys,,NS,Will Thompson,Keller Fossil Ridge,,,,,,Single-ply,SBD,M
Boys,74.84,1,Joel Sarralde,Keller Timber Creek,72.03,158.76,113.4,176.9,449.06,Single-ply,SBD,M
Boys,74.84,2,Brady Salazar,Keller Timber Creek,74.57,147.42,92.99,183.7,424.11,Single-ply,SBD,M
Boys,74.84,3,Kyle Wilson,Keller Central,74.21,156.49,97.52,165.56,419.57,Single-ply,SBD,M
Boys,74.84,4,Evan Briestensky,Keller Timber Creek,74.75,151.95,86.18,165.56,403.7,Single-ply,SBD,M
Boys,74.84,5,Ryan Castle,Keller Timber Creek,68.13,151.95,81.65,163.29,396.89,Single-ply,SBD,M
Boys,82.1,1,Parker Kelly,Keller Central,81.06,183.7,106.59,195.04,485.34,Single-ply,SBD,M
Boys,82.1,2,Matt Soihl,Keller,81.96,174.63,124.74,183.7,483.08,Single-ply,SBD,M
Boys,82.1,3,Kaden Anderson,Keller Fossil Ridge,80.78,165.56,102.06,183.7,451.32,Single-ply,SBD,M
Boys,82.1,4,Shane Harris,Keller Central,79.61,158.76,102.06,158.76,419.57,Single-ply,SBD,M
Boys,82.1,5,Devon Grayson,Keller Fossil Ridge,80.69,108.86,83.91,124.74,317.51,Single-ply,SBD,M
Boys,89.81,1,Jerome Jackson,Keller Timber Creek,89.31,192.78,113.4,204.12,510.29,Single-ply,SBD,M
Boys,89.81,2,Landon Sleeper,Keller Central,84.59,142.88,102.06,190.51,435.45,Single-ply,SBD,M
Boys,89.81,3,Jayson Gonzalez,Keller Fossil Ridge,82.33,151.95,106.59,174.63,433.18,Single-ply,SBD,M
Boys,89.81,4,Jackson Worley,Keller Timber Creek,85.23,172.37,88.45,158.76,419.57,Single-ply,SBD,M
Boys,89.81,5,Dillon Puente,Keller Fossil Ridge,89.13,120.2,90.72,142.88,353.8,Single-ply,SBD,M
Boys,,NS,Charlie Hampton,Keller Timber Creek,,,,,,Single-ply,SBD,M
Boys,89.81,DQ,Norman White,Keller Fossil Ridge,87.77,174.63,113.4,183.7,,Single-ply,SBD,M
Boys,99.79,1,Cameron Williams,Keller,91.63,238.14,158.76,235.87,632.76,Single-ply,SBD,M
Boys,99.79,2,Christian Edwards,Keller Central,92.58,170.1,111.13,226.8,508.02,Single-ply,SBD,M
Boys,99.79,3,Erik Jiminez,Keller Fossil Ridge,96.12,192.78,104.33,158.76,455.86,Single-ply,SBD,M
Boys,,NS,Arnold Saidov,Keller Fossil Ridge,,,,,,Single-ply,SBD,M
Boys,109.77,1,Jacob Knowlton,Keller,104.51,201.85,131.54,192.78,526.17,Single-ply,SBD,M
Boys,109.77,2,Reece Portugal,Keller,107,192.78,127.01,190.51,510.29,Single-ply,SBD,M
Boys,109.77,3,Josh Brown,Keller Central,107.86,165.56,120.2,165.56,451.32,Single-ply,SBD,M
Boys,,NS,Alex Alvarado,Keller Fossil Ridge,,,,,,Single-ply,SBD,M
Boys,,NS,Brady Jackson,Keller Timber Creek,,,,,,Single-ply,SBD,M
Boys,124.74,1,Houston Miller,Keller,110.86,258.55,127.01,258.55,644.1,Single-ply,SBD,M
Boys,,NS,Alan Ali,Keller Timber Creek,,,,,,Single-ply,SBD,M
Boys,124.74+,1,Skylyr Rodriguez,Keller,126.73,249.48,179.17,226.8,655.44,Single-ply,SBD,M
Boys,124.74+,2,Ricky Leal,Keller Fossil Ridge,134.04,226.8,108.86,195.04,530.7,Single-ply,SBD,M
Boys,124.74+,3,Charles Ederson,Keller Fossil Ridge,134.81,201.85,97.52,226.8,526.17,Single-ply,SBD,M
