Division,WeightClassKg,Place,Name,Team,BodyweightKg,Best3SquatKg,Best3BenchKg,Best3DeadliftKg,TotalKg,Equipment,Event,Sex
Girls,44.23,1,Niomi Gamez,Los Fresnos,44.09,131.54,61.23,120.2,312.98,Single-ply,SBD,F
Girls,44.23,2,Michelle Hernandez,Edcouch-Elsa,44,108.86,43.09,127.01,278.96,Single-ply,SBD,F
Girls,44.23,3,Lilly Serrano,Edcouch-Elsa,44,102.06,43.09,122.47,267.62,Single-ply,SBD,F
Girls,44.23,4,Erika Diaz,La Joya Palmview,43.09,102.06,56.7,102.06,260.82,Single-ply,SBD,F
Girls,44.23,5,Elida Manriquez,Brownsville Lopez,42.64,97.52,52.16,104.33,254.01,Single-ply,SBD,F
Girls,44.23,6,Syann Hernandez,Weslaco East,38.37,99.79,40.82,104.33,244.94,Single-ply,SBD,F
Girls,44.23,7,Ana Herrera,Edinburg,43.36,102.06,45.36,95.25,242.67,Single-ply,SBD,F
Girls,44.23,8,Maria Gutierrez,Edinburg,43.82,95.25,56.7,83.91,235.87,Single-ply,SBD,F
Girls,44.23,9,Savanna Vasquez,PSJA Memorial,43.82,83.91,43.09,77.11,204.12,Single-ply,SBD,F
Girls,44.23,10,Cathlyn Guerra,PSJA Memorial,42.18,79.38,34.02,68.04,181.44,Single-ply,SBD,F
Girls,44.23,11,Clairssa Andaverde,Edinburg Vela,42.82,61.23,34.02,74.84,170.1,Single-ply,SBD,F
Girls,44.23,12,Yhasiri Reyna,La Joya,44.23,58.97,22.68,61.23,142.88,Single-ply,SBD,F
Girls,44.23,DQ,Alysse Hernandez,La Joya Palmview,43.36,,,,,Single-ply,SBD,F
Girls,47.85,1,Carolina Sanchez,Brownsville Lopez,47.72,122.47,54.43,131.54,308.44,Single-ply,SBD,F
Girls,47.85,2,Genesis Nava,Edcouch-Elsa,46.27,122.47,56.7,127.01,306.17,Single-ply,SBD,F
Girls,47.85,3,Anyssa Navarro,Weslaco East,47.81,104.33,52.16,113.4,269.89,Single-ply,SBD,F
Girls,47.85,4,Larissa Garcia,Weslaco East,47.45,90.72,40.82,102.06,233.6,Single-ply,SBD,F
Girls,47.85,5,Kaitlyn Bryan,Mission Veterans Memorial,47.45,70.31,40.82,99.79,210.92,Single-ply,SBD,F
Girls,51.94,1,Ale Escandon,Brownsville Hanna,51.62,145.15,83.91,142.88,371.95,Single-ply,SBD,F
Girls,51.94,2,Vero Martinez,Los Fresnos,50.53,129.27,72.57,149.69,351.53,Single-ply,SBD,F
Girls,51.94,3,Alexa Vega,Brownsville Lopez,51.53,138.35,79.38,133.81,351.53,Single-ply,SBD,F
Girls,51.94,4,Maryssa Lucio,Brownsville Hanna,51.07,115.67,74.84,131.54,322.05,Single-ply,SBD,F
Girls,51.94,5,Kimberly Rodriguez,Edinburg Economedes,49.8,113.4,72.57,131.54,317.51,Single-ply,SBD,F
Girls,51.94,6,Alaze Ocanas,Weslaco East,50.17,111.13,61.23,115.67,288.03,Single-ply,SBD,F
Girls,51.94,7,Lyndsay Horta,Weslaco East,50.62,111.13,70.31,106.59,288.03,Single-ply,SBD,F
Girls,51.94,8,Maria Sanchez,Brownsville Rivera,50.98,79.38,27.22,92.99,199.58,Single-ply,SBD,F
Girls,51.94,DQ,Deena Flores,Edcouch-Elsa,50.35,115.67,52.16,,,Single-ply,SBD,F
Girls,51.94,DQ,Devin Balderrama,Los Fresnos,49.62,,,,,Single-ply,SBD,F
Girls,51.94,DQ,Bryanna Rodriguez,La Joya Palmview,48.99,,,,,Single-ply,SBD,F
Girls,51.94,DQ,Daisy Cardenas,Weslaco East,51.89,120.2,54.43,,,Single-ply,SBD,F
Girls,56.02,1,Brenda Garcia,Los Fresnos,55.97,149.69,74.84,129.27,353.8,Single-ply,SBD,F
Girls,56.02,2,Jimmena Diaz,Edinburg,54.16,133.81,70.31,136.08,340.19,Single-ply,SBD,F
Girls,56.02,3,Misty Garza,Rio Hondo,52.8,117.93,70.31,131.54,319.78,Single-ply,SBD,F
Girls,56.02,4,Athena Moore,Los Fresnos,55.61,127.01,65.77,124.74,317.51,Single-ply,SBD,F
Girls,56.02,5,Kimberly Galarza,Edcouch-Elsa,54.88,120.2,54.43,131.54,306.17,Single-ply,SBD,F
Girls,56.02,6,Jackie Del Molino,Brownsville Veterans Memorial,,113.4,52.16,131.54,297.1,Single-ply,SBD,F
Girls,56.02,7,Heidi Perez,PSJA Memorial,55.84,120.2,52.16,124.74,297.1,Single-ply,SBD,F
Girls,56.02,8,Alaih Ruiz,La Joya Palmview,55.88,124.74,49.9,115.67,290.3,Single-ply,SBD,F
Girls,56.02,9,Rosa Perales,Brownsville Hanna,53.71,106.59,56.7,122.47,285.76,Single-ply,SBD,F
Girls,56.02,10,Vanessa Diaz,PSJA Memorial,55.93,113.4,52.16,111.13,276.69,Single-ply,SBD,F
Girls,56.02,11,Abigail Castellanos,Rio Hondo,54.98,113.4,43.09,106.59,263.08,Single-ply,SBD,F
Girls,56.02,12,Jacqueline Trevino,Edinburg Economedes,52.44,79.38,54.43,104.33,238.14,Single-ply,SBD,F
Girls,56.02,13,Venya Gonzalez,La Joya,55.97,79.38,45.36,104.33,229.06,Single-ply,SBD,F
Girls,56.02,14,Brianda Alejandro,Edcouch-Elsa,55.79,97.52,29.48,81.65,208.65,Single-ply,SBD,F
Girls,56.02,15,Bebe Quiroz,Edinburg Vela,53.8,74.84,38.56,90.72,204.12,Single-ply,SBD,F
Girls,56.02,16,Arelly Gonzalez,Mission Veterans Memorial,53.98,65.77,24.95,68.04,158.76,Single-ply,SBD,F
Girls,56.02,DQ,Melanie Cobos,La Joya Palmview,55.79,,,,,Single-ply,SBD,F
Girls,56.02,DQ,Keila Hernandez,Edinburg,55.88,106.59,,,,Single-ply,SBD,F
Girls,56.02,DQ,Debahni Garza,Edinburg,55.43,,,,,Single-ply,SBD,F
Girls,56.02,DQ,Norma Vega,Brownsville Lopez,55.07,,,,,Single-ply,SBD,F
Girls,60.1,1,Luisa Cruz,Los Fresnos,59.69,154.22,83.91,174.63,412.77,Single-ply,SBD,F
Girls,60.1,2,Marisol Sauceda,Edinburg Economedes,59.51,136.08,83.91,131.54,351.53,Single-ply,SBD,F
Girls,60.1,3,Jasmine Cervantes,Weslaco East,59.51,136.08,70.31,145.15,351.53,Single-ply,SBD,F
Girls,60.1,4,Ennette Diaz,La Joya Palmview,59.24,131.54,74.84,120.2,326.59,Single-ply,SBD,F
Girls,60.1,5,Briana Flores,Edinburg Economedes,56.61,129.27,70.31,111.13,310.71,Single-ply,SBD,F
Girls,60.1,6,Valerie Cordova,Mission Veterans Memorial,58.15,111.13,61.23,127.01,299.37,Single-ply,SBD,F
Girls,60.1,7,Gisselle Cabrera,Edinburg Economedes,59.78,124.74,63.5,111.13,299.37,Single-ply,SBD,F
Girls,60.1,8,Gabby Trigo,La Joya Palmview,59.42,127.01,56.7,113.4,297.1,Single-ply,SBD,F
Girls,60.1,9,Emily Flores,Rio Hondo,58.06,92.99,43.09,90.72,226.8,Single-ply,SBD,F
Girls,60.1,10,Novali Godinez,Edinburg Vela,57.97,86.18,47.63,83.91,217.72,Single-ply,SBD,F
Girls,60.1,DQ,Alexandra Martinez,Weslaco East,59.78,,,,,Single-ply,SBD,F
Girls,60.1,DQ,Donna Mondragon,La Joya Palmview,56.25,,,,,Single-ply,SBD,F
Girls,60.1,DQ,Alexa Munoz,La Joya Palmview,56.61,83.91,43.09,,,Single-ply,SBD,F
Girls,67.36,1,Jennifer Cisneros,Brownsville Lopez,67.31,161.03,79.38,167.83,408.23,Single-ply,SBD,F
Girls,67.36,2,Audrey Waller,Edinburg Vela,67.22,154.22,90.72,136.08,381.02,Single-ply,SBD,F
Girls,67.36,3,Noemi Gallardo,Brownsville Lopez,67.13,165.56,83.91,129.27,378.75,Single-ply,SBD,F
Girls,67.36,4,Karen Ledezma,Brownsville Hanna,62.32,142.88,97.52,124.74,365.14,Single-ply,SBD,F
Girls,67.36,5,Sylvia Cardenas,Brownsville Hanna,61.14,151.95,77.11,133.81,362.87,Single-ply,SBD,F
Girls,67.36,6,Alexis Alaniz,Brownsville Hanna,67.13,138.35,102.06,120.2,360.61,Single-ply,SBD,F
Girls,67.36,7,Alyssa Salinas,Edinburg,67.04,140.61,79.38,136.08,356.07,Single-ply,SBD,F
Girls,67.36,8,Abby Atkinson,Los Fresnos,66.22,129.27,74.84,133.81,337.93,Single-ply,SBD,F
Girls,67.36,9,Briany Pena,La Joya Palmview,66.5,138.35,63.5,127.01,328.85,Single-ply,SBD,F
Girls,67.36,10,Keyla Gonzalez,Edinburg,60.69,129.27,72.57,120.2,322.05,Single-ply,SBD,F
Girls,67.36,11,Zadie Flores,Edinburg Vela,67.22,124.74,54.43,113.4,292.57,Single-ply,SBD,F
Girls,67.36,12,Yumara Villanueva,Brownsville Rivera,63.96,113.4,47.63,124.74,285.76,Single-ply,SBD,F
Girls,67.36,13,Adrienne Aleman,Edinburg Vela,63.87,111.13,61.23,104.33,276.69,Single-ply,SBD,F
Girls,67.36,14,Fabiola Chavez,La Joya,60.78,108.86,45.36,113.4,267.62,Single-ply,SBD,F
Girls,67.36,15,Alexia Suarez,PSJA Memorial,66.59,99.79,47.63,113.4,260.82,Single-ply,SBD,F
Girls,67.36,16,Zoe Contreras,Edcouch-Elsa,65.77,92.99,49.9,102.06,244.94,Single-ply,SBD,F
Girls,67.36,17,Valery Gomez,PSJA Memorial,64.23,92.99,45.36,99.79,238.14,Single-ply,SBD,F
Girls,67.36,DQ,Sofia Longoria,Mission Veterans Memorial,64.5,,,,,Single-ply,SBD,F
Girls,67.36,DQ,Leanna Gonzales,Rio Hondo,63.68,,,,,Single-ply,SBD,F
Girls,67.36,DQ,Tiffanie Silguero,Los Fresnos,66.68,,,,,Single-ply,SBD,F
Girls,67.36,DQ,Carolina Hernandez,Brownsville Hanna,66.13,140.61,65.77,,,Single-ply,SBD,F
Girls,67.36,DQ,Anahi Escobar,Brownsville Lopez,64.32,,,,,Single-ply,SBD,F
Girls,67.36,DQ,Kassandra Mendiola,La Joya Palmview,67.13,122.47,52.16,,,Single-ply,SBD,F
Girls,75.07,1,Mackenzie Contreras,Edcouch-Elsa,73.48,185.97,102.06,165.56,453.59,Single-ply,SBD,F
Girls,75.07,2,Mitzi de la Cruz,Edinburg,74.12,174.63,92.99,145.15,412.77,Single-ply,SBD,F
Girls,75.07,3,Katherine Martinez,Los Fresnos,74.39,151.95,92.99,147.42,392.36,Single-ply,SBD,F
Girls,75.07,4,Araylie Garza,Edcouch-Elsa,74.39,147.42,83.91,129.27,360.61,Single-ply,SBD,F
Girls,75.07,5,Autum Montoya,Brownsville Hanna,73.03,151.95,65.77,138.35,356.07,Single-ply,SBD,F
Girls,75.07,6,Dehlila Cantu,Edinburg Vela,73.94,149.69,70.31,127.01,347,Single-ply,SBD,F
Girls,75.07,7,Laisha Jimenez,Brownsville Lopez,75.07,151.95,65.77,120.2,337.93,Single-ply,SBD,F
Girls,75.07,8,Blanca Reyna,Edinburg Economedes,71.4,120.2,56.7,145.15,322.05,Single-ply,SBD,F
Girls,75.07,9,Hillary Santillanes,Edinburg Economedes,73.57,129.27,61.23,129.27,319.78,Single-ply,SBD,F
Girls,75.07,10,Athena Martinez,Brownsville Hanna,74.12,124.74,74.84,115.67,315.25,Single-ply,SBD,F
Girls,75.07,11,Aylin Longoria,Mission Veterans Memorial,71.49,124.74,58.97,124.74,308.44,Single-ply,SBD,F
Girls,75.07,12,Mildred Lugo,Edcouch-Elsa,74.84,117.93,68.04,115.67,301.64,Single-ply,SBD,F
Girls,75.07,13,Anastasia Garcia,La Joya,70.13,111.13,45.36,120.2,276.69,Single-ply,SBD,F
Girls,75.07,14,Janel Olivera,Mission Veterans Memorial,72.67,99.79,58.97,108.86,267.62,Single-ply,SBD,F
Girls,75.07,15,Ebony Rodriguez,Mission Veterans Memorial,72.21,108.86,43.09,108.86,260.82,Single-ply,SBD,F
Girls,75.07,16,Galilea Vargas,La Joya,68.76,81.65,34.02,97.52,213.19,Single-ply,SBD,F
Girls,82.33,1,Layla Carrisalez,Los Fresnos,80.65,181.44,115.67,158.76,455.86,Single-ply,SBD,F
Girls,82.33,2,Keyla Puente,La Joya,76.93,195.04,70.31,172.37,437.72,Single-ply,SBD,F
Girls,82.33,3,Karen Hernandez,Rio Hondo,81.65,154.22,83.91,149.69,387.82,Single-ply,SBD,F
Girls,82.33,4,Sabrena Rosales,Edinburg Economedes,78.29,138.35,86.18,131.54,356.07,Single-ply,SBD,F
Girls,82.33,5,Hillary Briceno,Brownsville Lopez,78.93,151.95,68.04,131.54,351.53,Single-ply,SBD,F
Girls,82.33,6,Leslie Garcia,Edinburg Economedes,81.09,149.69,72.57,115.67,337.93,Single-ply,SBD,F
Girls,82.33,7,Taylor Weldon,Edinburg Economedes,79.29,117.93,72.57,131.54,322.05,Single-ply,SBD,F
Girls,82.33,8,Nayeli Lopez,Brownsville Veterans Memorial,79.29,129.27,58.97,133.81,322.05,Single-ply,SBD,F
Girls,82.33,9,Maria Cuellar,PSJA Memorial,82.28,131.54,68.04,122.47,322.05,Single-ply,SBD,F
Girls,82.33,10,Angelina Cervantes,Brownsville Rivera,80.56,115.67,61.23,124.74,301.64,Single-ply,SBD,F
Girls,82.33,11,Julie Torres,Rio Hondo,76.2,92.99,61.23,113.4,267.62,Single-ply,SBD,F
Girls,82.33,12,Karla Mata,Brownsville Rivera,75.57,79.38,31.75,102.06,213.19,Single-ply,SBD,F
Girls,82.33,DQ,Diony Villanueva,Edinburg Economedes,77.66,111.13,,,,Single-ply,SBD,F
Girls,82.33,DQ,Sophia Coronado,Edinburg,80.2,,,,,Single-ply,SBD,F
Girls,82.33,DQ,Gabby Featherston,Edinburg,78.93,,,,,Single-ply,SBD,F
Girls,82.33,DQ,Anyssa Barrientes,Rio Hondo,82.1,,,,,Single-ply,SBD,F
Girls,82.33,DQ,Ashley Zuniga,Weslaco East,79.02,,,,,Single-ply,SBD,F
Girls,90.04,1,Aysha Lopez,Edinburg,89.27,185.97,108.86,163.29,458.13,Single-ply,SBD,F
Girls,90.04,2,Ruby Quintero,Los Fresnos,87.45,154.22,111.13,154.22,419.57,Single-ply,SBD,F
Girls,90.04,3,Halley Montoya,Brownsville Hanna,87.54,151.95,77.11,147.42,376.48,Single-ply,SBD,F
Girls,90.04,4,Nira Hinojosa,La Joya Palmview,86.09,131.54,61.23,129.27,322.05,Single-ply,SBD,F
Girls,90.04,5,Atziry Payan,Brownsville Rivera,87.18,136.08,52.16,129.27,317.51,Single-ply,SBD,F
Girls,90.04,6,Maddie Vela,Weslaco East,87.45,102.06,56.7,113.4,272.16,Single-ply,SBD,F
Girls,90.04,DQ,Victoria Pena,Edcouch-Elsa,87.54,161.03,,,,Single-ply,SBD,F
Girls,90.04,DQ,Paula Guerrero,Brownsville Veterans Memorial,87.36,,,,,Single-ply,SBD,F
Girls,100.02,1,Rheanne Lopez,Los Fresnos,94.17,226.8,92.99,199.58,519.36,Single-ply,SBD,F
Girls,100.02,2,Krysti Llamas,Edinburg Vela,99.43,199.58,90.72,136.08,426.38,Single-ply,SBD,F
Girls,100.02,3,Evelyn Garza,Edcouch-Elsa,97.98,181.44,90.72,127.01,399.16,Single-ply,SBD,F
Girls,100.02,4,Michelle Davila,Brownsville Hanna,98.79,167.83,79.38,151.95,399.16,Single-ply,SBD,F
Girls,100.02,5,Brisa Barrientos,La Joya,96.43,156.49,74.84,147.42,378.75,Single-ply,SBD,F
Girls,100.02,6,Irlanda Moreno,Brownsville Veterans Memorial,97.79,151.95,65.77,154.22,371.95,Single-ply,SBD,F
Girls,100.02,7,Amor Sosa,Rio Hondo,97.61,136.08,65.77,124.74,326.59,Single-ply,SBD,F
Girls,100.02,8,Yvonne De La Fuente,Brownsville Veterans Memorial,99.06,127.01,49.9,129.27,306.17,Single-ply,SBD,F
Girls,117.71,1,Jazzmine Barrera,Edcouch-Elsa,112.49,201.85,95.25,176.9,474,Single-ply,SBD,F
Girls,117.71,2,Brittany Lozano,Brownsville Hanna,116.39,204.12,102.06,165.56,471.74,Single-ply,SBD,F
Girls,117.71,3,Esperanza Chavarria,Rio Hondo,108.95,154.22,72.57,142.88,369.68,Single-ply,SBD,F
Girls,117.71,4,Karla Salinas,Edinburg Vela,107.05,147.42,70.31,147.42,365.14,Single-ply,SBD,F
Girls,117.71+,1,Nelly Garcia,Brownsville Lopez,132.99,210.92,83.91,138.35,433.18,Single-ply,SBD,F
Girls,117.71+,2,Aisha Garcia,Edcouch-Elsa,117.93,185.97,77.11,145.15,408.23,Single-ply,SBD,F
Girls,117.71+,3,Nayely Leyva,La Joya,118.39,120.2,63.5,136.08,319.78,Single-ply,SBD,F
Girls,117.71+,4,Yadhira Gloria,Edinburg,163.66,108.86,70.31,115.67,294.84,Single-ply,SBD,F
Girls,,NS,Alexandra Bocanegra,Rio Hondo,,,,,,Single-ply,SBD,F
Girls,,NS,Paloma Lopez,Rio Hondo,,,,,,Single-ply,SBD,F
Girls,,NS,Abigail Del Bosque,Rio Hondo,,,,,,Single-ply,SBD,F
