Division,WeightClassKg,Place,Name,Team,BodyweightKg,Best3SquatKg,Best3BenchKg,Best3DeadliftKg,TotalKg,Equipment,Event,Sex
Junior Varsity,51.71,1,Dakota Primeaux,Newton,49.44,90.72,56.7,111.13,258.55,Single-ply,SBD,M
Junior Varsity,55.79,1,Colton Sauls,Kirbyville,55.61,79.38,52.16,92.99,224.53,Single-ply,SBD,M
Junior Varsity,59.87,1,Raymond Lawrence,Newton,59.87,120.2,74.84,154.22,349.27,Single-ply,SBD,M
Junior Varsity,59.87,2,Keundray Rollins,Newton,58.06,129.27,74.84,138.35,342.46,Single-ply,SBD,M
Junior Varsity,59.87,3,Thomas Socia,Jasper,58.97,83.91,63.5,115.67,263.08,Single-ply,SBD,M
Junior Varsity,67.13,1,Bobby Bass,Newton,66.68,174.63,92.99,172.37,439.98,Single-ply,SBD,M
Junior Varsity,67.13,2,Bo Wood,Newton,62.6,163.29,83.91,167.83,415.04,Single-ply,SBD,M
Junior Varsity,67.13,3,Cadeiro Frank,Kirbyville,66.5,149.69,72.57,158.76,381.02,Single-ply,SBD,M
Junior Varsity,67.13,4,Tyrese Samuel,Kirbyville,66.22,120.2,77.11,163.29,360.61,Single-ply,SBD,M
Junior Varsity,67.13,5,Luis Cruz,Newton,62.6,113.4,56.7,131.54,301.64,Single-ply,SBD,M
Junior Varsity,67.13,6,Cade Ratcliff,Jasper,66.68,102.06,72.57,124.74,299.37,Single-ply,SBD,M
Junior Varsity,67.13,7,Chase Chandler,Jasper,65.77,92.99,68.04,102.06,263.08,Single-ply,SBD,M
Junior Varsity,67.13,DQ,Conner Kerr,Newton,67.13,,,,,Single-ply,SBD,M
Junior Varsity,74.84,1,Matthew Peveto,Kirbyville,74.21,156.49,79.38,183.7,419.57,Single-ply,SBD,M
Junior Varsity,74.84,2,Dekeidrian Rollins,Newton,70.31,140.61,97.52,149.69,387.82,Single-ply,SBD,M
Junior Varsity,74.84,3,Daniel Adams,Jasper,68.95,120.2,92.99,167.83,381.02,Single-ply,SBD,M
Junior Varsity,74.84,4,Justin Odom,Kirbyville,72.67,142.88,74.84,136.08,353.8,Single-ply,SBD,M
Junior Varsity,74.84,5,Cameron Brewster,Kirbyville,73.12,113.4,68.04,142.88,324.32,Single-ply,SBD,M
Junior Varsity,74.84,6,Luke Windham,Newton,68.49,108.86,58.97,127.01,294.84,Single-ply,SBD,M
Junior Varsity,74.84,DQ,Jakeithan Adams,Jasper,69.85,,,,,Single-ply,SBD,M
Junior Varsity,82.1,1,Dwayne Diggles,Kirbyville,79.38,136.08,99.79,215.46,451.32,Single-ply,SBD,M
Junior Varsity,82.1,2,Hunter Flanigan,Newton,81.65,158.76,102.06,179.17,439.98,Single-ply,SBD,M
Junior Varsity,82.1,3,Antwaine Hunter,Newton,80.29,161.03,83.91,170.1,415.04,Single-ply,SBD,M
Junior Varsity,82.1,4,Chris Conner,Newton,79.83,149.69,81.65,163.29,394.63,Single-ply,SBD,M
Junior Varsity,82.1,5,Dominique Clark,Newton,79.38,136.08,72.57,165.56,374.21,Single-ply,SBD,M
Junior Varsity,82.1,6,Brauck Hubbard,Newton,78.47,138.35,68.04,142.88,349.27,Single-ply,SBD,M
Junior Varsity,82.1,7,Deviun Kennebrew,Jasper,79.38,,83.91,181.44,265.35,Single-ply,BD,M
Junior Varsity,82.1,8,Kris Carroll,Jasper,77.11,92.99,61.23,102.06,256.28,Single-ply,SBD,M
Junior Varsity,89.81,1,Tajhwan Denson,Newton,83.91,147.42,74.84,188.24,410.5,Single-ply,SBD,M
Junior Varsity,89.81,2,Colton Liles,Kirbyville,83.55,138.35,97.52,163.29,399.16,Single-ply,SBD,M
Junior Varsity,99.79,1,Janathaen Ezidore,Newton,97.52,167.83,81.65,183.7,433.18,Single-ply,SBD,M
Junior Varsity,99.79,2,Leonard Wysingle,Jasper,93.44,156.49,74.84,185.97,417.3,Single-ply,SBD,M
Junior Varsity,99.79,3,Kenneth Adams,Newton,92.08,124.74,86.18,158.76,369.68,Single-ply,SBD,M
Junior Varsity,99.79,4,Trajan Williams,Jasper,95.25,124.74,79.38,161.03,365.14,Single-ply,SBD,M
Junior Varsity,109.77,1,William Simmons,Newton,105.69,170.1,95.25,183.7,449.06,Single-ply,SBD,M
Junior Varsity,124.74,1,Zach Fairchild,Kirbyville,110.59,176.9,86.18,163.29,426.38,Single-ply,SBD,M
Junior Varsity,124.74,2,Tristan Truitt,Jasper,124.28,138.35,83.91,142.88,365.14,Single-ply,SBD,M
Junior Varsity,124.74+,1,Sabian Bluitt,Jasper,145.15,142.88,79.38,136.08,358.34,Single-ply,SBD,M
Junior Varsity,124.74+,2,Antwaan Houston,Jasper,137.89,127.01,79.38,136.08,342.46,Single-ply,SBD,M
Boys,51.71,1,Alan Cripps,Buna,47.63,120.2,79.38,127.01,326.59,Single-ply,SBD,M
Boys,51.71,2,Kelvonte Renfro,Jasper,43.09,68.04,38.56,106.59,213.19,Single-ply,SBD,M
Boys,51.71,3,Andrew Smith,Jasper,50.8,68.04,38.56,106.59,213.19,Single-ply,SBD,M
Boys,59.87,1,Shannon Davis,Kirbyville,55.84,145.15,72.57,163.29,381.02,Single-ply,SBD,M
Boys,55.79,2,Corey Frazier,Jasper,53.98,92.99,63.5,147.42,303.91,Single-ply,SBD,M
Boys,55.79,DQ,Michael Shaddock,Hemphill,55.79,,,,,Single-ply,SBD,M
Boys,55.79,DQ,Kailen Bland,Hemphill,55.79,,,,,Single-ply,SBD,M
Boys,59.87,1,Taylor Kibodeaux,Buna,57.15,238.14,97.52,185.97,521.63,Single-ply,SBD,M
Boys,59.87,2,Josh Waldrop,Jasper,59.87,131.54,77.11,127.01,335.66,Single-ply,SBD,M
Boys,67.13,1,Alonzo Simmons,Jasper,66.68,172.37,99.79,172.37,444.52,Single-ply,SBD,M
Boys,67.13,2,Arthur Watson,Buna,65.32,158.76,90.72,181.44,430.91,Single-ply,SBD,M
Boys,67.13,3,Ethan Harding,Buna,63.05,120.2,74.84,122.47,317.51,Single-ply,SBD,M
Boys,67.13,DQ,Aaron Shaddock,Hemphill,67.13,,,,,Single-ply,SBD,M
Boys,74.84,1,Doughton Reeves,Buna,72.57,226.8,122.47,183.7,532.97,Single-ply,SBD,M
Boys,74.84,2,Tavioun Fillyaw,Jasper,68.95,181.44,120.2,183.7,485.34,Single-ply,SBD,M
Boys,74.84,3,Jahlil Brown,Jasper,74.39,158.76,92.99,167.83,419.57,Single-ply,SBD,M
Boys,74.84,4,Jordan Holsonback,Kirbyville,69.4,,90.72,172.37,263.08,Single-ply,BD,M
Boys,74.84,DQ,Rudy Weaver,Hemphill,74.84,,,,,Single-ply,BD,M
Boys,82.1,1,DeCorrian Holmes,Jasper,81.65,183.7,115.67,195.04,494.42,Single-ply,SBD,M
Boys,82.1,2,Dustin Willett,Kirbyville,79.38,188.24,106.59,170.1,464.93,Single-ply,SBD,M
Boys,82.1,3,Dalton Phillips,Kirbyville,78.47,170.1,,195.04,365.14,Single-ply,SD,M
Boys,89.81,1,Devonta Hawthorne,Jasper,83.91,219.99,158.76,217.72,596.47,Single-ply,SBD,M
Boys,89.81,2,Justin Kennedy,Buna,83.46,222.26,129.27,204.12,555.65,Single-ply,SBD,M
Boys,89.81,3,Blaine Rhodes,Kirbyville,89.36,190.51,102.06,204.12,496.68,Single-ply,SBD,M
Boys,89.81,4,Dillon Kroner,Kirbyville,88,174.63,104.33,188.24,467.2,Single-ply,SBD,M
Boys,99.79,1,Ty Tamplin,Buna,95.71,278.96,165.56,238.14,682.66,Single-ply,SBD,M
Boys,109.77,1,DeAnthony Cuney,Jasper,107.95,254.01,170.1,251.74,675.85,Single-ply,SBD,M
Boys,109.77,2,Anthony Hadnot,Newton,104.78,272.16,138.35,263.08,673.58,Single-ply,SBD,M
Boys,109.77,3,Jarrod Brooks,Kirbyville,106.68,222.26,97.52,213.19,532.97,Single-ply,SBD,M
Boys,124.74,4,Tyler Martin,Kirbyville,110,188.24,113.4,174.63,476.27,Single-ply,SBD,M
Boys,109.77,5,Raymond Harper,Jasper,105.69,158.76,,190.51,349.27,Single-ply,SD,M
Boys,109.77,DQ,Greg Miller,Hemphill,101.6,,,,,Single-ply,SD,M
Boys,124.74,1,Nick Rhame,Buna,110.22,244.94,161.03,210.92,616.89,Single-ply,SBD,M
Boys,124.74,2,Jordan Garms,Buna,111.13,172.37,102.06,170.1,444.52,Single-ply,SBD,M
Boys,124.74,DQ,Trey Harris,Hemphill,119.29,,,,,Single-ply,SBD,M
Boys,124.74,DQ,Richard Bennett,Hemphill,110.68,,,,,Single-ply,SBD,M
Boys,124.74+,1,Garrett Jarrell,Buna,151.5,285.76,183.7,272.16,741.62,Single-ply,SBD,M
Boys,124.74+,2,Tommy Jones,Buna,130.63,158.76,104.33,183.7,446.79,Single-ply,SBD,M
Boys,124.74+,DQ,Trent Smith,Kirbyville,138.35,,,,,Single-ply,SBD,M
