Division,WeightClassKg,Place,Name,Team,BodyweightKg,Best3SquatKg,Best3BenchKg,Best3DeadliftKg,TotalKg,Equipment,Event,Sex
Girls,44.23,1,Jailene Williams,Blooming Grove,38.92,68.04,31.75,88.45,188.24,Single-ply,SBD,F
Girls,44.23,2,Grace Loveless,Rice,44.09,63.5,40.82,79.38,183.7,Single-ply,SBD,F
Girls,47.85,1,Kinsey Persons,Teague,44.91,90.72,49.9,97.52,238.14,Single-ply,SBD,F
Girls,47.85,2,Mariana Guajardo,Corsicana Mildred,45,74.84,31.75,104.33,210.92,Single-ply,SBD,F
Girls,47.85,3,Chloe Wilson,Fairfield,47.81,77.11,43.09,81.65,201.85,Single-ply,SBD,F
Girls,47.85,4,Iris Carrillo,Rice,45.09,58.97,38.56,77.11,174.63,Single-ply,SBD,F
Girls,47.85,5,Tamia Smith,Blooming Grove,47.63,54.43,29.48,86.18,170.1,Single-ply,SBD,F
Girls,47.85,NS,Keri Saldana,Dawson,,,,,,Single-ply,SBD,F
Girls,51.94,1,Bella Guajardo,Corsicana Mildred,49.71,72.57,43.09,104.33,219.99,Single-ply,SBD,F
Girls,51.94,2,Carson Black,Teague,50.44,79.38,34.02,95.25,208.65,Single-ply,SBD,F
Girls,51.94,3,Alyah Beck,Fairfield,51.26,81.65,24.95,81.65,188.24,Single-ply,SBD,F
Girls,51.94,4,Sayra Bolanos,Malakoff,51.17,65.77,36.29,83.91,185.97,Single-ply,SBD,F
Girls,51.94,5,Victoria Donohoo,Fairfield,51.8,61.23,36.29,83.91,181.44,Single-ply,SBD,F
Girls,51.94,6,Bethany Pruitt,Fairfield,51.17,61.23,27.22,77.11,165.56,Single-ply,SBD,F
Girls,51.94,7,Devon Taylor,Teague,48.99,,29.48,95.25,124.74,Single-ply,BD,F
Girls,51.94,NS,Taylor Carpenter,Corsicana Mildred,,,,,,Single-ply,SBD,F
Girls,51.94,NS,Courtney Warren,Dawson,,,,,,Single-ply,SBD,F
Girls,56.02,1,Marshalla Padgett,Eustace,53.61,102.06,47.63,129.27,278.96,Single-ply,SBD,F
Girls,56.02,2,Elizabeth Perales,Teague,55.52,95.25,45.36,111.13,251.74,Single-ply,SBD,F
Girls,56.02,3,Shelby Wallace,Fairfield,55.7,83.91,56.7,99.79,240.4,Single-ply,SBD,F
Girls,56.02,4,Katia Jimenez,Groesbeck,54.34,88.45,47.63,99.79,235.87,Single-ply,SBD,F
Girls,56.02,5,Harmony Mathews,Malakoff,55.97,90.72,43.09,90.72,224.53,Single-ply,SBD,F
Girls,56.02,6,Kinzie Bessonett,Grand Saline,53.52,90.72,36.29,95.25,222.26,Single-ply,SBD,F
Girls,56.02,7,Bianca Carrillo,Groesbeck,53.89,77.11,40.82,92.99,210.92,Single-ply,SBD,F
Girls,56.02,8,Abby Teer,Fairfield,55.88,70.31,29.48,90.72,190.51,Single-ply,SBD,F
Girls,56.02,9,Chelsea Green,Malakoff,53.25,65.77,34.02,86.18,185.97,Single-ply,SBD,F
Girls,56.02,10,Ana Melesio,Grand Saline,54.79,68.04,29.48,88.45,185.97,Single-ply,SBD,F
Girls,56.02,11,Haylee Bulger,Fairfield,55.79,68.04,27.22,81.65,176.9,Single-ply,SBD,F
Girls,60.1,1,Kelsie Richmond,Eustace,58.51,102.06,43.09,127.01,272.16,Single-ply,SBD,F
Girls,60.1,2,Lexi Smith,Rice,59.06,90.72,45.36,115.67,251.74,Single-ply,SBD,F
Girls,60.1,3,Katy Kalil,China Spring,59.87,92.99,43.09,86.18,222.26,Single-ply,SBD,F
Girls,60.1,4,Gracie Awalt,Fairfield,59.06,79.38,36.29,90.72,206.38,Single-ply,SBD,F
Girls,60.1,5,Jasee Farish,Blooming Grove,56.34,61.23,38.56,102.06,201.85,Single-ply,SBD,F
Girls,60.1,6,Summer Black,Groesbeck,59.78,74.84,36.29,86.18,197.31,Single-ply,SBD,F
Girls,60.1,NS,Hannah Chandler,Grand Saline,,,,,,Single-ply,SBD,F
Girls,67.36,1,Melanie Torres,Fairfield,67.18,122.47,54.43,136.08,312.98,Single-ply,SBD,F
Girls,67.36,2,Meisha McNeil,Mexia,61.69,106.59,45.36,122.47,274.42,Single-ply,SBD,F
Girls,67.36,3,Morgan Easley,Grand Saline,66.32,104.33,45.36,124.74,274.42,Single-ply,SBD,F
Girls,67.36,4,Shelby West,Groesbeck,61.96,106.59,45.36,115.67,267.62,Single-ply,SBD,F
Girls,67.36,5,Lacey Boney,Fairfield,65.41,102.06,45.36,113.4,260.82,Single-ply,SBD,F
Girls,67.36,6,Sarah Jones,Groesbeck,66.86,97.52,49.9,111.13,258.55,Single-ply,SBD,F
Girls,67.36,7,Hannah Rose,Blooming Grove,63.32,90.72,45.36,102.06,238.14,Single-ply,SBD,F
Girls,67.36,8,Rachel Rodgers,Grand Saline,61.87,92.99,45.36,92.99,231.33,Single-ply,SBD,F
Girls,67.36,9,Kendall Tatsch,China Spring,62.51,92.99,47.63,90.72,231.33,Single-ply,SBD,F
Girls,67.36,10,Julia Schatz,Groesbeck,65.68,79.38,31.75,88.45,199.58,Single-ply,SBD,F
Girls,67.36,11,Christina Ferguson,Fairfield,63.32,56.7,34.02,68.04,158.76,Single-ply,SBD,F
Girls,67.36,NS,Evelyn Robles,Rice,,,,,,Single-ply,SBD,F
Girls,75.07,1,Ashley Purselley,Eustace,68.76,106.59,70.31,127.01,303.91,Single-ply,SBD,F
Girls,75.07,2,Kallie Butler,Fairfield,67.49,117.93,58.97,124.74,301.64,Single-ply,SBD,F
Girls,75.07,3,Candance Denis,Malakoff,68.22,102.06,58.97,131.54,292.57,Single-ply,SBD,F
Girls,75.07,4,Jamie Wilkinson,Fairfield,73.84,115.67,61.23,111.13,288.03,Single-ply,SBD,F
Girls,75.07,5,Ellie Thomas,Grand Saline,73.57,124.74,47.63,113.4,285.76,Single-ply,SBD,F
Girls,75.07,6,Emma Reeder,Dawson,67.59,120.2,49.9,108.86,278.96,Single-ply,SBD,F
Girls,75.07,7,Emma Elliott,Grand Saline,72.85,108.86,47.63,115.67,272.16,Single-ply,SBD,F
Girls,75.07,8,Rachel White,Teague,74.75,104.33,43.09,111.13,258.55,Single-ply,SBD,F
Girls,75.07,9,Angel Carpenter,Corsicana Mildred,67.4,99.79,45.36,108.86,254.01,Single-ply,SBD,F
Girls,75.07,10,Sierra Truett,Groesbeck,70.49,106.59,40.82,106.59,254.01,Single-ply,SBD,F
Girls,75.07,11,Tytiana Phillips,Mexia,68.58,77.11,43.09,90.72,210.92,Single-ply,SBD,F
Girls,75.07,12,Kalen Cope,Corsicana Mildred,70.85,79.38,52.16,79.38,210.92,Single-ply,SBD,F
Girls,75.07,13,Kitiara Griffin,Scurry-Rosser,74.75,56.7,31.75,68.04,156.49,Single-ply,SBD,F
Girls,82.33,1,Deondra Dowell,Malakoff,82.1,131.54,74.84,145.15,351.53,Single-ply,SBD,F
Girls,82.33,2,Kaci Gauntt,Mexia,81.74,124.74,72.57,127.01,324.32,Single-ply,SBD,F
Girls,82.33,3,Vanessa McNiel,Blooming Grove,78.65,138.35,45.36,131.54,315.25,Single-ply,SBD,F
Girls,82.33,4,Cierra Morris,Teague,81.19,97.52,45.36,102.06,244.94,Single-ply,SBD,F
Girls,82.33,5,Keila Molina,Mexia,81.56,104.33,45.36,83.91,233.6,Single-ply,SBD,F
Girls,82.33,NS,Ruby Cura,Rice,,,,,,Single-ply,SBD,F
Girls,90.04,1,Skye Loper,Groesbeck,84.64,124.74,56.7,120.2,301.64,Single-ply,SBD,F
Girls,90.04,2,Kenlee Gauntt,Teague,86.73,102.06,47.63,129.27,278.96,Single-ply,SBD,F
Girls,90.04,3,Kelsey Whitten,Blooming Grove,89.9,90.72,52.16,104.33,247.21,Single-ply,SBD,F
Girls,90.04,4,Alycia Ybarra,Mexia,83.64,106.59,38.56,90.72,235.87,Single-ply,SBD,F
Girls,90.04,5,Tania Rivera,Mexia,82.37,88.45,31.75,86.18,206.38,Single-ply,SBD,F
Girls,90.04,6,Taylor Commander,Mexia,83.19,83.91,38.56,77.11,199.58,Single-ply,SBD,F
Girls,100.02,1,Sunni Goodell,Eustace,98.16,181.44,83.91,163.29,428.64,Single-ply,SBD,F
Girls,100.02,2,Jessica Hill,Fairfield,99.93,167.83,72.57,138.35,378.75,Single-ply,SBD,F
Girls,100.02,3,Raini Goodell,Eustace,92.17,124.74,63.5,124.74,312.98,Single-ply,SBD,F
Girls,100.02,4,Jessica Miller,Eustace,93.8,124.74,52.16,111.13,288.03,Single-ply,SBD,F
Girls,100.02,5,Michaela Horn,Malakoff,97.34,90.72,49.9,95.25,235.87,Single-ply,SBD,F
Girls,100.02+,1,Mariah Wood,China Spring,104.24,102.06,72.57,111.13,285.76,Single-ply,SBD,F
Girls,100.02+,2,Karisty Hopper,Fairfield,100.24,104.33,54.43,99.79,258.55,Single-ply,SBD,F
Girls,100.02+,NS,Marliegh Davis,Blooming Grove,,,,,,Single-ply,SBD,F
