Division,WeightClassKg,Place,Name,Team,BodyweightKg,Best3SquatKg,Best3BenchKg,Best3DeadliftKg,TotalKg,Equipment,Event,Sex
Boys,51.71,1,Austin Mullennix,Sadler S & S Cons,51.71,172.37,83.91,163.29,419.57,Single-ply,SBD,M
Boys,51.71,2,Michael Ellis,Nocona,51.71,111.13,65.77,120.2,297.1,Single-ply,SBD,M
Boys,51.71,3,Destin Warr,Callisburg,51.53,90.72,54.43,104.33,249.48,Single-ply,SBD,M
Boys,51.71,4,Raiden Brezina,Bowie,47.36,92.99,45.36,90.72,229.06,Single-ply,SBD,M
Boys,51.71,5,Jesse Butler,Alvord,48.81,56.7,45.36,70.31,172.37,Single-ply,SBD,M
Boys,55.79,1,Landry Hoskins,Sanger,55.52,165.56,90.72,172.37,428.64,Single-ply,SBD,M
Boys,55.79,2,Justin Christensen,Alvord,54.88,158.76,88.45,156.49,403.7,Single-ply,SBD,M
Boys,55.79,3,Colton Covington,Bowie,55.79,108.86,70.31,131.54,310.71,Single-ply,SBD,M
Boys,55.79,4,Conner Jacobs,Whitesboro,54.16,111.13,61.23,113.4,285.76,Single-ply,SBD,M
Boys,55.79,DQ,Caleb Patterson,Collinsville,53.52,83.91,,,,Single-ply,SBD,M
Boys,59.87,1,Payton Miller,Alvord,59.06,185.97,102.06,172.37,460.4,Single-ply,SBD,M
Boys,59.87,2,Creed Carter,Sanger,58.6,165.56,88.45,183.7,437.72,Single-ply,SBD,M
Boys,59.87,3,Brandon Horst,Sanger,59.33,172.37,97.52,167.83,437.72,Single-ply,SBD,M
Boys,59.87,4,Roman Rivas,Bowie,58.51,147.42,92.99,165.56,405.97,Single-ply,SBD,M
Boys,59.87,5,Ignacio Salas,Whitesboro,56.15,124.74,90.72,147.42,362.87,Single-ply,SBD,M
Boys,59.87,6,Mason Vinson,Sanger,59.6,138.35,74.84,140.61,353.8,Single-ply,SBD,M
Boys,59.87,7,Asher Contreras,Whitesboro,58.06,122.47,72.57,136.08,331.12,Single-ply,SBD,M
Boys,59.87,8,Victor Campusano,Krum,59.15,120.2,70.31,136.08,326.59,Single-ply,SBD,M
Boys,59.87,9,John Machtolff,Archer City,59.6,106.59,77.11,106.59,290.3,Single-ply,SBD,M
Boys,67.13,1,Dalton Davis,Bowie,64.55,147.42,95.25,172.37,415.04,Single-ply,SBD,M
Boys,67.13,2,Jaymz Hemenway,Callisburg,65.05,165.56,92.99,156.49,415.04,Single-ply,SBD,M
Boys,67.13,3,Tyler Richards,Nocona,66.32,145.15,83.91,181.44,410.5,Single-ply,SBD,M
Boys,67.13,4,Jakob Dumke,Alvord,66.5,151.95,95.25,161.03,408.23,Single-ply,SBD,M
Boys,67.13,5,Zach Carter,Sanger,64.32,156.49,86.18,163.29,405.97,Single-ply,SBD,M
Boys,67.13,6,Colby Delao,Bowie,66.32,147.42,83.91,149.69,381.02,Single-ply,SBD,M
Boys,67.13,7,Taylor Kern,Krum,66.95,129.27,95.25,136.08,360.61,Single-ply,SBD,M
Boys,67.13,8,Clayton Knight,Whitesboro,64.23,120.2,72.57,142.88,335.66,Single-ply,SBD,M
Boys,67.13,9,Colton Mitchell,Jacksboro,65.23,136.08,77.11,113.4,326.59,Single-ply,SBD,M
Boys,67.13,10,Drew Epperson,Alvord,63.59,77.11,49.9,88.45,215.46,Single-ply,SBD,M
Boys,74.84,1,Ty Harris,Bowie,72.67,188.24,117.93,181.44,487.61,Single-ply,SBD,M
Boys,74.84,2,Randal Hamilton,Jacksboro,73.3,195.04,111.13,163.29,469.47,Single-ply,SBD,M
Boys,74.84,3,Joey Crawford,Bowie,74.84,174.63,97.52,197.31,469.47,Single-ply,SBD,M
Boys,74.84,4,Aj Craddock,Bowie,72.39,163.29,124.74,172.37,460.4,Single-ply,SBD,M
Boys,74.84,5,Santos Hernandez,Sanger,72.12,158.76,95.25,172.37,426.38,Single-ply,SBD,M
Boys,74.84,6,Bryson Lightfoot,Krum,72.67,131.54,86.18,161.03,378.75,Single-ply,SBD,M
Boys,74.84,7,Jacob Miller,Krum,74.39,127.01,88.45,158.76,374.21,Single-ply,SBD,M
Boys,74.84,8,Willy Salsman,Nocona,74.21,99.79,92.99,136.08,328.85,Single-ply,SBD,M
Boys,74.84,9,Shelby Price,Callisburg,69.4,90.72,65.77,104.33,260.82,Single-ply,SBD,M
Boys,74.84,DQ,Bryan Camunez,Krum,70.49,122.47,,,,Single-ply,SBD,M
Boys,82.1,1,Syler Saenz,Sanger,80.74,217.72,136.08,231.33,585.13,Single-ply,SBD,M
Boys,82.1,2,Jacob Skinner,Bowie,81.92,190.51,111.13,190.51,492.15,Single-ply,SBD,M
Boys,82.1,3,Victor Tran,Bowie,81.92,167.83,102.06,215.46,485.34,Single-ply,SBD,M
Boys,82.1,4,Garrett Kemp,Whitesboro,81.74,158.76,104.33,181.44,444.52,Single-ply,SBD,M
Boys,82.1,5,Justin Browning,Archer City,79.2,142.88,104.33,147.42,394.63,Single-ply,SBD,M
Boys,82.1,6,Gage Moore,Sadler S & S Cons,75.75,129.27,95.25,163.29,387.82,Single-ply,SBD,M
Boys,82.1,7,Will Cross,Jacksboro,75.02,133.81,86.18,161.03,381.02,Single-ply,SBD,M
Boys,82.1,8,Lukas Kesch,Jacksboro,80.29,145.15,88.45,140.61,374.21,Single-ply,SBD,M
Boys,82.1,9,Issiac Ryan,Nocona,75.93,136.08,74.84,158.76,369.68,Single-ply,SBD,M
Boys,82.1,10,William Partney,Nocona,77.38,113.4,88.45,142.88,344.73,Single-ply,SBD,M
Boys,82.1,11,Jake Reynolds,Sadler S & S Cons,81.47,129.27,70.31,124.74,324.32,Single-ply,SBD,M
Boys,82.1,12,Hunter Harris,Alvord,81.19,120.2,74.84,120.2,315.25,Single-ply,SBD,M
Boys,82.1,DQ,Jacob Weir,Callisburg,82.1,,,,,Single-ply,SBD,M
Boys,82.1,DQ,Connor Glass,Sadler S & S Cons,78.38,,113.4,197.31,,Single-ply,SBD,M
Boys,89.81,1,Chris Haberman,Krum,89.09,181.44,99.79,226.8,508.02,Single-ply,SBD,M
Boys,89.81,2,Daniel Lackey,Krum,86.55,170.1,124.74,204.12,498.95,Single-ply,SBD,M
Boys,89.81,3,Seth Baucum,Callisburg,83.46,183.7,111.13,201.85,496.68,Single-ply,SBD,M
Boys,89.81,4,Sam Whittenburg,Sadler S & S Cons,87.45,183.7,120.2,192.78,496.68,Single-ply,SBD,M
Boys,89.81,5,Luis Hernandez,Collinsville,87.63,163.29,102.06,165.56,430.91,Single-ply,SBD,M
Boys,89.81,6,Austin Guthrie,Jacksboro,82.55,145.15,77.11,154.22,376.48,Single-ply,SBD,M
Boys,89.81,7,Alex Swartz,Krum,84.1,147.42,79.38,147.42,374.21,Single-ply,SBD,M
Boys,89.81,8,William Worley,Krum,83.19,129.27,83.91,154.22,367.41,Single-ply,SBD,M
Boys,89.81,9,Ezra Fox,Alvord,82.92,124.74,97.52,138.35,360.61,Single-ply,SBD,M
Boys,89.81,10,Brady Knabe,Collinsville,84.91,140.61,83.91,131.54,356.07,Single-ply,SBD,M
Boys,99.79,1,Brett Carter,Sanger,92.8,213.19,140.61,208.65,562.45,Single-ply,SBD,M
Boys,99.79,2,LaDavien Darden,Northwest Eaton,94.89,201.85,120.2,210.92,532.97,Single-ply,SBD,M
Boys,99.79,3,Bendon Kirk,Callisburg,98.34,210.92,117.93,199.58,528.44,Single-ply,SBD,M
Boys,99.79,4,Markos Morales,Whitesboro,90.36,172.37,120.2,204.12,496.68,Single-ply,SBD,M
Boys,99.79,5,Caiden Vasquez,Jacksboro,98.25,192.78,99.79,190.51,483.08,Single-ply,SBD,M
Boys,99.79,6,Cody Howard,Jacksboro,96.8,188.24,113.4,174.63,476.27,Single-ply,SBD,M
Boys,99.79,7,Coleton Price,Bowie,93.58,156.49,97.52,165.56,419.57,Single-ply,SBD,M
Boys,99.79,8,Mario Tobar,Krum,94.35,154.22,102.06,158.76,415.04,Single-ply,SBD,M
Boys,99.79,9,Blake Boren,Callisburg,96.98,149.69,108.86,151.95,410.5,Single-ply,SBD,M
Boys,99.79,10,Issac Copley,Krum,96.8,165.56,79.38,156.49,401.43,Single-ply,SBD,M
Boys,99.79,11,Noah Hancock,Alvord,93.53,149.69,92.99,154.22,396.89,Single-ply,SBD,M
Boys,99.79,12,Jon Newton,Alvord,94.89,145.15,79.38,145.15,369.68,Single-ply,SBD,M
Boys,109.77,1,Dylan Kays,Collinsville,109.13,249.48,158.76,226.8,635.03,Single-ply,SBD,M
Boys,109.77,2,Tanner Young,Whitesboro,101.88,226.8,127.01,224.53,578.33,Single-ply,SBD,M
Boys,109.77,3,Mason Holzer,Sanger,105.51,240.4,124.74,213.19,578.33,Single-ply,SBD,M
Boys,109.77,4,Justin Shipman,Northwest Eaton,106.59,226.8,136.08,215.46,578.33,Single-ply,SBD,M
Boys,109.77,5,Colby Hammond,Callisburg,102.06,210.92,115.67,197.31,523.9,Single-ply,SBD,M
Boys,109.77,6,Quaylynn Burkes,Sanger,108.59,206.38,124.74,185.97,517.1,Single-ply,SBD,M
Boys,109.77,7,Jason Daughtry,Nocona,106.59,208.65,108.86,181.44,498.95,Single-ply,SBD,M
Boys,109.77,8,Chase Stafford,Archer City,107.86,197.31,108.86,183.7,489.88,Single-ply,SBD,M
Boys,109.77,9,Kace Patterson,Callisburg,105.05,199.58,120.2,163.29,483.08,Single-ply,SBD,M
Boys,109.77,10,Bryan Arellano,Bowie,107.68,165.56,133.81,170.1,469.47,Single-ply,SBD,M
Boys,109.77,11,Carlos Winters,Nocona,100.33,131.54,95.25,136.08,362.87,Single-ply,SBD,M
Boys,109.77,DQ,Matt Billmeier,Sadler S & S Cons,108.86,151.95,,158.76,,Single-ply,SBD,M
Boys,109.77,DQ,Christian Renteria,Callisburg,102.69,,,,,Single-ply,SBD,M
Boys,124.74,1,Jackson Skelton,Northwest Eaton,124.65,217.72,142.88,215.46,576.06,Single-ply,SBD,M
Boys,124.74,2,Deuce Glasker,Nocona,122.83,231.33,136.08,195.04,562.45,Single-ply,SBD,M
Boys,124.74,3,Kaleb Crable,Alvord,114.12,183.7,95.25,147.42,426.38,Single-ply,SBD,M
Boys,124.74+,1,Zach Brown,Alvord,135.26,249.48,151.95,235.87,637.3,Single-ply,SBD,M
Boys,124.74+,2,Brady York,Nocona,131.45,226.8,124.74,226.8,578.33,Single-ply,SBD,M
Boys,124.74+,3,Mason Damron,Jacksboro,136.8,226.8,115.67,204.12,546.58,Single-ply,SBD,M
Boys,124.74+,4,Tyson Herron,Bowie,147.78,167.83,117.93,158.76,444.52,Single-ply,SBD,M
