Division,WeightClassKg,Place,Name,Team,BodyweightKg,Best3SquatKg,Best3BenchKg,Best3DeadliftKg,TotalKg,Equipment,Event,Sex
Girls,44.23,1,Bruna Sanchez,Big Lake Reagan County,44,95.25,49.9,111.13,256.28,Single-ply,SBD,F
Girls,44.23,2,Roxy Chavarria,Floydada,42.91,95.25,43.09,108.86,247.21,Single-ply,SBD,F
Girls,44.23,3,Natali Dominguez,Mertzon Irion County,42.91,95.25,56.7,90.72,242.67,Single-ply,SBD,F
Girls,44.23,4,Mariah De La Rosa,Crane,43.27,83.91,45.36,102.06,231.33,Single-ply,SBD,F
Girls,44.23,5,Laney Medrano,Dimmitt,44.23,83.91,40.82,99.79,224.53,Single-ply,SBD,F
Girls,44.23,6,Claudia Correa,Friona,42.91,90.72,38.56,90.72,219.99,Single-ply,SBD,F
Girls,44.23,7,Selena Flores,Ralls,44.18,83.91,31.75,90.72,206.38,Single-ply,SBD,F
Girls,44.23,8,Cassandra Flores,Kermit,44.18,72.57,31.75,86.18,190.51,Single-ply,SBD,F
Girls,44.23,9,Layney Vega,Tahoka,44.18,77.11,29.48,81.65,188.24,Single-ply,SBD,F
Girls,44.23,10,Chynna Sandate,Eldorado,40.1,70.31,36.29,79.38,185.97,Single-ply,SBD,F
Girls,44.23,11,Alexis Rodgers,Slaton,43.18,61.23,27.22,86.18,174.63,Single-ply,SBD,F
Girls,44.23,DQ,Marissa Godino,Hart,43.82,,,,,Single-ply,SBD,F
Girls,47.85,1,Vicky Minjarez,Seagraves,46.9,136.08,61.23,127.01,324.32,Single-ply,SBD,F
Girls,47.85,2,Madison Sullivan,Clyde,46.54,113.4,52.16,120.2,285.76,Single-ply,SBD,F
Girls,47.85,3,Serena Ayala,Tahoka,45.27,99.79,52.16,115.67,267.62,Single-ply,SBD,F
Girls,47.85,4,Bryannah Minjarez,Seagraves,47.54,92.99,49.9,111.13,254.01,Single-ply,SBD,F
Girls,47.85,5,Loralie Woodard,Cross Plains,47.36,95.25,45.36,99.79,240.4,Single-ply,SBD,F
Girls,47.85,6,Madison Kauk,Panhandle,46.27,83.91,49.9,92.99,226.8,Single-ply,SBD,F
Girls,47.85,7,Lynelle Hernandez,Sundown,46.27,86.18,43.09,86.18,215.46,Single-ply,SBD,F
Girls,47.85,DQ,Jessica Paredes,Sonora,47.45,102.06,47.63,,,Single-ply,SBD,F
Girls,47.85,DQ,Sasha Sanchez,Eldorado,47.85,99.79,,,,Single-ply,SBD,F
Girls,47.85,DQ,Mattie Williams,Big Lake Reagan County,45.18,,,,,Single-ply,SBD,F
Girls,47.85,NS,Bekkie Floriana,Kermit,,,,,,Single-ply,SBD,F
Girls,47.85,NS,Alyssa Davila,Kermit,,,,,,Single-ply,SBD,F
Girls,51.94,1,Abigail Narvaez,Eldorado,49.26,120.2,68.04,138.35,326.59,Single-ply,SBD,F
Girls,51.94,2,Reagan Chapman,Hawley,49.8,120.2,83.91,111.13,315.25,Single-ply,SBD,F
Girls,51.94,3,Kenzie Cramer,Mertzon Irion County,49.71,117.93,70.31,120.2,308.44,Single-ply,SBD,F
Girls,51.94,4,Alexis Mauricio,Cross Plains,50.62,113.4,45.36,113.4,272.16,Single-ply,SBD,F
Girls,51.94,5,Jordain Castro,Ralls,51.53,104.33,47.63,120.2,272.16,Single-ply,SBD,F
Girls,51.94,6,Kelby Tidwell,Post,51.94,117.93,45.36,104.33,267.62,Single-ply,SBD,F
Girls,51.94,7,Kersey Wyatt,Cross Plains,50.53,104.33,47.63,111.13,263.08,Single-ply,SBD,F
Girls,51.94,8,Jackilann Shepard,Cross Plains,49.8,102.06,47.63,106.59,256.28,Single-ply,SBD,F
Girls,51.94,9,Brishaya Sneed,Hermleigh,49.53,95.25,34.02,124.74,254.01,Single-ply,SBD,F
Girls,51.94,10,Stephanie Beltran,Colorado City Colorado,50.44,97.52,43.09,113.4,254.01,Single-ply,SBD,F
Girls,51.94,11,Mikki Barron,Garden City,50.8,90.72,43.09,117.93,251.74,Single-ply,SBD,F
Girls,51.94,NS,Melissa Arizpe,Floydada,,,,,,Single-ply,SBD,F
Girls,51.94,NS,Rosanna Aguilera,Big Lake Reagan County,,,,,,Single-ply,SBD,F
Girls,51.94,NS,Paula Ballejo,Slaton,,,,,,Single-ply,SBD,F
Girls,56.02,1,Courtney Dillard,Hawley,55.43,145.15,81.65,145.15,371.95,Single-ply,SBD,F
Girls,56.02,2,Sahian Valenzuela,Alpine,55.79,129.27,68.04,120.2,317.51,Single-ply,SBD,F
Girls,56.02,3,Rachel Mendoza,Ozona,55.61,122.47,63.5,127.01,312.98,Single-ply,SBD,F
Girls,56.02,4,Clarissa Hernandez,Dimmitt,56.02,127.01,65.77,120.2,312.98,Single-ply,SBD,F
Girls,56.02,5,Taylor Snodgrass,Mertzon Irion County,55.25,127.01,65.77,117.93,310.71,Single-ply,SBD,F
Girls,56.02,6,Taylor Franklin,Sundown,53.89,115.67,52.16,124.74,292.57,Single-ply,SBD,F
Girls,56.02,7,Araseli Villanueva,Junction,53.8,115.67,52.16,115.67,283.5,Single-ply,SBD,F
Girls,56.02,8,Lesley Perez,Dimmitt,55.97,117.93,47.63,113.4,278.96,Single-ply,SBD,F
Girls,56.02,9,Brookie Martin,Coahoma,53.8,102.06,61.23,106.59,269.89,Single-ply,SBD,F
Girls,56.02,10,Payton Calderon,Ralls,55.16,95.25,49.9,124.74,269.89,Single-ply,SBD,F
Girls,56.02,11,Selena Torres,Crane,55.61,102.06,47.63,120.2,269.89,Single-ply,SBD,F
Girls,56.02,12,Jessica Early,Clyde,52.89,99.79,43.09,113.4,256.28,Single-ply,SBD,F
Girls,56.02,13,Abigail Trevizo,Springlake Earth,53.52,86.18,54.43,108.86,249.48,Single-ply,SBD,F
Girls,60.1,1,Carlee Pitcher,Hawley,59.33,158.76,79.38,154.22,392.36,Single-ply,SBD,F
Girls,60.1,2,Kaylah Flores,Seagraves,59.15,151.95,79.38,142.88,374.21,Single-ply,SBD,F
Girls,60.1,3,Sierra Paredez,San Angelo Grape Creek,59.33,156.49,70.31,147.42,374.21,Single-ply,SBD,F
Girls,60.1,4,Dulce Rodriguez,Ozona,59.87,149.69,61.23,142.88,353.8,Single-ply,SBD,F
Girls,60.1,5,Caitlyn Allen,Mertzon Irion County,58.79,127.01,77.11,133.81,337.93,Single-ply,SBD,F
Girls,60.1,6,Alondra Rodriguez,Ozona,59.78,129.27,58.97,124.74,312.98,Single-ply,SBD,F
Girls,60.1,7,Bianca Jimenez,Dimmitt,58.79,111.13,63.5,131.54,306.17,Single-ply,SBD,F
Girls,60.1,8,Sealeigh Ramsey,Ranger,58.24,117.93,52.16,124.74,294.84,Single-ply,SBD,F
Girls,60.1,9,Julie Marshall,Ozona,58.6,111.13,45.36,117.93,274.42,Single-ply,SBD,F
Girls,60.1,DQ,Rebekah Crockett,Cross Plains,59.15,,,,,Single-ply,SBD,F
Girls,60.1,NS,Lizet Anett,Bovina,,,,,,Single-ply,SBD,F
Girls,60.1,NS,Andrea Cuevas,Dimmitt,,,,,,Single-ply,SBD,F
Girls,60.1,NS,Arianna Ornelas,Hawley,,,,,,Single-ply,SBD,F
Girls,67.36,1,Julia Pope,Sonora,63.5,142.88,77.11,154.22,374.21,Single-ply,SBD,F
Girls,67.36,2,Reagan DeHanis,Mertzon Irion County,65.77,140.61,86.18,127.01,353.8,Single-ply,SBD,F
Girls,67.36,3,Abby Kunkel,Ranger,64.77,136.08,63.5,149.69,349.27,Single-ply,SBD,F
Girls,67.36,4,Maiah Jurado,Ozona,64.41,120.2,72.57,147.42,340.19,Single-ply,SBD,F
Girls,67.36,5,Cilette Sweeney,Big Lake Reagan County,64.41,131.54,58.97,145.15,335.66,Single-ply,SBD,F
Girls,67.36,6,Kaylie Aranda,Kermit,66.86,138.35,68.04,115.67,322.05,Single-ply,SBD,F
Girls,67.36,7,Hannah Cowan,Cross Plains,65.41,136.08,61.23,120.2,317.51,Single-ply,SBD,F
Girls,67.36,8,Keelan Smith,Sundown,63.5,122.47,47.63,136.08,306.17,Single-ply,SBD,F
Girls,67.36,9,Kailyn Rister,Hawley,64.59,113.4,52.16,117.93,283.5,Single-ply,SBD,F
Girls,67.36,DQ,Teagan Fortune,Cross Plains,64.59,,,,,Single-ply,SBD,F
Girls,67.36,NS,Samantha Sanchez,Alpine,,,,,,Single-ply,SBD,F
Girls,67.36,DQ,Veronica Dolle,Abernathy,65.14,120.2,56.7,,,Single-ply,SBD,F
Girls,75.07,1,Toni Huelsberg,Alpine,73.94,158.76,68.04,136.08,362.87,Single-ply,SBD,F
Girls,75.07,2,Amber Baughman,San Angelo Grape Creek,75.07,142.88,70.31,142.88,356.07,Single-ply,SBD,F
Girls,75.07,3,Aaliyah Sneed,Hermleigh,70.4,136.08,52.16,163.29,351.53,Single-ply,SBD,F
Girls,75.07,4,Luisa Muniz,Eldorado,73.3,136.08,70.31,138.35,344.73,Single-ply,SBD,F
Girls,75.07,5,Armarinda Villanueva,Eldorado,71.94,129.27,70.31,142.88,342.46,Single-ply,SBD,F
Girls,75.07,6,Amyah Newman,Sundown,70.13,127.01,65.77,142.88,335.66,Single-ply,SBD,F
Girls,75.07,7,Kaela Michaelis,Alpine,71.58,129.27,54.43,131.54,315.25,Single-ply,SBD,F
Girls,75.07,8,Amber Arellano,Garden City,69.58,129.27,52.16,124.74,306.17,Single-ply,SBD,F
Girls,75.07,9,Carissa Gordon,Clyde,73.21,122.47,58.97,120.2,301.64,Single-ply,SBD,F
Girls,75.07,DQ,Kristi Ward,Cross Plains,71.58,136.08,,,,Single-ply,SBD,F
Girls,75.07,DQ,Sabrina Gonzales,Dimmitt,75.02,165.56,63.5,,,Single-ply,SBD,F
Girls,75.07,DQ,Larissa Vordick,San Angelo Grape Creek,71.85,149.69,70.31,,,Single-ply,SBD,F
Girls,82.33,1,Megan Powell,Eldorado,78.2,163.29,68.04,156.49,387.82,Single-ply,SBD,F
Girls,82.33,2,Sarah Oltivero,Dimmitt,78.93,154.22,68.04,165.56,387.82,Single-ply,SBD,F
Girls,82.33,3,Belle Gomez,Clyde,78.93,154.22,65.77,147.42,367.41,Single-ply,SBD,F
Girls,82.33,4,Kim Borrego,Ozona,81.47,140.61,79.38,142.88,362.87,Single-ply,SBD,F
Girls,82.33,5,Vanessa Ramirez,Childress,82.28,147.42,54.43,140.61,342.46,Single-ply,SBD,F
Girls,82.33,6,Abeni Garcia,Seagraves,80.29,142.88,65.77,131.54,340.19,Single-ply,SBD,F
Girls,82.33,7,Lupita Hernandez,Friona,78.83,136.08,63.5,136.08,335.66,Single-ply,SBD,F
Girls,82.33,8,Kamri Knippa,Hale Center,80.1,113.4,58.97,124.74,297.1,Single-ply,SBD,F
Girls,82.33,9,Marissa Villanueva,Friona,79.29,120.2,52.16,122.47,294.84,Single-ply,SBD,F
Girls,82.33,10,Natalie Ceballos,Coahoma,77.84,106.59,49.9,115.67,272.16,Single-ply,SBD,F
Girls,82.33,DQ,Lindi Richardson,Sundown,76.2,,,,,Single-ply,SBD,F
Girls,82.33,NS,Brittany Martin,Seagraves,,,,,,Single-ply,SBD,F
Girls,90.04,1,Rebecca Simpson,Ballinger,87.82,195.04,90.72,181.44,467.2,Single-ply,SBD,F
Girls,90.04,2,Sirena Minjarez,Seagraves,87.54,181.44,95.25,161.03,437.72,Single-ply,SBD,F
Girls,90.04,3,Noel Fierro,Sonora,87.18,161.03,88.45,142.88,392.36,Single-ply,SBD,F
Girls,90.04,4,Denise Rivera,Abernathy,83.46,158.76,77.11,113.4,349.27,Single-ply,SBD,F
Girls,90.04,5,Grayce Riley,Denver City,90.04,142.88,54.43,138.35,335.66,Single-ply,SBD,F
Girls,90.04,6,Jacque Marquez,Alpine,87,145.15,65.77,122.47,333.39,Single-ply,SBD,F
Girls,90.04,7,Mariea Freeman,Ranger,87.54,145.15,56.7,122.47,324.32,Single-ply,SBD,F
Girls,90.04,8,Rachel Payne,Slaton,88.81,113.4,65.77,142.88,322.05,Single-ply,SBD,F
Girls,90.04,9,Kay'd Lamar,Brownfield,85.28,127.01,61.23,131.54,319.78,Single-ply,SBD,F
Girls,90.04,10,Ashtyn Cleere,Christoval,87,147.42,56.7,108.86,312.98,Single-ply,SBD,F
Girls,90.04,11,Alexis Gutierrez,Seagraves,89.45,113.4,61.23,127.01,301.64,Single-ply,SBD,F
Girls,90.04,12,Brittany Ceballos,Coahoma,88.54,127.01,56.7,113.4,297.1,Single-ply,SBD,F
Girls,100.02,1,Kaitlyn Potter,Cross Plains,96.52,190.51,90.72,147.42,428.64,Single-ply,SBD,F
Girls,100.02,2,Valerie DeLeon,Big Lake Reagan County,99.06,174.63,88.45,147.42,410.5,Single-ply,SBD,F
Girls,100.02,3,Keisha Natera,Alpine,97.98,149.69,83.91,145.15,378.75,Single-ply,SBD,F
Girls,100.02,4,Amanda Long,Hermleigh,94.89,158.76,61.23,154.22,374.21,Single-ply,SBD,F
Girls,100.02,5,Alexis Escobar,Merkel,90.99,163.29,63.5,140.61,367.41,Single-ply,SBD,F
Girls,100.02,6,Maggie Ikehara,Junction,96.16,142.88,58.97,149.69,351.53,Single-ply,SBD,F
Girls,100.02,7,Reagan Deel,Coahoma,96.62,142.88,56.7,131.54,331.12,Single-ply,SBD,F
Girls,100.02,8,Brittany Landin,Ralls,95.25,136.08,45.36,136.08,317.51,Single-ply,SBD,F
Girls,100.02,9,Myrah Miranda,Seagraves,98.61,140.61,74.84,,215.46,Single-ply,SB,F
Girls,100.02,DQ,Annabell Hernandez,McCamey,94.89,145.15,54.43,,,Single-ply,SBD,F
Girls,100.02,DQ,Sara Gunnels,Ozona,97.61,,,,,Single-ply,SBD,F
Girls,100.02,NS,Cassie Villanueva,McCamey,,,,,,Single-ply,SBD,F
Girls,100.02+,1,Mikala Arizmendi,Dimmitt,126.73,197.31,97.52,154.22,449.06,Single-ply,SBD,F
Girls,100.02+,2,Brooklyn Tompkins,Panhandle,133.36,190.51,88.45,156.49,435.45,Single-ply,SBD,F
Girls,100.02+,3,Marissa Alarcon,Kermit,102.87,174.63,95.25,156.49,426.38,Single-ply,SBD,F
Girls,100.02+,4,Maria Mejia,Ozona,106.41,192.78,74.84,149.69,417.3,Single-ply,SBD,F
Girls,100.02+,5,Makayla Torres,San Angelo Grape Creek,116.3,181.44,65.77,167.83,415.04,Single-ply,SBD,F
Girls,100.02+,6,Taylor Parmer,Iraan,102.78,165.56,68.04,136.08,369.68,Single-ply,SBD,F
Girls,100.02+,7,Haley Doss,Clyde,113.58,131.54,58.97,111.13,301.64,Single-ply,SBD,F
Girls,100.02+,DQ,Katlin Parks,Coleman,102.97,,,,,Single-ply,SBD,F
Girls,100.02+,DQ,Gabby King,Panhandle,108.23,,,,,Single-ply,SBD,F
Girls,100.02+,NS,Janay Leven,Panhandle,,,,,,Single-ply,SBD,F
Girls,100.02+,NS,Destiny Lopez,Hawley,,,,,,Single-ply,SBD,F
Girls,100.02+,NS,Karis Carstensen,Lockney,,,,,,Single-ply,SBD,F
