com\ugurcanlacin\simple\beans\UserBean.class
com\ugurcanlacin\simple\model\User.class
com\ugurcanlacin\simple\service\impl\UserServiceImpl.class
com\ugurcanlacin\simple\dao\UserDao.class
com\ugurcanlacin\simple\service\UserService.class
com\ugurcanlacin\simple\dao\impl\UserDaoImpl.class
