{
	"name": "ds_REFDATA_ONS",
	"properties": {
		"description": "Postcode data",
		"linkedServiceName": {
			"referenceName": "AzureDataLakeStorage",
			"type": "LinkedServiceReference"
		},
		"parameters": {
			"p_directory": {
				"type": "string"
			}
		},
		"folder": {
			"name": "AtW_PerformanceFramework/2 Refdata"
		},
		"annotations": [],
		"type": "DelimitedText",
		"typeProperties": {
			"location": {
				"type": "AzureBlobFSLocation",
				"folderPath": {
					"value": "@dataset().p_directory",
					"type": "Expression"
				},
				"fileSystem": "refdata"
			},
			"columnDelimiter": ",",
			"escapeChar": "\\",
			"firstRowAsHeader": true,
			"quoteChar": "\""
		},
		"schema": [
			{
				"name": "pcd",
				"type": "String"
			},
			{
				"name": "pcd2",
				"type": "String"
			},
			{
				"name": "pcds",
				"type": "String"
			},
			{
				"name": "dointr",
				"type": "String"
			},
			{
				"name": "doterm",
				"type": "String"
			},
			{
				"name": "oscty",
				"type": "String"
			},
			{
				"name": "ced",
				"type": "String"
			},
			{
				"name": "oslaua",
				"type": "String"
			},
			{
				"name": "osward",
				"type": "String"
			},
			{
				"name": "parish",
				"type": "String"
			},
			{
				"name": "usertype",
				"type": "String"
			},
			{
				"name": "oseast1m",
				"type": "String"
			},
			{
				"name": "osnrth1m",
				"type": "String"
			},
			{
				"name": "osgrdind",
				"type": "String"
			},
			{
				"name": "oshlthau",
				"type": "String"
			},
			{
				"name": "nhser",
				"type": "String"
			},
			{
				"name": "ctry",
				"type": "String"
			},
			{
				"name": "rgn",
				"type": "String"
			},
			{
				"name": "streg",
				"type": "String"
			},
			{
				"name": "pcon",
				"type": "String"
			},
			{
				"name": "eer",
				"type": "String"
			},
			{
				"name": "teclec",
				"type": "String"
			},
			{
				"name": "ttwa",
				"type": "String"
			},
			{
				"name": "pct",
				"type": "String"
			},
			{
				"name": "itl",
				"type": "String"
			},
			{
				"name": "statsward",
				"type": "String"
			},
			{
				"name": "oa01",
				"type": "String"
			},
			{
				"name": "casward",
				"type": "String"
			},
			{
				"name": "park",
				"type": "String"
			},
			{
				"name": "lsoa01",
				"type": "String"
			},
			{
				"name": "msoa01",
				"type": "String"
			},
			{
				"name": "ur01ind",
				"type": "String"
			},
			{
				"name": "oac01",
				"type": "String"
			},
			{
				"name": "oa11",
				"type": "String"
			},
			{
				"name": "lsoa11",
				"type": "String"
			},
			{
				"name": "msoa11",
				"type": "String"
			},
			{
				"name": "wz11",
				"type": "String"
			},
			{
				"name": "ccg",
				"type": "String"
			},
			{
				"name": "bua11",
				"type": "String"
			},
			{
				"name": "buasd11",
				"type": "String"
			},
			{
				"name": "ru11ind",
				"type": "String"
			},
			{
				"name": "oac11",
				"type": "String"
			},
			{
				"name": "lat",
				"type": "String"
			},
			{
				"name": "long",
				"type": "String"
			},
			{
				"name": "lep1",
				"type": "String"
			},
			{
				"name": "lep2",
				"type": "String"
			},
			{
				"name": "pfa",
				"type": "String"
			},
			{
				"name": "imd",
				"type": "String"
			},
			{
				"name": "calncv",
				"type": "String"
			},
			{
				"name": "stp",
				"type": "String"
			}
		]
	}
}