{
	"name": "pl_Load_SaveStatusDim",
	"properties": {
		"activities": [
			{
				"name": "df_Load_SaveStatusDim",
				"type": "ExecuteDataFlow",
				"dependsOn": [],
				"policy": {
					"timeout": "1.00:00:00",
					"retry": 0,
					"retryIntervalInSeconds": 30,
					"secureOutput": false,
					"secureInput": false
				},
				"userProperties": [],
				"typeProperties": {
					"dataflow": {
						"referenceName": "df_Load_SaveStatusDim",
						"type": "DataFlowReference",
						"parameters": {
							"NaturalKeyColumn": "'save_status_code'",
							"DataColumns": "'save_status_name'"
						}
					},
					"staging": {
						"linkedService": {
							"referenceName": "AzureDataLakeStorage",
							"type": "LinkedServiceReference"
						},
						"folderPath": "staging"
					},
					"integrationRuntime": {
						"referenceName": "AzureManagedVnetIR",
						"type": "IntegrationRuntimeReference"
					},
					"traceLevel": "Fine"
				}
			}
		],
		"folder": {
			"name": "PIP_PerformanceFramework/Dimension Loads"
		},
		"annotations": [],
		"lastPublishTime": "2022-03-15T10:38:24Z"
	},
	"type": "Microsoft.DataFactory/factories/pipelines"
}