{
	"name": "ds_PIP_APPLY_CallTypeDim",
	"properties": {
		"linkedServiceName": {
			"referenceName": "AzureSynapseAnalytics",
			"type": "LinkedServiceReference"
		},
		"folder": {
			"name": "PIP_PerformanceFramework/3 Synapse (SqlDW)"
		},
		"annotations": [],
		"type": "AzureSqlDWTable",
		"schema": [
			{
				"name": "call_type_sk",
				"type": "bigint",
				"precision": 19
			},
			{
				"name": "call_type_code",
				"type": "varchar"
			},
			{
				"name": "call_type_name",
				"type": "varchar"
			},
			{
				"name": "call_direction",
				"type": "varchar"
			},
			{
				"name": "meta_is_current",
				"type": "int",
				"precision": 10
			},
			{
				"name": "meta_valid_from_datetime",
				"type": "datetime",
				"precision": 23,
				"scale": 3
			},
			{
				"name": "meta_valid_until_datetime",
				"type": "datetime",
				"precision": 23,
				"scale": 3
			},
			{
				"name": "meta_created_datetime",
				"type": "datetime",
				"precision": 23,
				"scale": 3
			},
			{
				"name": "meta_updated_datetime",
				"type": "datetime",
				"precision": 23,
				"scale": 3
			},
			{
				"name": "meta_source",
				"type": "varchar"
			}
		],
		"typeProperties": {
			"schema": "pip_apply",
			"table": "CallTypeDim"
		}
	},
	"type": "Microsoft.DataFactory/factories/datasets"
}