{
	"name": "pl_Load_DocumentUploadFact",
	"properties": {
		"activities": [
			{
				"name": "df_Load_DocumentUploadFact",
				"type": "ExecuteDataFlow",
				"dependsOn": [],
				"policy": {
					"timeout": "7.00:00:00",
					"retry": 0,
					"retryIntervalInSeconds": 30,
					"secureOutput": false,
					"secureInput": false
				},
				"userProperties": [],
				"typeProperties": {
					"dataflow": {
						"referenceName": "df_Load_DocumentUploadFact",
						"type": "DataFlowReference",
						"parameters": {
							"df_triggerStart": {
								"value": "'@{pipeline().parameters.triggerStart}'",
								"type": "Expression"
							},
							"df_triggerEnd": {
								"value": "'@{pipeline().parameters.triggerEnd}'",
								"type": "Expression"
							}
						}
					},
					"staging": {
						"linkedService": {
							"referenceName": "AzureDataLakeStorage",
							"type": "LinkedServiceReference"
						},
						"folderPath": "staging"
					},
					"integrationRuntime": {
						"referenceName": "AzureManagedVnetIR",
						"type": "IntegrationRuntimeReference"
					},
					"traceLevel": "Fine"
				}
			}
		],
		"parameters": {
			"triggerStart": {
				"type": "string"
			},
			"triggerEnd": {
				"type": "string"
			}
		},
		"folder": {
			"name": "PIP_PerformanceFramework/Fact Loads"
		},
		"annotations": [],
		"lastPublishTime": "2022-03-15T10:38:24Z"
	},
	"type": "Microsoft.DataFactory/factories/pipelines"
}