{
	"name": "ds_PIP_APPLY_ApplicationFormFact",
	"properties": {
		"linkedServiceName": {
			"referenceName": "AzureSynapseAnalytics",
			"type": "LinkedServiceReference"
		},
		"folder": {
			"name": "PIP_PerformanceFramework/3 Synapse (SqlDW)"
		},
		"annotations": [],
		"type": "AzureSqlDWTable",
		"schema": [
			{
				"name": "application_form_fact_sk",
				"type": "bigint",
				"precision": 19
			},
			{
				"name": "application_sk",
				"type": "bigint",
				"precision": 19
			},
			{
				"name": "web_page_sk",
				"type": "bigint",
				"precision": 19
			},
			{
				"name": "save_status_sk",
				"type": "bigint",
				"precision": 19
			},
			{
				"name": "form_item_sk",
				"type": "bigint",
				"precision": 19
			},
			{
				"name": "claimant_sk",
				"type": "bigint",
				"precision": 19
			},
			{
				"name": "date_sk",
				"type": "bigint",
				"precision": 19
			},
			{
				"name": "time_sk",
				"type": "bigint",
				"precision": 19
			},
			{
				"name": "save_timestamp",
				"type": "smalldatetime",
				"precision": 16,
				"scale": 0
			},
			{
				"name": "session_uuid",
				"type": "uniqueidentifier"
			},
			{
				"name": "is_populated",
				"type": "int",
				"precision": 10
			},
			{
				"name": "word_count",
				"type": "int",
				"precision": 10
			},
			{
				"name": "form_value",
				"type": "nvarchar"
			},
			{
				"name": "form_value_treatment",
				"type": "nvarchar"
			},
			{
				"name": "meta_is_deleted",
				"type": "int",
				"precision": 10
			},
			{
				"name": "meta_created_datetime",
				"type": "datetime",
				"precision": 23,
				"scale": 3
			},
			{
				"name": "meta_updated_datetime",
				"type": "datetime",
				"precision": 23,
				"scale": 3
			},
			{
				"name": "meta_source",
				"type": "varchar"
			}
		],
		"typeProperties": {
			"schema": "pip_apply",
			"table": "ApplicationFormFact"
		}
	},
	"type": "Microsoft.DataFactory/factories/datasets"
}