{
	"name": "ds_STAGING_PIP_drs_request_audit",
	"properties": {
		"linkedServiceName": {
			"referenceName": "AzureDataLakeStorage",
			"type": "LinkedServiceReference"
		},
		"folder": {
			"name": "PIP_PerformanceFramework/2 Staging Area"
		},
		"annotations": [],
		"type": "Json",
		"typeProperties": {
			"location": {
				"type": "AzureBlobFSLocation",
				"folderPath": "pip/drs_request_audit",
				"fileSystem": "staging"
			}
		},
		"schema": {
			"type": "object",
			"properties": {
				"_class": {
					"type": "string"
				},
				"_id": {
					"type": "object",
					"properties": {
						"$oid": {
							"type": "string"
						}
					}
				},
				"additionalErrorDetails": {
					"type": "string"
				},
				"completedAt": {
					"type": "object",
					"properties": {
						"$date": {
							"type": "integer"
						}
					}
				},
				"docIds": {
					"type": "array",
					"items": {
						"type": "object",
						"properties": {
							"documentId": {
								"type": "string"
							}
						}
					}
				},
				"encryption_data_key": {
					"type": "string"
				},
				"errors": {
					"type": "string"
				},
				"status": {
					"type": "string"
				},
				"submissionId": {
					"type": "string"
				},
				"submittedAt": {
					"type": "object",
					"properties": {
						"$date": {
							"type": "integer"
						}
					}
				}
			}
		}
	},
	"type": "Microsoft.DataFactory/factories/datasets"
}