{
	"name": "ds_LANDING_pip_account_manager",
	"properties": {
		"linkedServiceName": {
			"referenceName": "AzureDataLakeStorage",
			"type": "LinkedServiceReference"
		},
		"folder": {
			"name": "PIP_PerformanceFramework/1 Landing Area"
		},
		"annotations": [],
		"type": "Json",
		"typeProperties": {
			"location": {
				"type": "AzureBlobFSLocation",
				"folderPath": "pip-account-manager",
				"fileSystem": "landing"
			}
		},
		"schema": {
			"type": "object",
			"properties": {
				"resumeToken": {
					"type": "string"
				},
				"fullDocument": {
					"type": "string"
				},
				"updateDescription": {
					"type": "string"
				},
				"documentKey": {
					"type": "string"
				},
				"namespace": {
					"type": "string"
				},
				"operationType": {
					"type": "string"
				}
			}
		}
	},
	"type": "Microsoft.DataFactory/factories/datasets"
}