{
	"name": "ds_REFDATA_BenefitType",
	"properties": {
		"linkedServiceName": {
			"referenceName": "AzureDataLakeStorage",
			"type": "LinkedServiceReference"
		},
		"folder": {
			"name": "PIP_PerformanceFramework/0 Reference Data"
		},
		"annotations": [],
		"type": "DelimitedText",
		"typeProperties": {
			"location": {
				"type": "AzureBlobFSLocation",
				"fileName": "benefit_type.csv",
				"folderPath": "common",
				"fileSystem": "refdata"
			},
			"columnDelimiter": ",",
			"escapeChar": "\\",
			"firstRowAsHeader": true,
			"quoteChar": "\""
		},
		"schema": [
			{
				"name": "benefit_type_sk",
				"type": "String"
			},
			{
				"name": "benefit_type_code",
				"type": "String"
			},
			{
				"name": "benefit_type_name",
				"type": "String"
			},
			{
				"name": "benefit_area",
				"type": "String"
			}
		]
	},
	"type": "Microsoft.DataFactory/factories/datasets"
}