{
    "morning": {"days": ["mon", "tue", "wed", "thu", "fri"], "hours": [6, 7, 8, 9], "folder": "media/morning"},
    "cruising": {"days": ["mon", "tue", "wed", "thu", "fri"], "hours": [10, 11, 12, 13, 14, 15, 16, 17, 18, 19, 20, 21, 22, 23], "folder": "media/cruising"},
    "before": {"days": ["thu", "fri", "sun", "sat"], "hours": [22, 23], "folder": "media/before"},
    "morning_weekend": {"days": ["sun", "sat"], "hours": [6, 7, 8, 9], "folder": "media/morning_weekend"},
    "after": {"days": ["mon", "tue", "wed", "thu", "fri", "sun", "sat"], "hours": [0, 1, 2, 3, 4, 5], "folder": "media/after"},
    "sunday_cruising": {"days": ["sat"], "hours": [10, 11, 12, 13, 14, 15, 16, 17, 18, 19, 20, 21, 22, 23], "folder": "media/cruising"},
    "thursday_saturday_cruising": {"days": ["thu", "fri", "sun"], "hours": [10, 11, 12, 13, 14, 15, 16, 17, 18, 19, 20, 21], "folder": "media/cruising"}
}
