%YAML 1.1
%TAG !u! tag:unity3d.com,2011:
--- !u!1045 &1
EditorBuildSettings:
  m_ObjectHideFlags: 0
  serializedVersion: 2
  m_Scenes:
  - enabled: 0
    path: Assets/Scenes/SampleScene.unity
    guid: 2cda990e2423bbf4892e6590ba056729
  - enabled: 1
    path: Assets/Scenes/MainMenu.unity
    guid: 3fc8acdd13e6c734bafef6554d6fdbcd
  - enabled: 1
    path: Assets/Scenes/3Cups.unity
    guid: 0cd820bc3bd7b0f428e81a01a5c66ae1
  - enabled: 1
    path: Assets/Scenes/4Cups.unity
    guid: 7e50511e2e733704bbdd0a8ac7d3ea13
  - enabled: 1
    path: Assets/Scenes/5Cups.unity
    guid: 2da9f864cd6c3694f958dcfcec407cff
  m_configObjects:
    com.unity.adaptiveperformance.loader_settings: {fileID: 11400000, guid: 1c6cf3a52e56140479b6ab6e0a32c9b3, type: 2}
    com.unity.adaptiveperformance.samsung.android.provider_settings: {fileID: 11400000, guid: 88ccf7098a84fdb44b3d33cc4392cf04, type: 2}
    com.unity.adaptiveperformance.simulator.provider_settings: {fileID: 11400000, guid: 86fc8efb02868774a84442b8b64785f1, type: 2}
