[api-updater (non-obsolete-error-filter)] 5/4/2023 5:31:12 PM : Starting C:/Program Files/Unity/Hub/Editor/2020.3.28f1/Editor/Data/Tools/ScriptUpdater/APIUpdater.NonObsoleteApiUpdaterDetector.exe
[api-updater (non-obsolete-error-filter)] 
----------------------------------
jit/startup time      : 6731.4917ms
moved types parse time: 98ms
candidates parse time : 2ms
C# parse time         : 693ms
candidates check time : 93ms
console write time    : 1ms

[api-updater (non-obsolete-error-filter)] 5/5/2023 2:56:11 AM : Starting C:/Program Files/Unity/Hub/Editor/2020.3.28f1/Editor/Data/Tools/ScriptUpdater/APIUpdater.NonObsoleteApiUpdaterDetector.exe
[api-updater (non-obsolete-error-filter)] 
----------------------------------
jit/startup time      : 973.255ms
moved types parse time: 106ms
candidates parse time : 2ms
C# parse time         : 458ms
candidates check time : 112ms
console write time    : 1ms

