%YAML 1.1
%TAG !u! tag:unity3d.com,2011:
--- !u!162 &1
EditorUserSettings:
  m_ObjectHideFlags: 0
  serializedVersion: 4
  m_ConfigSettings:
    RecentlyUsedSceneGuid-0:
      value: 5a0551555c560b585a085f7411200c4413164b7c287071632c7b4d30b4e3673c
      flags: 0
    RecentlyUsedSceneGuid-1:
      value: 5250515255530b030b58552342745944174e1e7d287127687d7f4b32e4b8623c
      flags: 0
    RecentlyUsedSceneGuid-2:
      value: 5101045f0757595a5a565c2642215e44154e192f787d75667a2f1c31b4e46361
      flags: 0
    RecentlyUsedSceneGuid-3:
      value: 5a0903025d0c0b0d5a5f0a7342760d4446154c28787b76677f7f4432bbb1366c
      flags: 0
    RecentlyUsedSceneGuid-4:
      value: 070006530753085a0808557715255d44174f4d2b2f2a7e627f7a1f6bb6b4633d
      flags: 0
    RecentlyUsedSceneGuid-5:
      value: 020251025c575b585d0d5e7047250644154f4878797a2363782f4b32b7b9303c
      flags: 0
    RecentlyUsedSceneGuid-6:
      value: 0704055252055e5d59575f7b117b0b4440151e787b7076677d7f4a66e7b73069
      flags: 0
    RecentlyUsedSceneGuid-7:
      value: 0200075306025f58550d0d264770074445154b79787971662f7a4d65b1b3616c
      flags: 0
    RecentlyUsedSceneGuid-8:
      value: 5500030256035a095d5b597349730844451540287c7c7067757c4c30b5b9646c
      flags: 0
    RecentlyUsedSceneGuid-9:
      value: 515250075c0c595e5f5a5e71122159444e4e4a2f7a7d7f602f284d66b4b76661
      flags: 0
    RecentlyUsedScenePath-0:
      value: 22424703114646680e0b0227036c7b02171017243f671435290d0f32e5ef3a76f7e93ffdfe
      flags: 0
    RecentlyUsedScenePath-1:
      value: 22424703114646680e0b0227036c7a1711341025252b237f082e1a10eaef3d3be7c238eeeb332c347717e1351027
      flags: 0
    RecentlyUsedScenePath-2:
      value: 22424703114646680e0b0227036c7a1711341025252b237f082e1a10eaef3d3be7d523faf4333e327717e1351027
      flags: 0
    RecentlyUsedScenePath-3:
      value: 22424703114646680e0b0227036c72111f19352f223d691d2c20131ee7ee210af7f425e0e6347129370bfb25
      flags: 0
    RecentlyUsedScenePath-4:
      value: 22424703114646680e0b0227036c7a1711341025252b237f082e1a10eaef3d3be7d426e8e9332c347717e1351027
      flags: 0
    RecentlyUsedScenePath-5:
      value: 22424703114646680e0b0227036c72111f19352f223d691d2c20131ee7ee210bf2e638e0f4327129370bfb25
      flags: 0
    RecentlyUsedScenePath-6:
      value: 22424703114646680e0b0227036c6c15020311242b3b6903283d093aece7270bf2e638e0f4327129370bfb25
      flags: 0
    RecentlyUsedScenePath-7:
      value: 22424703114646680e0b0227036c6c15020311242b3b6903283d093aece7270af7f425e0e6347129370bfb25
      flags: 0
    RecentlyUsedScenePath-8:
      value: 22424703114646680e0b0227036c72111f19352f223d691d2c20131ee7ee211dece03ae0f4327129370bfb25
      flags: 0
    RecentlyUsedScenePath-9:
      value: 22424703114646680e0b0227036c6c15020311242b3b6903283d093aece7271dece03ae0f4327129370bfb25
      flags: 0
    vcSharedLogLevel:
      value: 0d5e400f0650
      flags: 0
  m_VCAutomaticAdd: 1
  m_VCDebugCom: 0
  m_VCDebugCmd: 0
  m_VCDebugOut: 0
  m_SemanticMergeMode: 2
  m_DesiredImportWorkerCount: 1
  m_StandbyImportWorkerCount: 1
  m_IdleImportWorkerShutdownDelay: 60000
  m_VCShowFailedCheckout: 1
  m_VCOverwriteFailedCheckoutAssets: 1
  m_VCProjectOverlayIcons: 1
  m_VCHierarchyOverlayIcons: 1
  m_VCOtherOverlayIcons: 1
  m_VCAllowAsyncUpdate: 1
  m_ArtifactGarbageCollection: 1
