<?xml version="1.0" encoding="UTF-8"?>
<svg width="806px" height="474px" viewBox="0 0 806 474" version="1.1" xmlns="http://www.w3.org/2000/svg" xmlns:xlink="http://www.w3.org/1999/xlink">
    <!-- Generator: Sketch 52.5 (67469) - http://www.bohemiancoding.com/sketch -->
    <title>GameOver</title>
    <desc>Created with Sketch.</desc>
    <defs>
        <linearGradient x1="0%" y1="0%" x2="50%" y2="100%" id="linearGradient-1">
            <stop stop-color="#E64C4C" offset="0%"></stop>
            <stop stop-color="#FB8332" stop-opacity="0.95" offset="100%"></stop>
        </linearGradient>
    </defs>
    <g id="Page-1" stroke="none" stroke-width="1" fill="none" fill-rule="evenodd">
        <g id="Artboard" transform="translate(-317.000000, -97.000000)" fill="url(#linearGradient-1)">
            <g id="GameOver" transform="translate(317.000000, 97.000000)">
                <g id="E" transform="translate(661.000000, 2.000000)">
                    <path d="M8,0 L39,0 C43.418278,-8.11624501e-16 47,3.581722 47,8 L47,39 C47,43.418278 43.418278,47 39,47 L8,47 C3.581722,47 2.31743984e-15,43.418278 1.77635684e-15,39 L0,8 C-5.41083001e-16,3.581722 3.581722,2.58798134e-15 8,1.77635684e-15 Z" id="Rectangle-Copy-24" transform="translate(23.500000, 23.500000) rotate(-90.000000) translate(-23.500000, -23.500000) "></path>
                    <path d="M8,48 L39,48 C43.418278,48 47,51.581722 47,56 L47,87 C47,91.418278 43.418278,95 39,95 L8,95 C3.581722,95 2.31743984e-15,91.418278 1.77635684e-15,87 L0,56 C-5.41083001e-16,51.581722 3.581722,48 8,48 Z" id="Rectangle-Copy-25" transform="translate(23.500000, 71.500000) rotate(-90.000000) translate(-23.500000, -71.500000) "></path>
                    <path d="M8,96 L39,96 C43.418278,96 47,99.581722 47,104 L47,135 C47,139.418278 43.418278,143 39,143 L8,143 C3.581722,143 2.31743984e-15,139.418278 1.77635684e-15,135 L0,104 C-5.41083001e-16,99.581722 3.581722,96 8,96 Z" id="Rectangle-Copy-26" transform="translate(23.500000, 119.500000) rotate(-90.000000) translate(-23.500000, -119.500000) "></path>
                    <path d="M8,144 L39,144 C43.418278,144 47,147.581722 47,152 L47,183 C47,187.418278 43.418278,191 39,191 L8,191 C3.581722,191 2.31743984e-15,187.418278 1.77635684e-15,183 L0,152 C-5.41083001e-16,147.581722 3.581722,144 8,144 Z" id="Rectangle-Copy-27" transform="translate(23.500000, 167.500000) rotate(-90.000000) translate(-23.500000, -167.500000) "></path>
                    <path d="M56,144 L87,144 C91.418278,144 95,147.581722 95,152 L95,183 C95,187.418278 91.418278,191 87,191 L56,191 C51.581722,191 48,187.418278 48,183 L48,152 C48,147.581722 51.581722,144 56,144 Z" id="Rectangle-Copy-28" transform="translate(71.500000, 167.500000) rotate(-90.000000) translate(-71.500000, -167.500000) "></path>
                    <path d="M104,144 L135,144 C139.418278,144 143,147.581722 143,152 L143,183 C143,187.418278 139.418278,191 135,191 L104,191 C99.581722,191 96,187.418278 96,183 L96,152 C96,147.581722 99.581722,144 104,144 Z" id="Rectangle-Copy-29" transform="translate(119.500000, 167.500000) rotate(-90.000000) translate(-119.500000, -167.500000) "></path>
                    <path d="M56,1 L87,1 C91.418278,1 95,4.581722 95,9 L95,40 C95,44.418278 91.418278,48 87,48 L56,48 C51.581722,48 48,44.418278 48,40 L48,9 C48,4.581722 51.581722,1 56,1 Z" id="Rectangle-Copy-31" transform="translate(71.500000, 24.500000) rotate(-90.000000) translate(-71.500000, -24.500000) "></path>
                    <path d="M104,1 L135,1 C139.418278,1 143,4.581722 143,9 L143,40 C143,44.418278 139.418278,48 135,48 L104,48 C99.581722,48 96,44.418278 96,40 L96,9 C96,4.581722 99.581722,1 104,1 Z" id="Rectangle-Copy-32" transform="translate(119.500000, 24.500000) rotate(-90.000000) translate(-119.500000, -24.500000) "></path>
                    <path d="M64,71 L79,71 C83.418278,71 87,74.581722 87,79 L87,110 C87,114.418278 83.418278,118 79,118 L64,118 C59.581722,118 56,114.418278 56,110 L56,79 C56,74.581722 59.581722,71 64,71 Z" id="Rectangle-Copy-30" transform="translate(71.500000, 94.500000) rotate(-90.000000) translate(-71.500000, -94.500000) "></path>
                </g>
                <g id="R" transform="translate(442.000000, 271.000000)">
                    <path d="M8,0 L41,-1.77635684e-15 C45.418278,-2.58798134e-15 49,3.581722 49,8 L49,41 C49,45.418278 45.418278,49 41,49 L8,49 C3.581722,49 -2.12345226e-15,45.418278 -2.66453526e-15,41 L-1.77635684e-15,8 C-2.31743984e-15,3.581722 3.581722,-1.85291076e-15 8,-2.66453526e-15 Z" id="Rectangle-Copy-24" transform="translate(24.500000, 24.500000) rotate(-90.000000) translate(-24.500000, -24.500000) "></path>
                    <path d="M8,50 L41,50 C45.418278,50 49,53.581722 49,58 L49,91 C49,95.418278 45.418278,99 41,99 L8,99 C3.581722,99 -2.12345226e-15,95.418278 -2.66453526e-15,91 L-1.77635684e-15,58 C-2.31743984e-15,53.581722 3.581722,50 8,50 Z" id="Rectangle-Copy-25" transform="translate(24.500000, 74.500000) rotate(-90.000000) translate(-24.500000, -74.500000) "></path>
                    <path d="M8,100 L41,100 C45.418278,100 49,103.581722 49,108 L49,141 C49,145.418278 45.418278,149 41,149 L8,149 C3.581722,149 -2.12345226e-15,145.418278 -2.66453526e-15,141 L-1.77635684e-15,108 C-2.31743984e-15,103.581722 3.581722,100 8,100 Z" id="Rectangle-Copy-26" transform="translate(24.500000, 124.500000) rotate(-90.000000) translate(-24.500000, -124.500000) "></path>
                    <path d="M8,150 L41,150 C45.418278,150 49,153.581722 49,158 L49,191 C49,195.418278 45.418278,199 41,199 L8,199 C3.581722,199 -2.12345226e-15,195.418278 -2.66453526e-15,191 L-1.77635684e-15,158 C-2.31743984e-15,153.581722 3.581722,150 8,150 Z" id="Rectangle-Copy-27" transform="translate(24.500000, 174.500000) rotate(-90.000000) translate(-24.500000, -174.500000) "></path>
                    <path d="M58,149 L91,149 C95.418278,149 99,152.581722 99,157 L99,190 C99,194.418278 95.418278,198 91,198 L58,198 C53.581722,198 50,194.418278 50,190 L50,157 C50,152.581722 53.581722,149 58,149 Z" id="Rectangle-Copy-28" transform="translate(74.500000, 173.500000) rotate(-90.000000) translate(-74.500000, -173.500000) "></path>
                    <path d="M108,149 L141,149 C145.418278,149 149,152.581722 149,157 L149,190 C149,194.418278 145.418278,198 141,198 L108,198 C103.581722,198 100,194.418278 100,190 L100,157 C100,152.581722 103.581722,149 108,149 Z" id="Rectangle-Copy-29" transform="translate(124.500000, 173.500000) rotate(-90.000000) translate(-124.500000, -173.500000) "></path>
                    <path d="M58,0 L91,-1.77635684e-15 C95.418278,-2.58798134e-15 99,3.581722 99,8 L99,41 C99,45.418278 95.418278,49 91,49 L58,49 C53.581722,49 50,45.418278 50,41 L50,8 C50,3.581722 53.581722,-1.85291076e-15 58,-2.66453526e-15 Z" id="Rectangle-Copy-31" transform="translate(74.500000, 24.500000) rotate(-90.000000) translate(-74.500000, -24.500000) "></path>
                    <path d="M108,0 L141,-1.77635684e-15 C145.418278,-2.58798134e-15 149,3.581722 149,8 L149,41 C149,45.418278 145.418278,49 141,49 L108,49 C103.581722,49 100,45.418278 100,41 L100,8 C100,3.581722 103.581722,-1.85291076e-15 108,-2.66453526e-15 Z" id="Rectangle-Copy-32" transform="translate(124.500000, 24.500000) rotate(-90.000000) translate(-124.500000, -24.500000) "></path>
                    <path d="M65,73 L82,73 C86.418278,73 90,76.581722 90,81 L90,114 C90,118.418278 86.418278,122 82,122 L65,122 C60.581722,122 57,118.418278 57,114 L57,81 C57,76.581722 60.581722,73 65,73 Z" id="Rectangle-Copy-30" transform="translate(73.500000, 97.500000) rotate(-90.000000) translate(-73.500000, -97.500000) "></path>
                </g>
                <g id="E-Copy-2" transform="translate(657.000000, 271.000000)">
                    <path d="M8,0 L41,-1.77635684e-15 C45.418278,-2.58798134e-15 49,3.581722 49,8 L49,41 C49,45.418278 45.418278,49 41,49 L8,49 C3.581722,49 -2.12345226e-15,45.418278 -2.66453526e-15,41 L-1.77635684e-15,8 C-2.31743984e-15,3.581722 3.581722,-1.85291076e-15 8,-2.66453526e-15 Z" id="Rectangle-Copy-24" transform="translate(24.500000, 24.500000) rotate(-90.000000) translate(-24.500000, -24.500000) "></path>
                    <path d="M8,50 L41,50 C45.418278,50 49,53.581722 49,58 L49,91 C49,95.418278 45.418278,99 41,99 L8,99 C3.581722,99 -2.12345226e-15,95.418278 -2.66453526e-15,91 L-1.77635684e-15,58 C-2.31743984e-15,53.581722 3.581722,50 8,50 Z" id="Rectangle-Copy-25" transform="translate(24.500000, 74.500000) rotate(-90.000000) translate(-24.500000, -74.500000) "></path>
                    <path d="M8,100 L41,100 C45.418278,100 49,103.581722 49,108 L49,141 C49,145.418278 45.418278,149 41,149 L8,149 C3.581722,149 -2.12345226e-15,145.418278 -2.66453526e-15,141 L-1.77635684e-15,108 C-2.31743984e-15,103.581722 3.581722,100 8,100 Z" id="Rectangle-Copy-26" transform="translate(24.500000, 124.500000) rotate(-90.000000) translate(-24.500000, -124.500000) "></path>
                    <path d="M8,150 L41,150 C45.418278,150 49,153.581722 49,158 L49,191 C49,195.418278 45.418278,199 41,199 L8,199 C3.581722,199 -2.12345226e-15,195.418278 -2.66453526e-15,191 L-1.77635684e-15,158 C-2.31743984e-15,153.581722 3.581722,150 8,150 Z" id="Rectangle-Copy-27" transform="translate(24.500000, 174.500000) rotate(-90.000000) translate(-24.500000, -174.500000) "></path>
                    <path d="M107,50 L140,50 C144.418278,50 148,53.581722 148,58 L148,91 C148,95.418278 144.418278,99 140,99 L107,99 C102.581722,99 99,95.418278 99,91 L99,58 C99,53.581722 102.581722,50 107,50 Z" id="Rectangle-Copy-28" transform="translate(123.500000, 74.500000) rotate(-90.000000) translate(-123.500000, -74.500000) "></path>
                    <path d="M88,100 L121,100 C125.418278,100 129,103.581722 129,108 L129,141 C129,145.418278 125.418278,149 121,149 L88,149 C83.581722,149 80,145.418278 80,141 L80,108 C80,103.581722 83.581722,100 88,100 Z" id="Rectangle-Copy-29" transform="translate(104.500000, 124.500000) rotate(-90.000000) translate(-104.500000, -124.500000) "></path>
                    <path d="M108,150 L141,150 C145.418278,150 149,153.581722 149,158 L149,191 C149,195.418278 145.418278,199 141,199 L108,199 C103.581722,199 100,195.418278 100,191 L100,158 C100,153.581722 103.581722,150 108,150 Z" id="Rectangle-Copy-33" transform="translate(124.500000, 174.500000) rotate(-90.000000) translate(-124.500000, -174.500000) "></path>
                    <path d="M58,0 L91,-1.77635684e-15 C95.418278,-2.58798134e-15 99,3.581722 99,8 L99,41 C99,45.418278 95.418278,49 91,49 L58,49 C53.581722,49 50,45.418278 50,41 L50,8 C50,3.581722 53.581722,-1.85291076e-15 58,-2.66453526e-15 Z" id="Rectangle-Copy-31" transform="translate(74.500000, 24.500000) rotate(-90.000000) translate(-74.500000, -24.500000) "></path>
                    <path d="M108,0 L141,-1.77635684e-15 C145.418278,-2.58798134e-15 149,3.581722 149,8 L149,41 C149,45.418278 145.418278,49 141,49 L108,49 C103.581722,49 100,45.418278 100,41 L100,8 C100,3.581722 103.581722,-1.85291076e-15 108,-2.66453526e-15 Z" id="Rectangle-Copy-32" transform="translate(124.500000, 24.500000) rotate(-90.000000) translate(-124.500000, -24.500000) "></path>
                    <path d="M66,59 L82,59 C86.418278,59 90,62.581722 90,67 L90,100 C90,104.418278 86.418278,108 82,108 L66,108 C61.581722,108 58,104.418278 58,100 L58,67 C58,62.581722 61.581722,59 66,59 Z" id="Rectangle-Copy-30" transform="translate(74.000000, 83.500000) rotate(-90.000000) translate(-74.000000, -83.500000) "></path>
                </g>
                <g id="A" transform="translate(196.000000, 3.000000)">
                    <g id="Science-Copy-13">
                        <path d="M7.86068111,141.49226 L39.5077399,141.49226 C43.9260179,141.49226 47.5077399,145.073982 47.5077399,149.49226 L47.5077399,180.860681 C47.5077399,185.278959 43.9260179,188.860681 39.5077399,188.860681 L7.86068111,188.860681 C3.44240312,188.860681 -0.139318885,185.278959 -0.139318885,180.860681 L-0.139318885,149.49226 C-0.139318885,145.073982 3.44240312,141.49226 7.86068111,141.49226 Z" id="Rectangle-Copy-11" transform="translate(23.684211, 165.176471) rotate(-90.000000) translate(-23.684211, -165.176471) "></path>
                        <path d="M20.4922601,94.6393189 L52.1393189,94.6393189 C56.5575969,94.6393189 60.1393189,98.2210409 60.1393189,102.639319 L60.1393189,134.00774 C60.1393189,138.426018 56.5575969,142.00774 52.1393189,142.00774 L20.4922601,142.00774 C16.0739821,142.00774 12.4922601,138.426018 12.4922601,134.00774 L12.4922601,102.639319 C12.4922601,98.2210409 16.0739821,94.6393189 20.4922601,94.6393189 Z" id="Rectangle-Copy-11" transform="translate(36.315789, 118.323529) rotate(-90.000000) translate(-36.315789, -118.323529) "></path>
                        <path d="M35.4922601,47.7863777 L67.1393189,47.7863777 C71.5575969,47.7863777 75.1393189,51.3680997 75.1393189,55.7863777 L75.1393189,87.1547988 C75.1393189,91.5730768 71.5575969,95.1547988 67.1393189,95.1547988 L35.4922601,95.1547988 C31.0739821,95.1547988 27.4922601,91.5730768 27.4922601,87.1547988 L27.4922601,55.7863777 C27.4922601,51.3680997 31.0739821,47.7863777 35.4922601,47.7863777 Z" id="Rectangle-Copy-11" transform="translate(51.315789, 71.470588) rotate(-90.000000) translate(-51.315789, -71.470588) "></path>
                        <path d="M50.4922601,0.139318885 L82.1393189,0.139318885 C86.5575969,0.139318885 90.1393189,3.72104089 90.1393189,8.13931889 L90.1393189,39.5077399 C90.1393189,43.9260179 86.5575969,47.5077399 82.1393189,47.5077399 L50.4922601,47.5077399 C46.0739821,47.5077399 42.4922601,43.9260179 42.4922601,39.5077399 L42.4922601,8.13931889 C42.4922601,3.72104089 46.0739821,0.139318885 50.4922601,0.139318885 Z" id="Rectangle-Copy-12" transform="translate(66.315789, 23.823529) rotate(-90.000000) translate(-66.315789, -23.823529) "></path>
                    </g>
                    <g id="Science-Copy-14" transform="translate(135.000000, 94.500000) scale(1, -1) translate(-135.000000, -94.500000) translate(90.000000, 0.000000)">
                        <path d="M7.86068111,141.49226 L39.5077399,141.49226 C43.9260179,141.49226 47.5077399,145.073982 47.5077399,149.49226 L47.5077399,180.860681 C47.5077399,185.278959 43.9260179,188.860681 39.5077399,188.860681 L7.86068111,188.860681 C3.44240312,188.860681 -0.139318885,185.278959 -0.139318885,180.860681 L-0.139318885,149.49226 C-0.139318885,145.073982 3.44240312,141.49226 7.86068111,141.49226 Z" id="Rectangle-Copy-11" transform="translate(23.684211, 165.176471) rotate(-90.000000) translate(-23.684211, -165.176471) "></path>
                        <path d="M20.4922601,94.6393189 L52.1393189,94.6393189 C56.5575969,94.6393189 60.1393189,98.2210409 60.1393189,102.639319 L60.1393189,134.00774 C60.1393189,138.426018 56.5575969,142.00774 52.1393189,142.00774 L20.4922601,142.00774 C16.0739821,142.00774 12.4922601,138.426018 12.4922601,134.00774 L12.4922601,102.639319 C12.4922601,98.2210409 16.0739821,94.6393189 20.4922601,94.6393189 Z" id="Rectangle-Copy-11" transform="translate(36.315789, 118.323529) rotate(-90.000000) translate(-36.315789, -118.323529) "></path>
                        <path d="M35.4922601,47.7863777 L67.1393189,47.7863777 C71.5575969,47.7863777 75.1393189,51.3680997 75.1393189,55.7863777 L75.1393189,87.1547988 C75.1393189,91.5730768 71.5575969,95.1547988 67.1393189,95.1547988 L35.4922601,95.1547988 C31.0739821,95.1547988 27.4922601,91.5730768 27.4922601,87.1547988 L27.4922601,55.7863777 C27.4922601,51.3680997 31.0739821,47.7863777 35.4922601,47.7863777 Z" id="Rectangle-Copy-11" transform="translate(51.315789, 71.470588) rotate(-90.000000) translate(-51.315789, -71.470588) "></path>
                        <path d="M50.4922601,0.139318885 L82.1393189,0.139318885 C86.5575969,0.139318885 90.1393189,3.72104089 90.1393189,8.13931889 L90.1393189,39.5077399 C90.1393189,43.9260179 86.5575969,47.5077399 82.1393189,47.5077399 L50.4922601,47.5077399 C46.0739821,47.5077399 42.4922601,43.9260179 42.4922601,39.5077399 L42.4922601,8.13931889 C42.4922601,3.72104089 46.0739821,0.139318885 50.4922601,0.139318885 Z" id="Rectangle-Copy-12" transform="translate(66.315789, 23.823529) rotate(-90.000000) translate(-66.315789, -23.823529) "></path>
                    </g>
                </g>
                <g id="V" transform="translate(286.500000, 370.500000) scale(1, -1) translate(-286.500000, -370.500000) translate(195.000000, 271.000000)">
                    <g id="Science-Copy-13">
                        <path d="M7.88279522,149.461743 L40.5382574,149.461743 C44.9565354,149.461743 48.5382574,153.043465 48.5382574,157.461743 L48.5382574,189.882795 C48.5382574,194.301073 44.9565354,197.882795 40.5382574,197.882795 L7.88279522,197.882795 C3.46451722,197.882795 -0.117204777,194.301073 -0.117204777,189.882795 L-0.117204777,157.461743 C-0.117204777,153.043465 3.46451722,149.461743 7.88279522,149.461743 Z" id="Rectangle-Copy-11" transform="translate(24.210526, 173.672269) rotate(-90.000000) translate(-24.210526, -173.672269) "></path>
                        <path d="M20.7950759,99.6172048 L53.4505381,99.6172048 C57.8688161,99.6172048 61.4505381,103.198927 61.4505381,107.617205 L61.4505381,140.038257 C61.4505381,144.456535 57.8688161,148.038257 53.4505381,148.038257 L20.7950759,148.038257 C16.3767979,148.038257 12.7950759,144.456535 12.7950759,140.038257 L12.7950759,107.617205 C12.7950759,103.198927 16.3767979,99.6172048 20.7950759,99.6172048 Z" id="Rectangle-Copy-11" transform="translate(37.122807, 123.827731) rotate(-90.000000) translate(-37.122807, -123.827731) "></path>
                        <path d="M36.1284093,49.772667 L68.7838714,49.772667 C73.2021494,49.772667 76.7838714,53.354389 76.7838714,57.772667 L76.7838714,90.1937196 C76.7838714,94.6119976 73.2021494,98.1937196 68.7838714,98.1937196 L36.1284093,98.1937196 C31.7101313,98.1937196 28.1284093,94.6119976 28.1284093,90.1937196 L28.1284093,57.772667 C28.1284093,53.354389 31.7101313,49.772667 36.1284093,49.772667 Z" id="Rectangle-Copy-11" transform="translate(52.456140, 73.983193) rotate(-90.000000) translate(-52.456140, -73.983193) "></path>
                        <path d="M51.4617426,0.117204777 L84.1172048,0.117204777 C88.5354828,0.117204777 92.1172048,3.69892678 92.1172048,8.11720478 L92.1172048,40.5382574 C92.1172048,44.9565354 88.5354828,48.5382574 84.1172048,48.5382574 L51.4617426,48.5382574 C47.0434646,48.5382574 43.4617426,44.9565354 43.4617426,40.5382574 L43.4617426,8.11720478 C43.4617426,3.69892678 47.0434646,0.117204777 51.4617426,0.117204777 Z" id="Rectangle-Copy-12" transform="translate(67.789474, 24.327731) rotate(-90.000000) translate(-67.789474, -24.327731) "></path>
                    </g>
                    <g id="Science-Copy-14" transform="translate(137.500000, 100.000000) scale(1, -1) translate(-137.500000, -100.000000) translate(92.000000, 1.000000)">
                        <path d="M7.88279522,149.461743 L40.5382574,149.461743 C44.9565354,149.461743 48.5382574,153.043465 48.5382574,157.461743 L48.5382574,189.882795 C48.5382574,194.301073 44.9565354,197.882795 40.5382574,197.882795 L7.88279522,197.882795 C3.46451722,197.882795 -0.117204777,194.301073 -0.117204777,189.882795 L-0.117204777,157.461743 C-0.117204777,153.043465 3.46451722,149.461743 7.88279522,149.461743 Z" id="Rectangle-Copy-11" transform="translate(24.210526, 173.672269) rotate(-90.000000) translate(-24.210526, -173.672269) "></path>
                        <path d="M20.7950759,99.6172048 L53.4505381,99.6172048 C57.8688161,99.6172048 61.4505381,103.198927 61.4505381,107.617205 L61.4505381,140.038257 C61.4505381,144.456535 57.8688161,148.038257 53.4505381,148.038257 L20.7950759,148.038257 C16.3767979,148.038257 12.7950759,144.456535 12.7950759,140.038257 L12.7950759,107.617205 C12.7950759,103.198927 16.3767979,99.6172048 20.7950759,99.6172048 Z" id="Rectangle-Copy-11" transform="translate(37.122807, 123.827731) rotate(-90.000000) translate(-37.122807, -123.827731) "></path>
                        <path d="M36.1284093,49.772667 L68.7838714,49.772667 C73.2021494,49.772667 76.7838714,53.354389 76.7838714,57.772667 L76.7838714,90.1937196 C76.7838714,94.6119976 73.2021494,98.1937196 68.7838714,98.1937196 L36.1284093,98.1937196 C31.7101313,98.1937196 28.1284093,94.6119976 28.1284093,90.1937196 L28.1284093,57.772667 C28.1284093,53.354389 31.7101313,49.772667 36.1284093,49.772667 Z" id="Rectangle-Copy-11" transform="translate(52.456140, 73.983193) rotate(-90.000000) translate(-52.456140, -73.983193) "></path>
                        <path d="M50.4617426,0.117204777 L83.1172048,0.117204777 C87.5354828,0.117204777 91.1172048,3.69892678 91.1172048,8.11720478 L91.1172048,40.5382574 C91.1172048,44.9565354 87.5354828,48.5382574 83.1172048,48.5382574 L50.4617426,48.5382574 C46.0434646,48.5382574 42.4617426,44.9565354 42.4617426,40.5382574 L42.4617426,8.11720478 C42.4617426,3.69892678 46.0434646,0.117204777 50.4617426,0.117204777 Z" id="Rectangle-Copy-12" transform="translate(66.789474, 24.327731) rotate(-90.000000) translate(-66.789474, -24.327731) "></path>
                    </g>
                </g>
                <g id="M" transform="translate(418.000000, 5.000000)">
                    <path d="M8,0 L39,0 C43.418278,-8.11624501e-16 47,3.581722 47,8 L47,39 C47,43.418278 43.418278,47 39,47 L8,47 C3.581722,47 2.31743984e-15,43.418278 1.77635684e-15,39 L0,8 C-5.41083001e-16,3.581722 3.581722,2.58798134e-15 8,1.77635684e-15 Z" id="Rectangle-Copy-13" transform="translate(23.500000, 23.500000) rotate(-90.000000) translate(-23.500000, -23.500000) "></path>
                    <path d="M48,27 L79,27 C83.418278,27 87,30.581722 87,35 L87,51 C87,55.418278 83.418278,59 79,59 L48,59 C43.581722,59 40,55.418278 40,51 L40,35 C40,30.581722 43.581722,27 48,27 Z" id="Rectangle-Copy-17" transform="translate(63.500000, 43.000000) rotate(-90.000000) translate(-63.500000, -43.000000) "></path>
                    <path d="M81,64 L103,64 C107.418278,64 111,67.581722 111,72 L111,88 C111,92.418278 107.418278,96 103,96 L81,96 C76.581722,96 73,92.418278 73,88 L73,72 C73,67.581722 76.581722,64 81,64 Z" id="Rectangle-Copy-18" transform="translate(92.000000, 80.000000) rotate(-90.000000) translate(-92.000000, -80.000000) "></path>
                    <rect id="Rectangle-Copy-19" transform="translate(122.500000, 43.000000) rotate(-90.000000) translate(-122.500000, -43.000000) " x="99" y="25" width="47" height="36" rx="8"></rect>
                    <rect id="Rectangle-Copy-20" transform="translate(164.500000, 23.500000) rotate(-90.000000) translate(-164.500000, -23.500000) " x="141" y="0" width="47" height="47" rx="8"></rect>
                    <path d="M150,48 L181,48 C185.418278,48 189,51.581722 189,56 L189,87 C189,91.418278 185.418278,95 181,95 L150,95 C145.581722,95 142,91.418278 142,87 L142,56 C142,51.581722 145.581722,48 150,48 Z" id="Rectangle-Copy-21" transform="translate(165.500000, 71.500000) rotate(-90.000000) translate(-165.500000, -71.500000) "></path>
                    <path d="M151,96 L182,96 C186.418278,96 190,99.581722 190,104 L190,135 C190,139.418278 186.418278,143 182,143 L151,143 C146.581722,143 143,139.418278 143,135 L143,104 C143,99.581722 146.581722,96 151,96 Z" id="Rectangle-Copy-22" transform="translate(166.500000, 119.500000) rotate(-90.000000) translate(-166.500000, -119.500000) "></path>
                    <path d="M152,144 L183,144 C187.418278,144 191,147.581722 191,152 L191,183 C191,187.418278 187.418278,191 183,191 L152,191 C147.581722,191 144,187.418278 144,183 L144,152 C144,147.581722 147.581722,144 152,144 Z" id="Rectangle-Copy-23" transform="translate(167.500000, 167.500000) rotate(-90.000000) translate(-167.500000, -167.500000) "></path>
                    <path d="M8,48 L39,48 C43.418278,48 47,51.581722 47,56 L47,87 C47,91.418278 43.418278,95 39,95 L8,95 C3.581722,95 2.31743984e-15,91.418278 1.77635684e-15,87 L0,56 C-5.41083001e-16,51.581722 3.581722,48 8,48 Z" id="Rectangle-Copy-14" transform="translate(23.500000, 71.500000) rotate(-90.000000) translate(-23.500000, -71.500000) "></path>
                    <path d="M8,144 L39,144 C43.418278,144 47,147.581722 47,152 L47,183 C47,187.418278 43.418278,191 39,191 L8,191 C3.581722,191 2.31743984e-15,187.418278 1.77635684e-15,183 L0,152 C-5.41083001e-16,147.581722 3.581722,144 8,144 Z" id="Rectangle-Copy-15" transform="translate(23.500000, 167.500000) rotate(-90.000000) translate(-23.500000, -167.500000) "></path>
                    <path d="M8,96 L39,96 C43.418278,96 47,99.581722 47,104 L47,135 C47,139.418278 43.418278,143 39,143 L8,143 C3.581722,143 2.31743984e-15,139.418278 1.77635684e-15,135 L0,104 C-5.41083001e-16,99.581722 3.581722,96 8,96 Z" id="Rectangle-Copy-16" transform="translate(23.500000, 119.500000) rotate(-90.000000) translate(-23.500000, -119.500000) "></path>
                </g>
                <g id="O" transform="translate(0.000000, 274.000000)">
                    <path d="M8,1 L41,1 C45.418278,1 49,4.581722 49,9 L49,42 C49,46.418278 45.418278,50 41,50 L8,50 C3.581722,50 -2.12345226e-15,46.418278 -2.66453526e-15,42 L-1.77635684e-15,9 C-2.31743984e-15,4.581722 3.581722,1 8,1 Z" id="Rectangle-Copy-11" transform="translate(24.500000, 25.500000) rotate(-90.000000) translate(-24.500000, -25.500000) "></path>
                    <path d="M58,0 L91,-1.77635684e-15 C95.418278,-2.58798134e-15 99,3.581722 99,8 L99,41 C99,45.418278 95.418278,49 91,49 L58,49 C53.581722,49 50,45.418278 50,41 L50,8 C50,3.581722 53.581722,-1.85291076e-15 58,-2.66453526e-15 Z" id="Rectangle-Copy-11" transform="translate(74.500000, 24.500000) rotate(-90.000000) translate(-74.500000, -24.500000) "></path>
                    <path d="M108,0 L141,-1.77635684e-15 C145.418278,-2.58798134e-15 149,3.581722 149,8 L149,41 C149,45.418278 145.418278,49 141,49 L108,49 C103.581722,49 100,45.418278 100,41 L100,8 C100,3.581722 103.581722,-1.85291076e-15 108,-2.66453526e-15 Z" id="Rectangle-Copy-11" transform="translate(124.500000, 24.500000) rotate(-90.000000) translate(-124.500000, -24.500000) "></path>
                    <path d="M108,50 L141,50 C145.418278,50 149,53.581722 149,58 L149,91 C149,95.418278 145.418278,99 141,99 L108,99 C103.581722,99 100,95.418278 100,91 L100,58 C100,53.581722 103.581722,50 108,50 Z" id="Rectangle-Copy-11" transform="translate(124.500000, 74.500000) rotate(-90.000000) translate(-124.500000, -74.500000) "></path>
                    <path d="M108,100 L141,100 C145.418278,100 149,103.581722 149,108 L149,141 C149,145.418278 145.418278,149 141,149 L108,149 C103.581722,149 100,145.418278 100,141 L100,108 C100,103.581722 103.581722,100 108,100 Z" id="Rectangle-Copy-11" transform="translate(124.500000, 124.500000) rotate(-90.000000) translate(-124.500000, -124.500000) "></path>
                    <path d="M108,150 L141,150 C145.418278,150 149,153.581722 149,158 L149,191 C149,195.418278 145.418278,199 141,199 L108,199 C103.581722,199 100,195.418278 100,191 L100,158 C100,153.581722 103.581722,150 108,150 Z" id="Rectangle-Copy-11" transform="translate(124.500000, 174.500000) rotate(-90.000000) translate(-124.500000, -174.500000) "></path>
                    <path d="M58,150 L91,150 C95.418278,150 99,153.581722 99,158 L99,191 C99,195.418278 95.418278,199 91,199 L58,199 C53.581722,199 50,195.418278 50,191 L50,158 C50,153.581722 53.581722,150 58,150 Z" id="Rectangle-Copy-11" transform="translate(74.500000, 174.500000) rotate(-90.000000) translate(-74.500000, -174.500000) "></path>
                    <path d="M8,151 L41,151 C45.418278,151 49,154.581722 49,159 L49,192 C49,196.418278 45.418278,200 41,200 L8,200 C3.581722,200 -2.12345226e-15,196.418278 -2.66453526e-15,192 L-1.77635684e-15,159 C-2.31743984e-15,154.581722 3.581722,151 8,151 Z" id="Rectangle-Copy-11" transform="translate(24.500000, 175.500000) rotate(-90.000000) translate(-24.500000, -175.500000) "></path>
                    <path d="M9,101 L42,101 C46.418278,101 50,104.581722 50,109 L50,142 C50,146.418278 46.418278,150 42,150 L9,150 C4.581722,150 1,146.418278 1,142 L1,109 C1,104.581722 4.581722,101 9,101 Z" id="Rectangle-Copy-11" transform="translate(25.500000, 125.500000) rotate(-90.000000) translate(-25.500000, -125.500000) "></path>
                    <path d="M9,51 L42,51 C46.418278,51 50,54.581722 50,59 L50,92 C50,96.418278 46.418278,100 42,100 L9,100 C4.581722,100 1,96.418278 1,92 L1,59 C1,54.581722 4.581722,51 9,51 Z" id="Rectangle-Copy-11" transform="translate(25.500000, 75.500000) rotate(-90.000000) translate(-25.500000, -75.500000) "></path>
                </g>
                <g id="G" transform="translate(3.000000, 0.000000)">
                    <path d="M106,0 L138,0 C142.418278,-8.11624501e-16 146,3.581722 146,8 L146,40 C146,44.418278 142.418278,48 138,48 L106,48 C101.581722,48 98,44.418278 98,40 L98,8 C98,3.581722 101.581722,8.11624501e-16 106,0 Z" id="Rectangle-Copy-11" transform="translate(122.000000, 24.000000) rotate(-90.000000) translate(-122.000000, -24.000000) "></path>
                    <path d="M57,0 L89,0 C93.418278,-8.11624501e-16 97,3.581722 97,8 L97,40 C97,44.418278 93.418278,48 89,48 L57,48 C52.581722,48 49,44.418278 49,40 L49,8 C49,3.581722 52.581722,8.11624501e-16 57,0 Z" id="Rectangle-Copy-11" transform="translate(73.000000, 24.000000) rotate(-90.000000) translate(-73.000000, -24.000000) "></path>
                    <path d="M8,0 L40,0 C44.418278,-8.11624501e-16 48,3.581722 48,8 L48,40 C48,44.418278 44.418278,48 40,48 L8,48 C3.581722,48 5.41083001e-16,44.418278 0,40 L0,8 C-5.41083001e-16,3.581722 3.581722,8.11624501e-16 8,0 Z" id="Rectangle-Copy-11" transform="translate(24.000000, 24.000000) rotate(-90.000000) translate(-24.000000, -24.000000) "></path>
                    <path d="M8,49 L40,49 C44.418278,49 48,52.581722 48,57 L48,89 C48,93.418278 44.418278,97 40,97 L8,97 C3.581722,97 5.41083001e-16,93.418278 0,89 L0,57 C-5.41083001e-16,52.581722 3.581722,49 8,49 Z" id="Rectangle-Copy-11" transform="translate(24.000000, 73.000000) rotate(-90.000000) translate(-24.000000, -73.000000) "></path>
                    <path d="M8,98 L40,98 C44.418278,98 48,101.581722 48,106 L48,138 C48,142.418278 44.418278,146 40,146 L8,146 C3.581722,146 5.41083001e-16,142.418278 0,138 L0,106 C-5.41083001e-16,101.581722 3.581722,98 8,98 Z" id="Rectangle-Copy-11" transform="translate(24.000000, 122.000000) rotate(-90.000000) translate(-24.000000, -122.000000) "></path>
                    <path d="M8,147 L40,147 C44.418278,147 48,150.581722 48,155 L48,187 C48,191.418278 44.418278,195 40,195 L8,195 C3.581722,195 5.41083001e-16,191.418278 0,187 L0,155 C-5.41083001e-16,150.581722 3.581722,147 8,147 Z" id="Rectangle-Copy-11" transform="translate(24.000000, 171.000000) rotate(-90.000000) translate(-24.000000, -171.000000) "></path>
                    <path d="M57,146 L89,146 C93.418278,146 97,149.581722 97,154 L97,186 C97,190.418278 93.418278,194 89,194 L57,194 C52.581722,194 49,190.418278 49,186 L49,154 C49,149.581722 52.581722,146 57,146 Z" id="Rectangle-Copy-11" transform="translate(73.000000, 170.000000) rotate(-90.000000) translate(-73.000000, -170.000000) "></path>
                    <path d="M106,146 L138,146 C142.418278,146 146,149.581722 146,154 L146,186 C146,190.418278 142.418278,194 138,194 L106,194 C101.581722,194 98,190.418278 98,186 L98,154 C98,149.581722 101.581722,146 106,146 Z" id="Rectangle-Copy-11" transform="translate(122.000000, 170.000000) rotate(-90.000000) translate(-122.000000, -170.000000) "></path>
                    <path d="M105,97 L137,97 C141.418278,97 145,100.581722 145,105 L145,137 C145,141.418278 141.418278,145 137,145 L105,145 C100.581722,145 97,141.418278 97,137 L97,105 C97,100.581722 100.581722,97 105,97 Z" id="Rectangle-Copy-11" transform="translate(121.000000, 121.000000) rotate(-90.000000) translate(-121.000000, -121.000000) "></path>
                    <path d="M89,82 L97,82 C101.418278,82 105,85.581722 105,90 L105,122 C105,126.418278 101.418278,130 97,130 L89,130 C84.581722,130 81,126.418278 81,122 L81,90 C81,85.581722 84.581722,82 89,82 Z" id="Rectangle-Copy-11" transform="translate(93.000000, 106.000000) rotate(-90.000000) translate(-93.000000, -106.000000) "></path>
                </g>
            </g>
        </g>
    </g>
</svg>