<?xml version="1.0" encoding="UTF-8"?>
<svg width="569px" height="149px" viewBox="0 0 569 149" version="1.1" xmlns="http://www.w3.org/2000/svg" xmlns:xlink="http://www.w3.org/1999/xlink">
    <!-- Generator: Sketch 52.5 (67469) - http://www.bohemiancoding.com/sketch -->
    <title>Group 7</title>
    <desc>Created with Sketch.</desc>
    <defs>
        <linearGradient x1="3.72593485%" y1="3.72627971%" x2="98.4457275%" y2="98.4548393%" id="linearGradient-1">
            <stop stop-color="#FFDD00" offset="0%"></stop>
            <stop stop-color="#FBB034" offset="100%"></stop>
        </linearGradient>
        <linearGradient x1="50%" y1="100%" x2="0%" y2="0%" id="linearGradient-2">
            <stop stop-color="#7F00FF" offset="0%"></stop>
            <stop stop-color="#E100FF" offset="100%"></stop>
        </linearGradient>
        <rect id="path-3" x="4.03543856" y="4.03543856" width="56" height="56" rx="8"></rect>
        <filter x="-11.6%" y="-11.6%" width="123.2%" height="125.0%" filterUnits="objectBoundingBox" id="filter-4">
            <feOffset dx="1" dy="2" in="SourceAlpha" result="shadowOffsetOuter1"></feOffset>
            <feGaussianBlur stdDeviation="1.5" in="shadowOffsetOuter1" result="shadowBlurOuter1"></feGaussianBlur>
            <feColorMatrix values="0 0 0 0 0   0 0 0 0 0   0 0 0 0 0  0 0 0 0.199756567 0" type="matrix" in="shadowBlurOuter1" result="shadowMatrixOuter1"></feColorMatrix>
            <feOffset dx="-1" dy="-1" in="SourceAlpha" result="shadowOffsetOuter2"></feOffset>
            <feGaussianBlur stdDeviation="1.5" in="shadowOffsetOuter2" result="shadowBlurOuter2"></feGaussianBlur>
            <feColorMatrix values="0 0 0 0 0   0 0 0 0 0   0 0 0 0 0  0 0 0 0.202558877 0" type="matrix" in="shadowBlurOuter2" result="shadowMatrixOuter2"></feColorMatrix>
            <feMerge>
                <feMergeNode in="shadowMatrixOuter1"></feMergeNode>
                <feMergeNode in="shadowMatrixOuter2"></feMergeNode>
            </feMerge>
        </filter>
        <linearGradient x1="0%" y1="0%" x2="100%" y2="100%" id="linearGradient-5">
            <stop stop-color="#D763B5" offset="0%"></stop>
            <stop stop-color="#F80759" offset="100%"></stop>
        </linearGradient>
        <rect id="path-6" x="3.60307014" y="3.60307014" width="50" height="50" rx="8"></rect>
        <filter x="-13.0%" y="-13.0%" width="126.0%" height="128.0%" filterUnits="objectBoundingBox" id="filter-7">
            <feOffset dx="1" dy="2" in="SourceAlpha" result="shadowOffsetOuter1"></feOffset>
            <feGaussianBlur stdDeviation="1.5" in="shadowOffsetOuter1" result="shadowBlurOuter1"></feGaussianBlur>
            <feColorMatrix values="0 0 0 0 0   0 0 0 0 0   0 0 0 0 0  0 0 0 0.195510643 0" type="matrix" in="shadowBlurOuter1" result="shadowMatrixOuter1"></feColorMatrix>
            <feOffset dx="-1" dy="-1" in="SourceAlpha" result="shadowOffsetOuter2"></feOffset>
            <feGaussianBlur stdDeviation="1.5" in="shadowOffsetOuter2" result="shadowBlurOuter2"></feGaussianBlur>
            <feColorMatrix values="0 0 0 0 0   0 0 0 0 0   0 0 0 0 0  0 0 0 0.200803895 0" type="matrix" in="shadowBlurOuter2" result="shadowMatrixOuter2"></feColorMatrix>
            <feMerge>
                <feMergeNode in="shadowMatrixOuter1"></feMergeNode>
                <feMergeNode in="shadowMatrixOuter2"></feMergeNode>
            </feMerge>
        </filter>
        <linearGradient x1="0%" y1="0%" x2="48.8507045%" y2="97.701409%" id="linearGradient-8">
            <stop stop-color="#B2FEFA" offset="0%"></stop>
            <stop stop-color="#0ED2F7" offset="100%"></stop>
        </linearGradient>
        <linearGradient x1="0%" y1="3.14393939%" x2="100%" y2="100%" id="linearGradient-9">
            <stop stop-color="#B4EC51" offset="0%"></stop>
            <stop stop-color="#429321" offset="100%"></stop>
        </linearGradient>
        <linearGradient x1="0%" y1="0%" x2="50%" y2="100%" id="linearGradient-10">
            <stop stop-color="#F7B733" offset="0%"></stop>
            <stop stop-color="#FC4A1A" offset="100%"></stop>
        </linearGradient>
    </defs>
    <g id="Page-1" stroke="none" stroke-width="1" fill="none" fill-rule="evenodd">
        <g id="Desktop-HD" transform="translate(-132.000000, -15.000000)">
            <g id="Group-7" transform="translate(135.000000, 14.000000)">
                <text id="Trivia-Quizz" font-family="Avenir-Heavy, Avenir" font-size="52" font-weight="600" fill="#FFFFFF">
                    <tspan x="142.39" y="107">Trivia Quizz</tspan>
                </text>
                <g id="Group-1" transform="translate(79.000000, 61.000000)">
                    <rect id="Rectangle-Copy-25" fill="url(#linearGradient-1)" transform="translate(19.007596, 18.913176) rotate(10.000000) translate(-19.007596, -18.913176) " x="3.00759612" y="2.91317591" width="32" height="32" rx="8"></rect>
                    <text id="?" transform="translate(19.992404, 19.086824) rotate(10.000000) translate(-19.992404, -19.086824) " font-family=".SFNSDisplay, .SF NS Display" font-size="30" font-weight="normal" fill="#FFFFFF">
                        <tspan x="12.4704312" y="32.0868241">?</tspan>
                    </text>
                </g>
                <g id="Group-2" transform="translate(0.000000, 82.000000)">
                    <g id="Rectangle-Copy-26" transform="translate(32.035439, 32.035439) rotate(-9.000000) translate(-32.035439, -32.035439) ">
                        <use fill="black" fill-opacity="1" filter="url(#filter-4)" xlink:href="#path-3"></use>
                        <use fill="url(#linearGradient-2)" fill-rule="evenodd" xlink:href="#path-3"></use>
                    </g>
                    <text id="?" transform="translate(32.463377, 31.463377) rotate(-9.000000) translate(-32.463377, -31.463377) " font-family=".SFNSDisplay, .SF NS Display" font-size="44" font-weight="normal" fill="#FFFFFF">
                        <tspan x="21.5170881" y="46.9633772">?</tspan>
                    </text>
                </g>
                <g id="Group-3" transform="translate(10.000000, 4.000000)">
                    <g id="Rectangle-Copy-13" transform="translate(28.603070, 28.603070) rotate(-9.000000) translate(-28.603070, -28.603070) ">
                        <use fill="black" fill-opacity="1" filter="url(#filter-7)" xlink:href="#path-6"></use>
                        <use fill="url(#linearGradient-5)" fill-rule="evenodd" xlink:href="#path-6"></use>
                    </g>
                    <text id="?-copy-2" transform="translate(28.603070, 28.603070) rotate(-9.000000) translate(-28.603070, -28.603070) " font-family=".SFNSDisplay, .SF NS Display" font-size="40" font-weight="normal" fill="#FFFFFF">
                        <tspan x="18.632367" y="42.6030701">?</tspan>
                    </text>
                </g>
                <g id="Group-4" transform="translate(503.000000, 0.000000)">
                    <rect id="Rectangle-Copy-21" fill="url(#linearGradient-8)" transform="translate(32.298709, 32.298709) rotate(-21.000000) translate(-32.298709, -32.298709) " x="7.2987094" y="7.2987094" width="50" height="50" rx="8"></rect>
                    <text id="?" transform="translate(32.777168, 31.777168) rotate(-19.000000) translate(-32.777168, -31.777168) " font-family=".SFNSDisplay, .SF NS Display" font-size="40" font-weight="normal" fill="#FFFFFF">
                        <tspan x="22.8064651" y="45.7771683">?</tspan>
                    </text>
                </g>
                <g id="Group-5" transform="translate(497.000000, 82.000000)">
                    <g id="Group" transform="translate(23.721186, 23.721186) rotate(-12.000000) translate(-23.721186, -23.721186) translate(3.721186, 3.721186)">
                        <rect id="Rectangle-Copy-5" fill="url(#linearGradient-9)" x="-3.75166564e-12" y="-9.09494702e-13" width="40" height="40" rx="8"></rect>
                        <text id="?" font-family=".SFNSDisplay, .SF NS Display" font-size="35" font-weight="normal" fill="#FFFFFF">
                            <tspan x="10.75" y="34">?</tspan>
                        </text>
                    </g>
                </g>
                <g id="Group-6" transform="translate(442.000000, 39.000000)">
                    <rect id="Rectangle-Copy-12" fill="url(#linearGradient-10)" transform="translate(21.213808, 21.213808) rotate(-76.000000) translate(-21.213808, -21.213808) " x="3.71380838" y="3.71380838" width="35" height="35" rx="8"></rect>
                    <text id="?-copy" transform="translate(21.213808, 21.213808) rotate(14.000000) translate(-21.213808, -21.213808) " font-family=".SFNSDisplay, .SF NS Display" font-size="35" font-weight="normal" fill="#FFFFFF">
                        <tspan x="12.4638084" y="37.7138084">?</tspan>
                    </text>
                </g>
            </g>
        </g>
    </g>
</svg>