<?xml version="1.0" encoding="UTF-8" standalone="no"?>
<svg
   xmlns:dc="http://purl.org/dc/elements/1.1/"
   xmlns:cc="http://creativecommons.org/ns#"
   xmlns:rdf="http://www.w3.org/1999/02/22-rdf-syntax-ns#"
   xmlns:svg="http://www.w3.org/2000/svg"
   xmlns="http://www.w3.org/2000/svg"
   xmlns:sodipodi="http://sodipodi.sourceforge.net/DTD/sodipodi-0.dtd"
   xmlns:inkscape="http://www.inkscape.org/namespaces/inkscape"
   inkscape:export-ydpi="96"
   inkscape:export-xdpi="96"
   inkscape:export-filename="/home/es20490446e/Documents/Projects/optimizeVideo/info/icon.png"
   sodipodi:docname="icon.svg"
   inkscape:version="1.0 (4035a4fb49, 2020-05-01)"
   id="svg8"
   version="1.1"
   viewBox="0 0 285.74999 285.75001"
   height="1080"
   width="1080">
  <defs
     id="defs2">
    <inkscape:path-effect
       simplify_just_coalesce="false"
       simplify_individual_paths="false"
       helper_size="0"
       smooth_angles="360"
       threshold="0.000408163"
       steps="1"
       lpeversion="1"
       is_visible="true"
       id="path-effect921"
       effect="simplify" />
    <inkscape:path-effect
       simplify_just_coalesce="false"
       simplify_individual_paths="false"
       helper_size="0"
       smooth_angles="360"
       threshold="0.000408163"
       steps="1"
       lpeversion="1"
       is_visible="true"
       id="path-effect837"
       effect="simplify" />
  </defs>
  <sodipodi:namedview
     inkscape:window-maximized="1"
     inkscape:window-y="0"
     inkscape:window-x="79"
     inkscape:window-height="728"
     inkscape:window-width="1287"
     inkscape:showpageshadow="false"
     units="px"
     showborder="true"
     showgrid="false"
     inkscape:document-rotation="0"
     inkscape:current-layer="layer1"
     inkscape:document-units="mm"
     inkscape:cy="489.98189"
     inkscape:cx="-329.72633"
     inkscape:zoom="0.11313708"
     inkscape:pageshadow="2"
     inkscape:pageopacity="0.0"
     borderopacity="1.0"
     bordercolor="#666666"
     pagecolor="#ffffff"
     id="base" />
  <metadata
     id="metadata5">
    <rdf:RDF>
      <cc:Work
         rdf:about="">
        <dc:format>image/svg+xml</dc:format>
        <dc:type
           rdf:resource="http://purl.org/dc/dcmitype/StillImage" />
        <dc:title></dc:title>
      </cc:Work>
    </rdf:RDF>
  </metadata>
  <g
     id="layer1"
     inkscape:groupmode="layer"
     inkscape:label="Layer 1">
    <g
       transform="matrix(0.78763262,0,0,0.78763262,30.341993,30.341993)"
       id="g2044">
      <path
         sodipodi:type="star"
         style="fill:#009100;fill-rule:evenodd;stroke:#009100;stroke-width:32.0051;stroke-linecap:round;stroke-linejoin:round;stroke-miterlimit:4;stroke-dasharray:none;stroke-dashoffset:189.294;paint-order:normal"
         id="path1491"
         sodipodi:sides="3"
         sodipodi:cx="187.54027"
         sodipodi:cy="142.875"
         sodipodi:r1="178.66431"
         sodipodi:r2="89.332153"
         sodipodi:arg1="-1.0471976"
         sodipodi:arg2="0"
         inkscape:flatsided="true"
         inkscape:rounded="0"
         inkscape:randomized="0"
         d="m 276.87241,-11.852833 2e-5,309.455653 L 8.8759613,142.87501 Z"
         inkscape:transform-center-x="44.666072"
         inkscape:transform-center-y="1.4902735e-05" />
      <path
         inkscape:transform-center-y="6.0299165e-06"
         inkscape:transform-center-x="29.777384"
         d="m 232.20663,39.723101 1e-5,206.303789 L 53.542305,142.87501 Z"
         inkscape:randomized="0"
         inkscape:rounded="0"
         inkscape:flatsided="true"
         sodipodi:arg2="0"
         sodipodi:arg1="-1.0471976"
         sodipodi:r2="59.554775"
         sodipodi:r1="119.10955"
         sodipodi:cy="142.875"
         sodipodi:cx="172.65186"
         sodipodi:sides="3"
         id="path1491-3"
         style="fill:#9ade00;fill-rule:evenodd;stroke:#9ade00;stroke-width:21.3367;stroke-linecap:round;stroke-linejoin:round;stroke-miterlimit:4;stroke-dasharray:none;stroke-dashoffset:189.294;paint-order:normal"
         sodipodi:type="star" />
      <path
         inkscape:transform-center-y="7.746049e-06"
         inkscape:transform-center-x="14.888694"
         d="m 187.54081,91.29905 1e-5,103.1519 L 98.208652,142.875 Z"
         inkscape:randomized="0"
         inkscape:rounded="0"
         inkscape:flatsided="true"
         sodipodi:arg2="0"
         sodipodi:arg1="-1.0471976"
         sodipodi:r2="29.777388"
         sodipodi:r1="59.554775"
         sodipodi:cy="142.875"
         sodipodi:cx="157.76343"
         sodipodi:sides="3"
         id="path1491-5"
         style="fill:#ccff42;fill-rule:evenodd;stroke:#ccff42;stroke-width:10.6684;stroke-linecap:round;stroke-linejoin:round;stroke-miterlimit:4;stroke-dasharray:none;stroke-dashoffset:189.294;paint-order:normal"
         sodipodi:type="star" />
    </g>
  </g>
</svg>
