2020-05-21 12:28:25 [scrapy] DEBUG: Crawled (403) <GET http://www.truecaller.com/robots.txt> (referer: None)
2020-05-21 12:28:25 [scrapy] DEBUG: Crawled (403) <GET http://www.truecaller.com> (referer: None)
2020-05-21 12:28:26 [scrapy] INFO: Ignoring response <403 http://www.truecaller.com>: HTTP status code is not handled or not allowed
2020-05-21 12:28:26 [scrapy] INFO: Closing spider (finished)
2020-05-21 12:28:26 [scrapy] INFO: Dumping Scrapy stats:
{'downloader/request_bytes': 628,
 'downloader/request_count': 2,
 'downloader/request_method_count/GET': 2,
 'downloader/response_bytes': 3517,
 'downloader/response_count': 2,
 'downloader/response_status_count/403': 2,
 'finish_reason': 'finished',
 'finish_time': datetime.datetime(2020, 5, 21, 6, 58, 26, 61385),
 'httperror/response_ignored_count': 1,
 'httperror/response_ignored_status_count/403': 1,
 'log_count/DEBUG': 60,
 'log_count/INFO': 7,
 'response_received_count': 2,
 'robotstxt/request_count': 1,
 'robotstxt/response_count': 1,
 'robotstxt/response_status_count/403': 1,
 'scheduler/dequeued': 1,
 'scheduler/dequeued/memory': 1,
 'scheduler/enqueued': 1,
 'scheduler/enqueued/memory': 1,
 'start_time': datetime.datetime(2020, 5, 21, 6, 58, 25, 429351)}
2020-05-21 12:28:26 [scrapy] INFO: Spider closed (finished)
