<svg xmlns="http://www.w3.org/2000/svg" xmlns:xlink="http://www.w3.org/1999/xlink" width="400" height="400" viewBox="-40, -40, 480,480">
    <g fill="#000000" stroke="none">
        <path d="M76.238 63.861 L 76.238 111.386 91.299 111.386 L 106.361 111.386 104.377 116.460 C 103.285 119.251,102.052 
        122.537,101.637 123.762 C 101.221 124.988,100.148 127.884,99.253 130.198 C 98.358 132.512,95.947 138.973,93.895 144.554 C 91.842 
        150.136,87.464 161.943,84.164 170.792 C 80.865 179.641,73.742 198.800,68.335 213.366 C 58.314 240.367,49.833 263.158,45.676 274.257 
        C 44.401 277.661,43.238 280.557,43.090 280.693 C 42.943 280.829,42.822 281.163,42.822 281.436 C 42.822 281.708,42.279 283.434,41.616 
        285.272 L 40.411 288.614 20.701 288.614 L 0.990 288.614 0.990 335.149 L 0.990 381.683 94.554 381.683 L 188.119 381.683 188.119 350.347 
        L 188.119 319.011 190.594 313.366 C 191.955 310.262,193.069 307.655,193.069 307.574 C 193.069 307.492,195.491 307.426,198.450 307.426 
        L 203.831 307.426 206.123 313.519 L 208.416 319.613 208.416 350.648 L 208.416 381.683 304.208 381.683 L 400.000 381.683 400.000 335.154 
        L 400.000 288.625 380.147 288.496 L 360.294 288.366 356.662 278.989 C 354.664 273.831,353.129 269.451,353.251 269.254 C 353.372 269.057,353.282 
        268.822,353.051 268.730 C 352.819 268.639,351.614 265.891,350.372 262.624 C 349.130 259.356,342.614 242.426,335.891 225.000 C 317.986 
        178.591,316.303 174.224,306.705 149.257 C 301.890 136.733,296.937 123.923,295.697 120.792 C 294.457 117.661,293.146 114.264,292.783 113.243 
        L 292.123 111.386 308.190 111.386 L 324.257 111.386 324.257 63.861 L 324.257 16.337 200.248 16.337 L 76.238 16.337 76.238 63.861 "/>
    </g>

    <g fill="#FFFFFF" stroke="none">
        <path id="path0" d="M110.396 65.842 L 110.396 84.653 131.683 84.653 C 143.391 84.653,152.970 84.802,152.970 84.984 C 152.970 
        85.166,150.943 90.568,148.466 96.989 C 140.628 117.304,89.400 250.260,71.772 296.040 L 62.527 320.050 48.343 320.181 L 34.158 
        320.312 34.158 335.651 L 34.158 350.990 95.030 350.990 L 155.901 350.990 156.045 335.272 L 156.188 319.554 163.809 298.391 L 
        171.429 277.228 199.238 277.228 L 227.047 277.228 234.315 298.518 L 241.584 319.809 241.584 335.401 L 241.584 350.994 303.837 
        350.868 L 366.089 350.743 366.220 335.520 L 366.351 320.297 352.353 320.297 L 338.356 320.297 331.587 302.599 C 327.865 
        292.865,318.921 269.530,311.713 250.743 C 304.504 231.955,289.206 192.079,277.717 162.129 C 266.228 132.178,254.776 102.327,252.269 
        95.792 L 247.711 83.911 269.400 83.782 L 291.089 83.653 291.089 65.341 L 291.089 47.030 200.743 47.030 L 110.396 47.030 110.396 
        65.842 "/>
    </g>

    <g fill="#17468E" stroke="none">
        <path d="M197.922 49.381 C 197.491 50.675,191.973 65.099,185.658 81.436 C 174.832 109.445,145.688 185.147,130.233 225.409 
        C 116.553 261.044,108.781 281.519,106.631 287.584 C 101.753 301.345,95.267 307.446,84.186 308.700 L 81.261 309.031 79.198 
        314.002 C 78.063 316.737,77.020 319.272,76.881 319.636 C 76.670 320.183,82.397 320.297,110.233 320.297 L 143.839 320.297 
        145.633 314.869 C 147.420 309.458,147.422 309.440,146.361 309.119 C 137.598 306.462,137.878 298.541,147.663 272.277 C 
        150.250 265.334,152.922 258.094,153.601 256.188 L 154.835 252.723 199.334 252.596 L 243.833 252.470 248.457 264.973 C 
        250.999 271.849,254.509 281.108,256.256 285.549 C 261.421 298.676,260.887 302.161,253.160 305.762 L 250.627 306.943 
        252.823 313.620 L 255.018 320.297 287.905 320.297 C 305.993 320.297,320.781 320.130,320.768 319.926 C 320.755 319.722,319.696 
        316.784,318.415 313.399 L 316.085 307.243 311.548 305.672 C 300.323 301.787,294.902 295.940,289.865 282.287 C 287.207 
        275.083,269.201 228.297,243.811 162.624 C 239.811 152.277,233.018 134.678,228.716 123.515 C 224.413 112.351,216.843 92.748,211.893 
        79.950 C 206.943 67.153,202.075 54.513,201.075 51.860 C 198.974 46.284,198.956 46.271,197.922 49.381 M215.660 176.114 L 232.012 
        221.535 215.511 221.665 C 206.435 221.737,191.594 221.737,182.531 221.665 L 166.051 221.535 182.403 176.114 C 191.396 151.132,198.879 
        130.693,199.031 130.693 C 199.183 130.693,206.666 151.132,215.660 176.114 "/>
    </g>
</svg>