<?xml version="1.0" standalone="no"?>
<!DOCTYPE svg PUBLIC "-//W3C//DTD SVG 20010904//EN"
 "http://www.w3.org/TR/2001/REC-SVG-20010904/DTD/svg10.dtd">
<svg version="1.0" xmlns="http://www.w3.org/2000/svg"
 width="800.000000pt" height="1000.000000pt" viewBox="0 0 1000.000000 1000.000000"
 preserveAspectRatio="xMidYMid meet">

<g transform="translate(0.0,1000.0) scale(0.1,-0.1)"
fill="#FFE22B" stroke="none">
<path d="M4032 9553 c-18 -9 -43 -30 -55 -47 -20 -28 -22 -43 -22 -166 0 -180
8 -191 170 -252 72 -28 75 -38 37 -129 -86 -210 -1208 -2615 -1214 -2604 -18
31 -170 391 -189 447 -31 94 -50 203 -40 232 12 31 59 59 144 86 80 26 133 72
142 124 4 19 5 83 3 142 -3 93 -6 113 -25 140 -48 67 0 64 -948 64 -948 0
-900 3 -948 -64 -19 -27 -22 -46 -25 -153 -5 -176 18 -213 158 -263 82 -29
137 -60 177 -102 36 -38 114 -179 195 -353 99 -211 728 -1655 728 -1670 0 -23
-825 -1799 -885 -1905 -104 -185 -144 -221 -295 -267 -155 -47 -173 -74 -168
-256 3 -107 6 -126 25 -153 48 -67 6 -64 893 -64 887 0 845 -3 893 64 19 27
22 46 25 153 3 100 0 128 -14 158 -22 47 -74 81 -144 96 -61 13 -130 44 -130
59 0 5 9 33 21 62 32 84 343 758 349 758 7 0 1064 -2418 1107 -2532 88 -232
73 -284 -94 -333 -64 -19 -119 -70 -128 -119 -4 -19 -5 -83 -3 -142 3 -93 6
-113 25 -140 48 -68 -15 -64 1088 -64 1103 0 1040 -4 1088 64 19 27 22 47 25
140 2 59 1 123 -3 142 -10 55 -63 100 -147 125 -75 22 -138 70 -138 104 0 36
35 165 67 250 66 172 1126 2556 1134 2548 12 -13 330 -722 355 -792 12 -35 20
-69 18 -76 -7 -16 -64 -41 -138 -60 -125 -33 -149 -73 -144 -248 3 -107 6
-126 25 -153 48 -67 1 -64 943 -64 942 0 895 -3 943 64 19 27 22 47 25 140 5
139 -1 169 -43 210 -26 26 -57 41 -137 66 -57 17 -129 46 -161 62 -72 39 -93
70 -237 363 -138 280 -850 1830 -850 1850 0 25 642 1471 751 1692 122 246 141
266 328 334 75 27 127 74 136 123 4 19 5 83 3 142 -3 93 -6 113 -25 140 -48
67 -5 64 -908 64 -903 0 -860 3 -908 -64 -20 -28 -22 -42 -22 -166 0 -124 2
-138 23 -167 22 -31 63 -54 157 -88 28 -10 63 -31 79 -47 26 -27 28 -33 22
-80 -10 -74 -62 -218 -151 -421 l-79 -179 -17 34 c-29 57 -1165 2531 -1182
2576 -9 23 -17 47 -17 52 0 6 43 31 95 56 135 64 140 73 140 244 0 124 -2 138
-22 166 -48 67 2 64 -970 64 -788 0 -881 -2 -911 -17z m884 -4301 c-720 -1
-1311 -1 -1312 1 -3 3 1286 2852 1301 2878 4 6 303 -639 664 -1433 l656 -1443
-1309 -3z m1082 -971 c-24 -66 -1074 -2451 -1078 -2451 -7 0 -1070 2438 -1070
2453 0 4 484 7 1076 7 641 0 1074 -4 1072 -9z"/>
</g>

<g transform="translate(0.0,1000.0) scale(0.1,-0.1)"
fill="#8A00A5" stroke="none">
<path d="M4110 9341 l0 -78 58 -21 c79 -29 145 -75 167 -115 24 -45 16 -118
-23 -217 -16 -41 -310 -680 -652 -1419 l-621 -1344 192 -443 c106 -244 196
-441 199 -437 4 5 337 738 741 1630 404 892 736 1622 739 1622 3 0 340 -737
750 -1639 410 -902 748 -1640 751 -1640 3 0 99 212 212 471 l206 471 -601
1307 c-331 718 -621 1353 -644 1411 -46 111 -54 163 -30 208 27 52 98 103 189
137 l47 18 0 78 0 79 -840 0 -840 0 0 -79z"/>
<path d="M1210 7362 l0 -79 84 -32 c189 -71 250 -138 396 -436 121 -247 2433
-5534 2477 -5664 47 -139 53 -228 23 -299 -36 -82 -131 -153 -237 -177 l-33
-7 0 -79 0 -79 965 0 965 0 0 79 0 79 -46 11 c-26 7 -68 23 -94 36 -179 91
-195 231 -66 564 68 176 2410 5450 2492 5611 118 235 176 294 362 365 l72 28
0 79 0 78 -780 0 -780 0 0 -78 0 -77 71 -25 c125 -42 199 -110 218 -200 14
-63 0 -145 -47 -285 -36 -107 -2321 -5344 -2332 -5345 -6 0 -2231 5116 -2281
5245 -45 115 -79 258 -79 329 1 129 75 209 243 262 l57 18 0 78 0 78 -825 0
-825 0 0 -78z"/>
<path d="M3505 5081 c3 -10 66 -157 140 -327 l134 -309 1143 -3 1144 -2 137
312 c75 172 139 321 143 331 6 16 -66 17 -1421 17 -1388 0 -1426 0 -1420 -19z"/>
<path d="M7207 4422 c-114 -257 -207 -474 -207 -481 0 -7 90 -212 199 -455
110 -242 209 -469 220 -503 24 -72 27 -140 7 -187 -26 -63 -125 -123 -233
-141 l-43 -7 0 -79 0 -79 820 0 820 0 0 78 0 78 -92 28 c-174 52 -258 105
-320 200 -68 104 -260 502 -613 1273 -187 408 -342 743 -345 743 -3 0 -99
-211 -213 -468z"/>
<path d="M2060 4032 c-382 -830 -475 -1022 -547 -1132 -85 -130 -181 -199
-328 -238 l-65 -17 0 -77 0 -78 770 0 770 0 0 78 0 79 -48 11 c-142 32 -234
94 -248 166 -14 75 16 152 271 701 151 326 166 363 156 389 -22 61 -376 866
-381 866 -3 0 -160 -337 -350 -748z"/>
</g>
</svg>