<?xml version="1.0" standalone="no"?>
<!DOCTYPE svg PUBLIC "-//W3C//DTD SVG 20010904//EN"
 "http://www.w3.org/TR/2001/REC-SVG-20010904/DTD/svg10.dtd">
<svg version="1.0" xmlns="http://www.w3.org/2000/svg"
 width="612.000000pt" height="612.000000pt" viewBox="0 0 612.000000 612.000000"
 preserveAspectRatio="xMidYMid meet">

<g transform="translate(0.000000,612.000000) scale(0.100000,-0.100000)"
fill="#FFFFFF" stroke="none">
<path d="M1032 4951 c2 -5 157 -167 346 -359 188 -193 342 -354 342 -360 0 -5
-311 -679 -691 -1498 -380 -819 -693 -1497 -696 -1506 -5 -17 81 -18 1713 -18
1842 0 1794 -1 1993 50 98 25 222 76 312 130 162 96 335 272 426 432 23 40
259 596 524 1235 l482 1162 -29 25 c-16 13 -211 179 -434 370 l-405 345 -1943
1 c-1190 0 -1942 -4 -1940 -9z m3909 -512 c142 -121 259 -223 259 -226 0 -6
-838 -2006 -883 -2108 -83 -188 -254 -362 -438 -449 -161 -76 -43 -71 -1506
-74 -722 -1 -1313 -1 -1313 1 0 1 276 601 614 1332 l614 1330 -210 208 -210
207 1407 0 1406 0 260 -221z"/>
<path d="M3240 3508 c-134 -282 -323 -681 -421 -885 l-177 -373 217 0 217 0
407 869 c224 478 410 876 413 885 6 14 -15 16 -204 16 l-209 0 -243 -512z"/>
</g>

<g transform="translate(0.000000,612.000000) scale(0.100000,-0.100000)"
fill="#C42032" stroke="none">
<path d="M2333 4402 c64 -64 117 -120 117 -124 0 -4 -263 -579 -585 -1277
-322 -699 -585 -1275 -585 -1281 0 -8 350 -10 1173 -8 l1172 3 78 22 c205 58
375 202 475 403 60 121 853 2023 848 2035 -2 7 -92 87 -200 179 l-196 166
-1207 0 -1208 0 118 -118z m1763 -269 c-4 -10 -217 -467 -474 -1015 l-467
-998 -357 0 -357 0 65 138 c36 75 253 532 482 1015 l416 877 349 0 c328 0 349
-1 343 -17z"/>
</g>

<g transform="translate(0.000000,612.000000) scale(0.100000,-0.100000)"
fill="#00204E" stroke="none">
<path d="M711 5073 c13 -15 208 -216 432 -446 290 -296 408 -423 404 -435 -5
-16 -1433 -3097 -1444 -3114 -2 -5 847 -7 1889 -5 l1893 3 93 21 c411 95 714
307 914 640 61 101 1063 2513 1051 2530 -4 6 -226 196 -492 422 l-483 411
-2141 0 -2140 0 24 -27z m4619 -469 c223 -190 415 -355 427 -367 l22 -22 -488
-1178 c-450 -1083 -495 -1186 -556 -1278 -183 -274 -459 -454 -808 -526 -75
-15 -242 -17 -1839 -20 -967 -2 -1758 0 -1758 4 0 5 315 685 699 1513 l699
1505 -191 195 c-106 107 -264 268 -352 358 l-160 162 1950 0 1950 -1 405 -345z"/>
<path d="M2073 4459 c114 -110 207 -206 207 -211 0 -6 -273 -603 -606 -1327
-334 -724 -609 -1324 -612 -1333 -4 -17 59 -18 1229 -18 778 0 1267 4 1324 10
111 13 249 58 339 112 82 48 212 169 271 253 24 33 59 94 79 135 70 145 896
2124 892 2136 -2 6 -118 109 -258 227 l-253 216 -1409 1 -1409 0 206 -201z
m2752 -111 c110 -93 199 -175 199 -182 -1 -6 -183 -441 -404 -966 -221 -525
-410 -977 -420 -1003 -31 -81 -111 -199 -185 -272 -82 -82 -168 -135 -280
-173 l-80 -27 -1188 -3 c-1135 -2 -1188 -2 -1179 15 6 10 272 587 592 1283
l583 1264 -121 118 -121 118 1202 0 1202 -1 200 -171z"/>
<path d="M3376 4103 c-48 -97 -936 -1971 -936 -1977 0 -4 163 -5 362 -4 l362
3 473 1010 c260 556 473 1011 473 1013 0 1 -160 2 -355 2 l-355 0 -24 -47z
m522 -92 c-1 -6 -187 -404 -413 -885 l-410 -876 -212 0 c-117 0 -213 3 -213 7
0 4 188 402 417 885 l417 878 209 0 c126 0 207 -4 205 -9z"/>
</g>
</svg>
