EESchema Schematic File Version 4
EELAYER 30 0
EELAYER END
$Descr A4 11693 8268
encoding utf-8
Sheet 1 1
Title ""
Date ""
Rev ""
Comp ""
Comment1 ""
Comment2 ""
Comment3 ""
Comment4 ""
$EndDescr
$Comp
L MCU_ST_STM32F3:STM32F302K8Ux U1
U 1 1 6077E9E5
P 2350 3600
F 0 "U1" H 2000 2650 50  0000 C CNN
F 1 "STM32F302K8Ux" H 2900 2650 50  0000 C CNN
F 2 "Package_DFN_QFN:QFN-32-1EP_5x5mm_P0.5mm_EP3.45x3.45mm" H 1850 2700 50  0001 R CNN
F 3 "http://www.st.com/st-web-ui/static/active/en/resource/technical/document/datasheet/DM00093333.pdf" H 2350 3600 50  0001 C CNN
	1    2350 3600
	1    0    0    -1  
$EndComp
Text GLabel 3050 4000 2    50   Input ~ 0
CAN_RX
Text GLabel 3050 4100 2    50   Input ~ 0
CAN_TX
Text GLabel 3050 4200 2    50   Input ~ 0
SWDIO
Text GLabel 3050 4300 2    50   Input ~ 0
SWCLK
Wire Wire Line
	3050 4000 2950 4000
Wire Wire Line
	3050 4100 2950 4100
Wire Wire Line
	3050 4200 2950 4200
Wire Wire Line
	3050 4300 2950 4300
Text GLabel 1650 3600 0    50   Input ~ 0
OSC_IN
Wire Wire Line
	1750 3600 1650 3600
$Comp
L power:GND #PWR07
U 1 1 6078096B
P 2650 4700
F 0 "#PWR07" H 2650 4450 50  0001 C CNN
F 1 "GND" V 2655 4572 50  0000 R CNN
F 2 "" H 2650 4700 50  0001 C CNN
F 3 "" H 2650 4700 50  0001 C CNN
	1    2650 4700
	0    -1   -1   0   
$EndComp
Wire Wire Line
	2650 4700 2550 4700
Wire Wire Line
	2550 4700 2550 4600
Wire Wire Line
	2450 4600 2450 4700
Wire Wire Line
	2450 4700 2550 4700
Connection ~ 2550 4700
Wire Wire Line
	2450 4700 2350 4700
Wire Wire Line
	2350 4700 2350 4600
Connection ~ 2450 4700
Wire Wire Line
	2350 4700 2250 4700
Wire Wire Line
	2250 4700 2250 4600
Connection ~ 2350 4700
Text GLabel 2250 2600 1    50   Input ~ 0
VDD1
Text GLabel 2350 2600 1    50   Input ~ 0
VDD2
Text GLabel 2450 2600 1    50   Input ~ 0
VDDA
Wire Wire Line
	2450 2600 2450 2700
Wire Wire Line
	2350 2700 2350 2600
Wire Wire Line
	2250 2600 2250 2700
Text GLabel 1650 4000 0    50   Input ~ 0
SPI3_SCK_ICM20602
Text GLabel 1650 4100 0    50   Input ~ 0
SPI3_MISO_ICM20602
Text GLabel 1650 4200 0    50   Input ~ 0
SPI3_MOSI_ICM20602
Wire Wire Line
	1650 4000 1750 4000
Wire Wire Line
	1650 4100 1750 4100
Wire Wire Line
	1650 4200 1750 4200
NoConn ~ 1750 4400
Text GLabel 3050 3800 2    50   Input ~ 0
USART1_TX_DEBUG
Text GLabel 3050 3900 2    50   Input ~ 0
USART1_RX_DEBUG
Wire Wire Line
	3050 3800 2950 3800
Wire Wire Line
	3050 3900 2950 3900
NoConn ~ 2950 4400
NoConn ~ 2950 2900
NoConn ~ 2950 3000
NoConn ~ 2950 3100
NoConn ~ 2950 3200
NoConn ~ 2950 3300
NoConn ~ 2950 3400
NoConn ~ 2950 3500
NoConn ~ 2950 3600
NoConn ~ 2950 3700
Text GLabel 2000 1050 0    50   Input ~ 0
VDD1
$Comp
L power:+3V3 #PWR02
U 1 1 6078CA62
P 2100 950
F 0 "#PWR02" H 2100 800 50  0001 C CNN
F 1 "+3V3" H 2115 1123 50  0000 C CNN
F 2 "" H 2100 950 50  0001 C CNN
F 3 "" H 2100 950 50  0001 C CNN
	1    2100 950 
	1    0    0    -1  
$EndComp
$Comp
L Device:C C1
U 1 1 6078CFC7
P 2350 1050
F 0 "C1" V 2300 1150 50  0000 C CNN
F 1 "0.1uF" V 2200 1050 50  0000 C CNN
F 2 "Capacitor_SMD:C_0603_1608Metric" H 2388 900 50  0001 C CNN
F 3 "~" H 2350 1050 50  0001 C CNN
	1    2350 1050
	0    1    1    0   
$EndComp
$Comp
L Device:C C2
U 1 1 6078E697
P 2350 1350
F 0 "C2" V 2300 1450 50  0000 C CNN
F 1 "0.1uF" V 2200 1350 50  0000 C CNN
F 2 "Capacitor_SMD:C_0603_1608Metric" H 2388 1200 50  0001 C CNN
F 3 "~" H 2350 1350 50  0001 C CNN
	1    2350 1350
	0    1    1    0   
$EndComp
Wire Wire Line
	2100 950  2100 1050
Wire Wire Line
	2100 1050 2200 1050
Wire Wire Line
	2100 1050 2000 1050
Connection ~ 2100 1050
Wire Wire Line
	2100 1050 2100 1350
Wire Wire Line
	2100 1350 2200 1350
Text GLabel 2000 1350 0    50   Input ~ 0
VDD2
Wire Wire Line
	2000 1350 2100 1350
Connection ~ 2100 1350
$Comp
L power:GND #PWR03
U 1 1 607900BC
P 2600 1050
F 0 "#PWR03" H 2600 800 50  0001 C CNN
F 1 "GND" V 2605 922 50  0000 R CNN
F 2 "" H 2600 1050 50  0001 C CNN
F 3 "" H 2600 1050 50  0001 C CNN
	1    2600 1050
	0    -1   -1   0   
$EndComp
$Comp
L power:GND #PWR04
U 1 1 6079041F
P 2600 1350
F 0 "#PWR04" H 2600 1100 50  0001 C CNN
F 1 "GND" V 2605 1222 50  0000 R CNN
F 2 "" H 2600 1350 50  0001 C CNN
F 3 "" H 2600 1350 50  0001 C CNN
	1    2600 1350
	0    -1   -1   0   
$EndComp
Wire Wire Line
	2600 1050 2500 1050
Wire Wire Line
	2500 1350 2600 1350
$Comp
L Device:C C3
U 1 1 607911E6
P 2350 1650
F 0 "C3" V 2300 1750 50  0000 C CNN
F 1 "10nF" V 2200 1650 50  0000 C CNN
F 2 "Capacitor_SMD:C_0603_1608Metric" H 2388 1500 50  0001 C CNN
F 3 "~" H 2350 1650 50  0001 C CNN
	1    2350 1650
	0    1    1    0   
$EndComp
$Comp
L Device:C C4
U 1 1 60791589
P 2350 1950
F 0 "C4" V 2300 2050 50  0000 C CNN
F 1 "1uF" V 2200 1950 50  0000 C CNN
F 2 "Capacitor_SMD:C_0603_1608Metric" H 2388 1800 50  0001 C CNN
F 3 "~" H 2350 1950 50  0001 C CNN
	1    2350 1950
	0    1    1    0   
$EndComp
Text GLabel 2000 1800 0    50   Input ~ 0
VDDA
Wire Wire Line
	2000 1800 2100 1800
Wire Wire Line
	2100 1800 2100 1650
Wire Wire Line
	2200 1650 2100 1650
Connection ~ 2100 1650
Wire Wire Line
	2100 1650 2100 1350
Wire Wire Line
	2100 1800 2100 1950
Wire Wire Line
	2100 1950 2200 1950
Connection ~ 2100 1800
$Comp
L power:GND #PWR06
U 1 1 60793234
P 2600 1950
F 0 "#PWR06" H 2600 1700 50  0001 C CNN
F 1 "GND" V 2605 1822 50  0000 R CNN
F 2 "" H 2600 1950 50  0001 C CNN
F 3 "" H 2600 1950 50  0001 C CNN
	1    2600 1950
	0    -1   -1   0   
$EndComp
Wire Wire Line
	2500 1950 2600 1950
$Comp
L power:GND #PWR05
U 1 1 6079870F
P 2600 1650
F 0 "#PWR05" H 2600 1400 50  0001 C CNN
F 1 "GND" V 2605 1522 50  0000 R CNN
F 2 "" H 2600 1650 50  0001 C CNN
F 3 "" H 2600 1650 50  0001 C CNN
	1    2600 1650
	0    -1   -1   0   
$EndComp
Wire Wire Line
	2500 1650 2600 1650
$Comp
L Sensor_Motion:ICM-20602 U2
U 1 1 607B8FB9
P 5250 2250
F 0 "U2" H 5000 1800 50  0000 C CNN
F 1 "ICM-20602" H 5500 1800 50  0000 C CNN
F 2 "Package_LGA:LGA-16_3x3mm_P0.5mm_LayoutBorder3x5y" H 5250 2500 50  0001 C CNN
F 3 "http://www.invensense.com/wp-content/uploads/2016/10/DS-000176-ICM-20602-v1.0.pdf" H 5300 3200 50  0001 C CNN
	1    5250 2250
	1    0    0    -1  
$EndComp
$Comp
L power:GND #PWR014
U 1 1 607BB1C9
P 5350 2850
F 0 "#PWR014" H 5350 2600 50  0001 C CNN
F 1 "GND" V 5355 2722 50  0000 R CNN
F 2 "" H 5350 2850 50  0001 C CNN
F 3 "" H 5350 2850 50  0001 C CNN
	1    5350 2850
	0    -1   -1   0   
$EndComp
Wire Wire Line
	5350 2850 5250 2850
Wire Wire Line
	5250 2850 5250 2750
$Comp
L power:+3V3 #PWR018
U 1 1 607BD5BD
P 5550 1650
F 0 "#PWR018" H 5550 1500 50  0001 C CNN
F 1 "+3V3" V 5565 1778 50  0000 L CNN
F 2 "" H 5550 1650 50  0001 C CNN
F 3 "" H 5550 1650 50  0001 C CNN
	1    5550 1650
	0    1    1    0   
$EndComp
$Comp
L Device:C C9
U 1 1 607BE114
P 5450 1400
F 0 "C9" H 5565 1446 50  0000 L CNN
F 1 "10nF" H 5565 1355 50  0000 L CNN
F 2 "Capacitor_SMD:C_0603_1608Metric" H 5488 1250 50  0001 C CNN
F 3 "~" H 5450 1400 50  0001 C CNN
	1    5450 1400
	1    0    0    -1  
$EndComp
Wire Wire Line
	5350 1750 5350 1650
Wire Wire Line
	5350 1650 5450 1650
Wire Wire Line
	5450 1550 5450 1650
Wire Wire Line
	5550 1650 5450 1650
Connection ~ 5450 1650
$Comp
L Device:C C8
U 1 1 607C50BF
P 5150 1400
F 0 "C8" H 4950 1500 50  0000 L CNN
F 1 "2.2uF" H 4850 1350 50  0000 L CNN
F 2 "Capacitor_SMD:C_0603_1608Metric" H 5188 1250 50  0001 C CNN
F 3 "~" H 5150 1400 50  0001 C CNN
	1    5150 1400
	1    0    0    -1  
$EndComp
$Comp
L Device:C C7
U 1 1 607C5E4A
P 4700 1400
F 0 "C7" H 4500 1450 50  0000 L CNN
F 1 "0.1uF" H 4400 1350 50  0000 L CNN
F 2 "Capacitor_SMD:C_0603_1608Metric" H 4738 1250 50  0001 C CNN
F 3 "~" H 4700 1400 50  0001 C CNN
	1    4700 1400
	1    0    0    -1  
$EndComp
Wire Wire Line
	5250 1750 5250 1650
Wire Wire Line
	5250 1650 5150 1650
Wire Wire Line
	5150 1650 5150 1550
Wire Wire Line
	5150 1650 4700 1650
Wire Wire Line
	4700 1650 4700 1550
Connection ~ 5150 1650
$Comp
L power:GND #PWR017
U 1 1 607C8694
P 5450 1150
F 0 "#PWR017" H 5450 900 50  0001 C CNN
F 1 "GND" H 5455 977 50  0000 C CNN
F 2 "" H 5450 1150 50  0001 C CNN
F 3 "" H 5450 1150 50  0001 C CNN
	1    5450 1150
	-1   0    0    1   
$EndComp
Wire Wire Line
	5450 1150 5450 1250
$Comp
L power:GND #PWR013
U 1 1 607C9AAF
P 5150 1150
F 0 "#PWR013" H 5150 900 50  0001 C CNN
F 1 "GND" H 5155 977 50  0000 C CNN
F 2 "" H 5150 1150 50  0001 C CNN
F 3 "" H 5150 1150 50  0001 C CNN
	1    5150 1150
	-1   0    0    1   
$EndComp
Wire Wire Line
	5150 1150 5150 1250
$Comp
L power:GND #PWR012
U 1 1 607CAE9D
P 4700 1150
F 0 "#PWR012" H 4700 900 50  0001 C CNN
F 1 "GND" H 4705 977 50  0000 C CNN
F 2 "" H 4700 1150 50  0001 C CNN
F 3 "" H 4700 1150 50  0001 C CNN
	1    4700 1150
	-1   0    0    1   
$EndComp
Wire Wire Line
	4700 1150 4700 1250
Text GLabel 4650 2350 0    50   Input ~ 0
SPI3_SCK_ICM20602
Text GLabel 4650 2150 0    50   Input ~ 0
SPI3_MISO_ICM20602
Text GLabel 4650 2250 0    50   Input ~ 0
SPI3_MOSI_ICM20602
Wire Wire Line
	4650 2150 4750 2150
Wire Wire Line
	4650 2250 4750 2250
Wire Wire Line
	4650 2350 4750 2350
$Comp
L power:GND #PWR011
U 1 1 607D201D
P 4650 2550
F 0 "#PWR011" H 4650 2300 50  0001 C CNN
F 1 "GND" H 4655 2377 50  0000 C CNN
F 2 "" H 4650 2550 50  0001 C CNN
F 3 "" H 4650 2550 50  0001 C CNN
	1    4650 2550
	1    0    0    -1  
$EndComp
Wire Wire Line
	4650 2550 4650 2450
Wire Wire Line
	4650 2450 4750 2450
Text GLabel 5850 2150 2    50   Input ~ 0
INT_ICM20602
Wire Wire Line
	5850 2150 5750 2150
$Comp
L power:GND #PWR019
U 1 1 607D5684
P 5850 2450
F 0 "#PWR019" H 5850 2200 50  0001 C CNN
F 1 "GND" H 5855 2277 50  0000 C CNN
F 2 "" H 5850 2450 50  0001 C CNN
F 3 "" H 5850 2450 50  0001 C CNN
	1    5850 2450
	1    0    0    -1  
$EndComp
Wire Wire Line
	5750 2250 5850 2250
Wire Wire Line
	5850 2250 5850 2450
$Comp
L Device:C C10
U 1 1 607D7D94
P 6100 2350
F 0 "C10" V 6050 2500 50  0000 C CNN
F 1 "0.1uF" V 6250 2350 50  0000 C CNN
F 2 "Capacitor_SMD:C_0603_1608Metric" H 6138 2200 50  0001 C CNN
F 3 "~" H 6100 2350 50  0001 C CNN
	1    6100 2350
	0    1    1    0   
$EndComp
$Comp
L power:GND #PWR020
U 1 1 607D8CE2
P 6350 2350
F 0 "#PWR020" H 6350 2100 50  0001 C CNN
F 1 "GND" V 6355 2222 50  0000 R CNN
F 2 "" H 6350 2350 50  0001 C CNN
F 3 "" H 6350 2350 50  0001 C CNN
	1    6350 2350
	0    -1   -1   0   
$EndComp
Wire Wire Line
	6350 2350 6250 2350
Wire Wire Line
	5950 2350 5750 2350
NoConn ~ 1750 2900
Text GLabel 1650 4300 0    50   Input ~ 0
INT_ICM20602
Text GLabel 1650 3100 0    50   Input ~ 0
BOOT0
Wire Wire Line
	1650 3100 1750 3100
Text GLabel 1500 6750 0    50   Input ~ 0
BOOT0
$Comp
L Device:R R1
U 1 1 60804131
P 1600 7000
F 0 "R1" H 1670 7046 50  0000 L CNN
F 1 "100K" H 1670 6955 50  0000 L CNN
F 2 "Resistor_SMD:R_0603_1608Metric" V 1530 7000 50  0001 C CNN
F 3 "~" H 1600 7000 50  0001 C CNN
	1    1600 7000
	1    0    0    -1  
$EndComp
Wire Wire Line
	1500 6750 1600 6750
Wire Wire Line
	1600 6750 1600 6850
$Comp
L power:GND #PWR01
U 1 1 608064AF
P 1600 7250
F 0 "#PWR01" H 1600 7000 50  0001 C CNN
F 1 "GND" H 1605 7077 50  0000 C CNN
F 2 "" H 1600 7250 50  0001 C CNN
F 3 "" H 1600 7250 50  0001 C CNN
	1    1600 7250
	1    0    0    -1  
$EndComp
Wire Wire Line
	1600 7250 1600 7150
Wire Wire Line
	1700 6750 1600 6750
Connection ~ 1600 6750
$Comp
L power:+3V3 #PWR08
U 1 1 6080B040
P 2200 6750
F 0 "#PWR08" H 2200 6600 50  0001 C CNN
F 1 "+3V3" V 2215 6878 50  0000 L CNN
F 2 "" H 2200 6750 50  0001 C CNN
F 3 "" H 2200 6750 50  0001 C CNN
	1    2200 6750
	0    1    1    0   
$EndComp
Wire Wire Line
	2200 6750 2100 6750
$Comp
L Connector_Generic:Conn_01x04 J2
U 1 1 60815443
P 9800 1200
F 0 "J2" H 9880 1192 50  0000 L CNN
F 1 "Conn_01x04" H 9880 1101 50  0000 L CNN
F 2 "Connector_JST:JST_GH_SM04B-GHS-TB_1x04-1MP_P1.25mm_Horizontal" H 9800 1200 50  0001 C CNN
F 3 "~" H 9800 1200 50  0001 C CNN
	1    9800 1200
	1    0    0    -1  
$EndComp
$Comp
L power:+5V #PWR031
U 1 1 608169A2
P 9500 900
F 0 "#PWR031" H 9500 750 50  0001 C CNN
F 1 "+5V" H 9515 1073 50  0000 C CNN
F 2 "" H 9500 900 50  0001 C CNN
F 3 "" H 9500 900 50  0001 C CNN
	1    9500 900 
	1    0    0    -1  
$EndComp
$Comp
L Device:C C15
U 1 1 608171AD
P 9950 1000
F 0 "C15" V 9698 1000 50  0000 C CNN
F 1 "2.2uF" V 9789 1000 50  0000 C CNN
F 2 "Capacitor_SMD:C_0603_1608Metric" H 9988 850 50  0001 C CNN
F 3 "~" H 9950 1000 50  0001 C CNN
	1    9950 1000
	0    1    1    0   
$EndComp
Wire Wire Line
	9500 900  9500 1000
Wire Wire Line
	9500 1100 9600 1100
Wire Wire Line
	9800 1000 9500 1000
Connection ~ 9500 1000
Wire Wire Line
	9500 1000 9500 1100
$Comp
L power:GND #PWR032
U 1 1 6081C72B
P 9500 1500
F 0 "#PWR032" H 9500 1250 50  0001 C CNN
F 1 "GND" H 9505 1327 50  0000 C CNN
F 2 "" H 9500 1500 50  0001 C CNN
F 3 "" H 9500 1500 50  0001 C CNN
	1    9500 1500
	1    0    0    -1  
$EndComp
Wire Wire Line
	9500 1500 9500 1400
Wire Wire Line
	9500 1400 9600 1400
Text Label 9500 1200 2    50   ~ 0
CAN_H
Text Label 9500 1300 2    50   ~ 0
CAN_L
Wire Wire Line
	9500 1200 9600 1200
Wire Wire Line
	9500 1300 9600 1300
$Comp
L Connector_Generic:Conn_01x04 J3
U 1 1 6082540A
P 9800 2300
F 0 "J3" H 9880 2292 50  0000 L CNN
F 1 "Conn_01x04" H 9880 2201 50  0000 L CNN
F 2 "Connector_JST:JST_GH_SM04B-GHS-TB_1x04-1MP_P1.25mm_Horizontal" H 9800 2300 50  0001 C CNN
F 3 "~" H 9800 2300 50  0001 C CNN
	1    9800 2300
	1    0    0    -1  
$EndComp
$Comp
L power:+5V #PWR033
U 1 1 60825410
P 9500 2000
F 0 "#PWR033" H 9500 1850 50  0001 C CNN
F 1 "+5V" H 9515 2173 50  0000 C CNN
F 2 "" H 9500 2000 50  0001 C CNN
F 3 "" H 9500 2000 50  0001 C CNN
	1    9500 2000
	1    0    0    -1  
$EndComp
$Comp
L Device:C C16
U 1 1 60825416
P 9950 2100
F 0 "C16" V 9698 2100 50  0000 C CNN
F 1 "2.2uF" V 9789 2100 50  0000 C CNN
F 2 "Capacitor_SMD:C_0603_1608Metric" H 9988 1950 50  0001 C CNN
F 3 "~" H 9950 2100 50  0001 C CNN
	1    9950 2100
	0    1    1    0   
$EndComp
Wire Wire Line
	9500 2000 9500 2100
Wire Wire Line
	9500 2200 9600 2200
Wire Wire Line
	9800 2100 9500 2100
Connection ~ 9500 2100
Wire Wire Line
	9500 2100 9500 2200
$Comp
L power:GND #PWR034
U 1 1 60825421
P 9500 2600
F 0 "#PWR034" H 9500 2350 50  0001 C CNN
F 1 "GND" H 9505 2427 50  0000 C CNN
F 2 "" H 9500 2600 50  0001 C CNN
F 3 "" H 9500 2600 50  0001 C CNN
	1    9500 2600
	1    0    0    -1  
$EndComp
Wire Wire Line
	9500 2600 9500 2500
Wire Wire Line
	9500 2500 9600 2500
Text Label 9500 2300 2    50   ~ 0
CAN_H
Text Label 9500 2400 2    50   ~ 0
CAN_L
Wire Wire Line
	9500 2300 9600 2300
Wire Wire Line
	9500 2400 9600 2400
$Comp
L power:GND #PWR035
U 1 1 6082849F
P 10200 1000
F 0 "#PWR035" H 10200 750 50  0001 C CNN
F 1 "GND" V 10205 872 50  0000 R CNN
F 2 "" H 10200 1000 50  0001 C CNN
F 3 "" H 10200 1000 50  0001 C CNN
	1    10200 1000
	0    -1   -1   0   
$EndComp
$Comp
L power:GND #PWR036
U 1 1 60828A5D
P 10200 2100
F 0 "#PWR036" H 10200 1850 50  0001 C CNN
F 1 "GND" V 10205 1972 50  0000 R CNN
F 2 "" H 10200 2100 50  0001 C CNN
F 3 "" H 10200 2100 50  0001 C CNN
	1    10200 2100
	0    -1   -1   0   
$EndComp
Wire Wire Line
	10200 2100 10100 2100
Wire Wire Line
	10200 1000 10100 1000
$Comp
L Interface_CAN_LIN:TJA1051TK-3 U3
U 1 1 6082FE69
P 8050 1650
F 0 "U3" H 7800 1300 50  0000 C CNN
F 1 "TJA1051TK-3" H 8450 1300 50  0000 C CNN
F 2 "Package_DFN_QFN:DFN-8-1EP_3x3mm_P0.65mm_EP1.55x2.4mm" H 8050 1150 50  0001 C CIN
F 3 "http://www.nxp.com/documents/data_sheet/TJA1051.pdf" H 8050 1650 50  0001 C CNN
	1    8050 1650
	1    0    0    -1  
$EndComp
$Comp
L power:GND #PWR027
U 1 1 608312B8
P 8250 2150
F 0 "#PWR027" H 8250 1900 50  0001 C CNN
F 1 "GND" V 8255 2022 50  0000 R CNN
F 2 "" H 8250 2150 50  0001 C CNN
F 3 "" H 8250 2150 50  0001 C CNN
	1    8250 2150
	0    -1   -1   0   
$EndComp
Wire Wire Line
	8250 2150 8150 2150
Wire Wire Line
	8150 2150 8150 2050
Wire Wire Line
	8150 2150 8050 2150
Wire Wire Line
	8050 2150 8050 2050
Connection ~ 8150 2150
Text Label 8650 1550 0    50   ~ 0
CAN_H
Text Label 8650 1750 0    50   ~ 0
CAN_L
Wire Wire Line
	8650 1550 8550 1550
Wire Wire Line
	8550 1750 8650 1750
$Comp
L power:+5V #PWR025
U 1 1 6083D2AD
P 8050 1050
F 0 "#PWR025" H 8050 900 50  0001 C CNN
F 1 "+5V" H 8065 1223 50  0000 C CNN
F 2 "" H 8050 1050 50  0001 C CNN
F 3 "" H 8050 1050 50  0001 C CNN
	1    8050 1050
	1    0    0    -1  
$EndComp
$Comp
L Device:C C13
U 1 1 60841FF1
P 8300 1150
F 0 "C13" V 8048 1150 50  0000 C CNN
F 1 "47nF" V 8139 1150 50  0000 C CNN
F 2 "Capacitor_SMD:C_0603_1608Metric" H 8338 1000 50  0001 C CNN
F 3 "~" H 8300 1150 50  0001 C CNN
	1    8300 1150
	0    1    1    0   
$EndComp
$Comp
L Device:C C11
U 1 1 60842225
P 7400 1150
F 0 "C11" V 7148 1150 50  0000 C CNN
F 1 "0.1uF" V 7239 1150 50  0000 C CNN
F 2 "Capacitor_SMD:C_0603_1608Metric" H 7438 1000 50  0001 C CNN
F 3 "~" H 7400 1150 50  0001 C CNN
	1    7400 1150
	0    1    1    0   
$EndComp
Text GLabel 7450 1450 0    50   Input ~ 0
CAN_TX
Text GLabel 7450 1550 0    50   Input ~ 0
CAN_RX
Wire Wire Line
	7450 1450 7550 1450
Wire Wire Line
	7450 1550 7550 1550
Wire Wire Line
	7550 1150 8050 1150
Wire Wire Line
	8050 1150 8050 1250
Wire Wire Line
	7250 1150 6950 1150
Wire Wire Line
	6950 1150 6950 1750
Wire Wire Line
	6950 1750 7550 1750
Wire Wire Line
	8050 1050 8050 1150
Connection ~ 8050 1150
Wire Wire Line
	8150 1150 8050 1150
$Comp
L power:GND #PWR029
U 1 1 6085BA91
P 8550 1150
F 0 "#PWR029" H 8550 900 50  0001 C CNN
F 1 "GND" V 8555 1022 50  0000 R CNN
F 2 "" H 8550 1150 50  0001 C CNN
F 3 "" H 8550 1150 50  0001 C CNN
	1    8550 1150
	0    -1   -1   0   
$EndComp
Wire Wire Line
	8550 1150 8450 1150
$Comp
L power:+3V3 #PWR021
U 1 1 6085F9FA
P 6850 1750
F 0 "#PWR021" H 6850 1600 50  0001 C CNN
F 1 "+3V3" V 6865 1878 50  0000 L CNN
F 2 "" H 6850 1750 50  0001 C CNN
F 3 "" H 6850 1750 50  0001 C CNN
	1    6850 1750
	0    -1   -1   0   
$EndComp
Wire Wire Line
	6850 1750 6950 1750
Connection ~ 6950 1750
$Comp
L power:GND #PWR022
U 1 1 6086386F
P 7450 1950
F 0 "#PWR022" H 7450 1700 50  0001 C CNN
F 1 "GND" H 7455 1777 50  0000 C CNN
F 2 "" H 7450 1950 50  0001 C CNN
F 3 "" H 7450 1950 50  0001 C CNN
	1    7450 1950
	1    0    0    -1  
$EndComp
Wire Wire Line
	7450 1950 7450 1850
Wire Wire Line
	7450 1850 7550 1850
$Comp
L Connector_Generic:Conn_01x06 J1
U 1 1 6087F620
P 5650 3800
F 0 "J1" H 5730 3792 50  0000 L CNN
F 1 "Conn_01x06" H 5730 3701 50  0000 L CNN
F 2 "Connector_JST:JST_GH_SM06B-GHS-TB_1x06-1MP_P1.25mm_Horizontal" H 5650 3800 50  0001 C CNN
F 3 "~" H 5650 3800 50  0001 C CNN
	1    5650 3800
	1    0    0    -1  
$EndComp
$Comp
L power:+3V3 #PWR015
U 1 1 60880BA8
P 5350 3500
F 0 "#PWR015" H 5350 3350 50  0001 C CNN
F 1 "+3V3" H 5365 3673 50  0000 C CNN
F 2 "" H 5350 3500 50  0001 C CNN
F 3 "" H 5350 3500 50  0001 C CNN
	1    5350 3500
	1    0    0    -1  
$EndComp
$Comp
L power:GND #PWR016
U 1 1 6088127F
P 5350 4200
F 0 "#PWR016" H 5350 3950 50  0001 C CNN
F 1 "GND" H 5355 4027 50  0000 C CNN
F 2 "" H 5350 4200 50  0001 C CNN
F 3 "" H 5350 4200 50  0001 C CNN
	1    5350 4200
	1    0    0    -1  
$EndComp
Text GLabel 5350 3700 0    50   Input ~ 0
USART1_TX_DEBUG
Text GLabel 5350 3800 0    50   Input ~ 0
USART1_RX_DEBUG
Text GLabel 5350 3900 0    50   Input ~ 0
SWDIO
Text GLabel 5350 4000 0    50   Input ~ 0
SWCLK
Wire Wire Line
	5350 3500 5350 3600
Wire Wire Line
	5350 3600 5450 3600
Wire Wire Line
	5450 3700 5350 3700
Wire Wire Line
	5450 3800 5350 3800
Wire Wire Line
	5450 3900 5350 3900
Wire Wire Line
	5450 4000 5350 4000
Wire Wire Line
	5450 4100 5350 4100
Wire Wire Line
	5350 4100 5350 4200
$Comp
L Regulator_Linear:TLV75533PDBV U4
U 1 1 608A3CAD
P 8100 3700
F 0 "U4" H 8100 4042 50  0000 C CNN
F 1 "TLV75533PDBV" H 8100 3951 50  0000 C CNN
F 2 "Package_TO_SOT_SMD:SOT-23-5" H 8100 4025 50  0001 C CIN
F 3 "http://www.ti.com/lit/ds/symlink/tlv755p.pdf" H 8100 3750 50  0001 C CNN
	1    8100 3700
	1    0    0    -1  
$EndComp
$Comp
L power:GND #PWR026
U 1 1 608A5A76
P 8100 4100
F 0 "#PWR026" H 8100 3850 50  0001 C CNN
F 1 "GND" H 8105 3927 50  0000 C CNN
F 2 "" H 8100 4100 50  0001 C CNN
F 3 "" H 8100 4100 50  0001 C CNN
	1    8100 4100
	1    0    0    -1  
$EndComp
Wire Wire Line
	8100 4100 8100 4000
$Comp
L power:+5V #PWR023
U 1 1 608AB2F4
P 7600 3600
F 0 "#PWR023" H 7600 3450 50  0001 C CNN
F 1 "+5V" V 7615 3728 50  0000 L CNN
F 2 "" H 7600 3600 50  0001 C CNN
F 3 "" H 7600 3600 50  0001 C CNN
	1    7600 3600
	0    -1   -1   0   
$EndComp
$Comp
L Device:C C12
U 1 1 608ABD55
P 7700 3300
F 0 "C12" H 7815 3346 50  0000 L CNN
F 1 "1uF" H 7815 3255 50  0000 L CNN
F 2 "Capacitor_SMD:C_0603_1608Metric" H 7738 3150 50  0001 C CNN
F 3 "~" H 7700 3300 50  0001 C CNN
	1    7700 3300
	1    0    0    -1  
$EndComp
Wire Wire Line
	7700 3450 7700 3600
Wire Wire Line
	7700 3600 7800 3600
$Comp
L power:GND #PWR024
U 1 1 608B0F03
P 7700 3050
F 0 "#PWR024" H 7700 2800 50  0001 C CNN
F 1 "GND" H 7705 2877 50  0000 C CNN
F 2 "" H 7700 3050 50  0001 C CNN
F 3 "" H 7700 3050 50  0001 C CNN
	1    7700 3050
	-1   0    0    1   
$EndComp
Wire Wire Line
	7700 3050 7700 3100
$Comp
L Device:C C14
U 1 1 608B574A
P 8500 3300
F 0 "C14" H 8615 3346 50  0000 L CNN
F 1 "1uF" H 8615 3255 50  0000 L CNN
F 2 "Capacitor_SMD:C_0603_1608Metric" H 8538 3150 50  0001 C CNN
F 3 "~" H 8500 3300 50  0001 C CNN
	1    8500 3300
	1    0    0    -1  
$EndComp
Wire Wire Line
	8500 3450 8500 3600
Wire Wire Line
	8500 3600 8400 3600
$Comp
L power:GND #PWR028
U 1 1 608BA233
P 8500 3050
F 0 "#PWR028" H 8500 2800 50  0001 C CNN
F 1 "GND" H 8505 2877 50  0000 C CNN
F 2 "" H 8500 3050 50  0001 C CNN
F 3 "" H 8500 3050 50  0001 C CNN
	1    8500 3050
	-1   0    0    1   
$EndComp
Wire Wire Line
	8500 3050 8500 3150
Wire Wire Line
	7600 3600 7700 3600
Connection ~ 7700 3600
Wire Wire Line
	7700 3600 7700 3700
Wire Wire Line
	7700 3700 7800 3700
$Comp
L power:+3V3 #PWR030
U 1 1 608CB461
P 8600 3600
F 0 "#PWR030" H 8600 3450 50  0001 C CNN
F 1 "+3V3" V 8615 3728 50  0000 L CNN
F 2 "" H 8600 3600 50  0001 C CNN
F 3 "" H 8600 3600 50  0001 C CNN
	1    8600 3600
	0    1    1    0   
$EndComp
Wire Wire Line
	8600 3600 8500 3600
Connection ~ 8500 3600
$Comp
L power:+3V3 #PWR0101
U 1 1 608D4812
P 4600 1650
F 0 "#PWR0101" H 4600 1500 50  0001 C CNN
F 1 "+3V3" V 4615 1778 50  0000 L CNN
F 2 "" H 4600 1650 50  0001 C CNN
F 3 "" H 4600 1650 50  0001 C CNN
	1    4600 1650
	0    -1   -1   0   
$EndComp
Wire Wire Line
	4600 1650 4700 1650
Connection ~ 4700 1650
$Comp
L power:PWR_FLAG #FLG0101
U 1 1 608DD589
P 9400 1000
F 0 "#FLG0101" H 9400 1075 50  0001 C CNN
F 1 "PWR_FLAG" V 9400 1127 50  0000 L CNN
F 2 "" H 9400 1000 50  0001 C CNN
F 3 "~" H 9400 1000 50  0001 C CNN
	1    9400 1000
	0    -1   -1   0   
$EndComp
Wire Wire Line
	9400 1000 9500 1000
$Comp
L power:PWR_FLAG #FLG0102
U 1 1 608EA9DD
P 7600 3100
F 0 "#FLG0102" H 7600 3175 50  0001 C CNN
F 1 "PWR_FLAG" V 7600 3227 50  0000 L CNN
F 2 "" H 7600 3100 50  0001 C CNN
F 3 "~" H 7600 3100 50  0001 C CNN
	1    7600 3100
	0    -1   -1   0   
$EndComp
Wire Wire Line
	7600 3100 7700 3100
Connection ~ 7700 3100
Wire Wire Line
	7700 3100 7700 3150
$Comp
L Jumper:Jumper_2_Open JP1
U 1 1 6091C670
P 1900 6750
F 0 "JP1" H 1900 6985 50  0000 C CNN
F 1 "Jumper_2_Open" H 1900 6894 50  0000 C CNN
F 2 "Jumper:SolderJumper-2_P1.3mm_Open_Pad1.0x1.5mm" H 1900 6750 50  0001 C CNN
F 3 "~" H 1900 6750 50  0001 C CNN
	1    1900 6750
	1    0    0    -1  
$EndComp
Wire Wire Line
	1750 4300 1650 4300
NoConn ~ 1750 3900
NoConn ~ 1750 3700
$Comp
L asfl1:ASFL1 Y1
U 1 1 607C10D1
P 2300 5400
F 0 "Y1" H 2350 5715 50  0000 C CNN
F 1 "ASFL1" H 2350 5624 50  0000 C CNN
F 2 "imu-module:OSCSC250P500X320X130-4N" H 2300 5400 50  0001 C CNN
F 3 "" H 2300 5400 50  0001 C CNN
	1    2300 5400
	1    0    0    -1  
$EndComp
$Comp
L power:+3V3 #PWR038
U 1 1 607C1D71
P 2800 5250
F 0 "#PWR038" H 2800 5100 50  0001 C CNN
F 1 "+3V3" H 2815 5423 50  0000 C CNN
F 2 "" H 2800 5250 50  0001 C CNN
F 3 "" H 2800 5250 50  0001 C CNN
	1    2800 5250
	1    0    0    -1  
$EndComp
Wire Wire Line
	2800 5250 2800 5350
Wire Wire Line
	2800 5350 2700 5350
Text GLabel 2900 5450 2    50   Input ~ 0
OSC_IN
$Comp
L Device:C C6
U 1 1 607CCBF6
P 2800 5700
F 0 "C6" H 2915 5746 50  0000 L CNN
F 1 "5pF" H 2915 5655 50  0000 L CNN
F 2 "Capacitor_SMD:C_0603_1608Metric" H 2838 5550 50  0001 C CNN
F 3 "~" H 2800 5700 50  0001 C CNN
	1    2800 5700
	1    0    0    -1  
$EndComp
$Comp
L power:GND #PWR039
U 1 1 607D80A5
P 2800 5950
F 0 "#PWR039" H 2800 5700 50  0001 C CNN
F 1 "GND" H 2805 5777 50  0000 C CNN
F 2 "" H 2800 5950 50  0001 C CNN
F 3 "" H 2800 5950 50  0001 C CNN
	1    2800 5950
	1    0    0    -1  
$EndComp
Wire Wire Line
	2800 5950 2800 5850
$Comp
L power:+3V3 #PWR037
U 1 1 607EDA9B
P 1900 5550
F 0 "#PWR037" H 1900 5400 50  0001 C CNN
F 1 "+3V3" H 1915 5723 50  0000 C CNN
F 2 "" H 1900 5550 50  0001 C CNN
F 3 "" H 1900 5550 50  0001 C CNN
	1    1900 5550
	-1   0    0    1   
$EndComp
Wire Wire Line
	1900 5550 1900 5450
Wire Wire Line
	1900 5450 2000 5450
$Comp
L Device:C C5
U 1 1 607F5676
P 1650 5450
F 0 "C5" V 1398 5450 50  0000 C CNN
F 1 "10nF" V 1489 5450 50  0000 C CNN
F 2 "Capacitor_SMD:C_0603_1608Metric" H 1688 5300 50  0001 C CNN
F 3 "~" H 1650 5450 50  0001 C CNN
	1    1650 5450
	0    1    1    0   
$EndComp
Wire Wire Line
	1800 5450 1900 5450
Connection ~ 1900 5450
$Comp
L power:GND #PWR010
U 1 1 607FB1E7
P 1900 5250
F 0 "#PWR010" H 1900 5000 50  0001 C CNN
F 1 "GND" H 1905 5077 50  0000 C CNN
F 2 "" H 1900 5250 50  0001 C CNN
F 3 "" H 1900 5250 50  0001 C CNN
	1    1900 5250
	-1   0    0    1   
$EndComp
Wire Wire Line
	1900 5250 1900 5350
Wire Wire Line
	1900 5350 2000 5350
$Comp
L power:GND #PWR09
U 1 1 60800A5B
P 1400 5450
F 0 "#PWR09" H 1400 5200 50  0001 C CNN
F 1 "GND" V 1405 5322 50  0000 R CNN
F 2 "" H 1400 5450 50  0001 C CNN
F 3 "" H 1400 5450 50  0001 C CNN
	1    1400 5450
	0    1    1    0   
$EndComp
Wire Wire Line
	1400 5450 1500 5450
Wire Wire Line
	2700 5450 2800 5450
Wire Wire Line
	2800 5450 2800 5550
Wire Wire Line
	2900 5450 2800 5450
Connection ~ 2800 5450
$EndSCHEMATC
