(kicad_sch (version 20211123) (generator eeschema)

  (uuid e63e39d7-6ac0-4ffd-8aa3-1841a4541b55)

  (paper "A4")

  (lib_symbols
    (symbol "BL9161:BL9161-33BARN" (in_bom yes) (on_board yes)
      (property "Reference" "U" (id 0) (at 0 7.62 0)
        (effects (font (size 1.27 1.27)))
      )
      (property "Value" "BL9161-33BARN" (id 1) (at 0 5.08 0)
        (effects (font (size 1.27 1.27)))
      )
      (property "Footprint" "" (id 2) (at -22.86 11.43 0)
        (effects (font (size 1.27 1.27)) hide)
      )
      (property "Datasheet" "" (id 3) (at -22.86 11.43 0)
        (effects (font (size 1.27 1.27)) hide)
      )
      (symbol "BL9161-33BARN_0_0"
        (pin power_in line (at -8.89 1.27 0) (length 2.54)
          (name "VIN" (effects (font (size 1.27 1.27))))
          (number "1" (effects (font (size 1.27 1.27))))
        )
        (pin power_in line (at 8.89 -1.27 180) (length 2.54)
          (name "GND" (effects (font (size 1.27 1.27))))
          (number "2" (effects (font (size 1.27 1.27))))
        )
        (pin input line (at -8.89 -1.27 0) (length 2.54)
          (name "CE" (effects (font (size 1.27 1.27))))
          (number "3" (effects (font (size 1.27 1.27))))
        )
        (pin power_out line (at 8.89 1.27 180) (length 2.54)
          (name "VOUT" (effects (font (size 1.27 1.27))))
          (number "5" (effects (font (size 1.27 1.27))))
        )
      )
      (symbol "BL9161-33BARN_0_1"
        (rectangle (start -6.35 3.81) (end 6.35 -3.81)
          (stroke (width 0.1524) (type default) (color 0 0 0 0))
          (fill (type background))
        )
      )
    )
    (symbol "Connector_Generic:Conn_01x04" (pin_names (offset 1.016) hide) (in_bom yes) (on_board yes)
      (property "Reference" "J" (id 0) (at 0 5.08 0)
        (effects (font (size 1.27 1.27)))
      )
      (property "Value" "Conn_01x04" (id 1) (at 0 -7.62 0)
        (effects (font (size 1.27 1.27)))
      )
      (property "Footprint" "" (id 2) (at 0 0 0)
        (effects (font (size 1.27 1.27)) hide)
      )
      (property "Datasheet" "~" (id 3) (at 0 0 0)
        (effects (font (size 1.27 1.27)) hide)
      )
      (property "ki_keywords" "connector" (id 4) (at 0 0 0)
        (effects (font (size 1.27 1.27)) hide)
      )
      (property "ki_description" "Generic connector, single row, 01x04, script generated (kicad-library-utils/schlib/autogen/connector/)" (id 5) (at 0 0 0)
        (effects (font (size 1.27 1.27)) hide)
      )
      (property "ki_fp_filters" "Connector*:*_1x??_*" (id 6) (at 0 0 0)
        (effects (font (size 1.27 1.27)) hide)
      )
      (symbol "Conn_01x04_1_1"
        (rectangle (start -1.27 -4.953) (end 0 -5.207)
          (stroke (width 0.1524) (type default) (color 0 0 0 0))
          (fill (type none))
        )
        (rectangle (start -1.27 -2.413) (end 0 -2.667)
          (stroke (width 0.1524) (type default) (color 0 0 0 0))
          (fill (type none))
        )
        (rectangle (start -1.27 0.127) (end 0 -0.127)
          (stroke (width 0.1524) (type default) (color 0 0 0 0))
          (fill (type none))
        )
        (rectangle (start -1.27 2.667) (end 0 2.413)
          (stroke (width 0.1524) (type default) (color 0 0 0 0))
          (fill (type none))
        )
        (rectangle (start -1.27 3.81) (end 1.27 -6.35)
          (stroke (width 0.254) (type default) (color 0 0 0 0))
          (fill (type background))
        )
        (pin passive line (at -5.08 2.54 0) (length 3.81)
          (name "Pin_1" (effects (font (size 1.27 1.27))))
          (number "1" (effects (font (size 1.27 1.27))))
        )
        (pin passive line (at -5.08 0 0) (length 3.81)
          (name "Pin_2" (effects (font (size 1.27 1.27))))
          (number "2" (effects (font (size 1.27 1.27))))
        )
        (pin passive line (at -5.08 -2.54 0) (length 3.81)
          (name "Pin_3" (effects (font (size 1.27 1.27))))
          (number "3" (effects (font (size 1.27 1.27))))
        )
        (pin passive line (at -5.08 -5.08 0) (length 3.81)
          (name "Pin_4" (effects (font (size 1.27 1.27))))
          (number "4" (effects (font (size 1.27 1.27))))
        )
      )
    )
    (symbol "Connector_Generic:Conn_01x06" (pin_names (offset 1.016) hide) (in_bom yes) (on_board yes)
      (property "Reference" "J" (id 0) (at 0 7.62 0)
        (effects (font (size 1.27 1.27)))
      )
      (property "Value" "Conn_01x06" (id 1) (at 0 -10.16 0)
        (effects (font (size 1.27 1.27)))
      )
      (property "Footprint" "" (id 2) (at 0 0 0)
        (effects (font (size 1.27 1.27)) hide)
      )
      (property "Datasheet" "~" (id 3) (at 0 0 0)
        (effects (font (size 1.27 1.27)) hide)
      )
      (property "ki_keywords" "connector" (id 4) (at 0 0 0)
        (effects (font (size 1.27 1.27)) hide)
      )
      (property "ki_description" "Generic connector, single row, 01x06, script generated (kicad-library-utils/schlib/autogen/connector/)" (id 5) (at 0 0 0)
        (effects (font (size 1.27 1.27)) hide)
      )
      (property "ki_fp_filters" "Connector*:*_1x??_*" (id 6) (at 0 0 0)
        (effects (font (size 1.27 1.27)) hide)
      )
      (symbol "Conn_01x06_1_1"
        (rectangle (start -1.27 -7.493) (end 0 -7.747)
          (stroke (width 0.1524) (type default) (color 0 0 0 0))
          (fill (type none))
        )
        (rectangle (start -1.27 -4.953) (end 0 -5.207)
          (stroke (width 0.1524) (type default) (color 0 0 0 0))
          (fill (type none))
        )
        (rectangle (start -1.27 -2.413) (end 0 -2.667)
          (stroke (width 0.1524) (type default) (color 0 0 0 0))
          (fill (type none))
        )
        (rectangle (start -1.27 0.127) (end 0 -0.127)
          (stroke (width 0.1524) (type default) (color 0 0 0 0))
          (fill (type none))
        )
        (rectangle (start -1.27 2.667) (end 0 2.413)
          (stroke (width 0.1524) (type default) (color 0 0 0 0))
          (fill (type none))
        )
        (rectangle (start -1.27 5.207) (end 0 4.953)
          (stroke (width 0.1524) (type default) (color 0 0 0 0))
          (fill (type none))
        )
        (rectangle (start -1.27 6.35) (end 1.27 -8.89)
          (stroke (width 0.254) (type default) (color 0 0 0 0))
          (fill (type background))
        )
        (pin passive line (at -5.08 5.08 0) (length 3.81)
          (name "Pin_1" (effects (font (size 1.27 1.27))))
          (number "1" (effects (font (size 1.27 1.27))))
        )
        (pin passive line (at -5.08 2.54 0) (length 3.81)
          (name "Pin_2" (effects (font (size 1.27 1.27))))
          (number "2" (effects (font (size 1.27 1.27))))
        )
        (pin passive line (at -5.08 0 0) (length 3.81)
          (name "Pin_3" (effects (font (size 1.27 1.27))))
          (number "3" (effects (font (size 1.27 1.27))))
        )
        (pin passive line (at -5.08 -2.54 0) (length 3.81)
          (name "Pin_4" (effects (font (size 1.27 1.27))))
          (number "4" (effects (font (size 1.27 1.27))))
        )
        (pin passive line (at -5.08 -5.08 0) (length 3.81)
          (name "Pin_5" (effects (font (size 1.27 1.27))))
          (number "5" (effects (font (size 1.27 1.27))))
        )
        (pin passive line (at -5.08 -7.62 0) (length 3.81)
          (name "Pin_6" (effects (font (size 1.27 1.27))))
          (number "6" (effects (font (size 1.27 1.27))))
        )
      )
    )
    (symbol "Device:C" (pin_numbers hide) (pin_names (offset 0.254)) (in_bom yes) (on_board yes)
      (property "Reference" "C" (id 0) (at 0.635 2.54 0)
        (effects (font (size 1.27 1.27)) (justify left))
      )
      (property "Value" "C" (id 1) (at 0.635 -2.54 0)
        (effects (font (size 1.27 1.27)) (justify left))
      )
      (property "Footprint" "" (id 2) (at 0.9652 -3.81 0)
        (effects (font (size 1.27 1.27)) hide)
      )
      (property "Datasheet" "~" (id 3) (at 0 0 0)
        (effects (font (size 1.27 1.27)) hide)
      )
      (property "ki_keywords" "cap capacitor" (id 4) (at 0 0 0)
        (effects (font (size 1.27 1.27)) hide)
      )
      (property "ki_description" "Unpolarized capacitor" (id 5) (at 0 0 0)
        (effects (font (size 1.27 1.27)) hide)
      )
      (property "ki_fp_filters" "C_*" (id 6) (at 0 0 0)
        (effects (font (size 1.27 1.27)) hide)
      )
      (symbol "C_0_1"
        (polyline
          (pts
            (xy -2.032 -0.762)
            (xy 2.032 -0.762)
          )
          (stroke (width 0.508) (type default) (color 0 0 0 0))
          (fill (type none))
        )
        (polyline
          (pts
            (xy -2.032 0.762)
            (xy 2.032 0.762)
          )
          (stroke (width 0.508) (type default) (color 0 0 0 0))
          (fill (type none))
        )
      )
      (symbol "C_1_1"
        (pin passive line (at 0 3.81 270) (length 2.794)
          (name "~" (effects (font (size 1.27 1.27))))
          (number "1" (effects (font (size 1.27 1.27))))
        )
        (pin passive line (at 0 -3.81 90) (length 2.794)
          (name "~" (effects (font (size 1.27 1.27))))
          (number "2" (effects (font (size 1.27 1.27))))
        )
      )
    )
    (symbol "Device:LED" (pin_numbers hide) (pin_names (offset 1.016) hide) (in_bom yes) (on_board yes)
      (property "Reference" "D" (id 0) (at 0 2.54 0)
        (effects (font (size 1.27 1.27)))
      )
      (property "Value" "LED" (id 1) (at 0 -2.54 0)
        (effects (font (size 1.27 1.27)))
      )
      (property "Footprint" "" (id 2) (at 0 0 0)
        (effects (font (size 1.27 1.27)) hide)
      )
      (property "Datasheet" "~" (id 3) (at 0 0 0)
        (effects (font (size 1.27 1.27)) hide)
      )
      (property "ki_keywords" "LED diode" (id 4) (at 0 0 0)
        (effects (font (size 1.27 1.27)) hide)
      )
      (property "ki_description" "Light emitting diode" (id 5) (at 0 0 0)
        (effects (font (size 1.27 1.27)) hide)
      )
      (property "ki_fp_filters" "LED* LED_SMD:* LED_THT:*" (id 6) (at 0 0 0)
        (effects (font (size 1.27 1.27)) hide)
      )
      (symbol "LED_0_1"
        (polyline
          (pts
            (xy -1.27 -1.27)
            (xy -1.27 1.27)
          )
          (stroke (width 0.254) (type default) (color 0 0 0 0))
          (fill (type none))
        )
        (polyline
          (pts
            (xy -1.27 0)
            (xy 1.27 0)
          )
          (stroke (width 0) (type default) (color 0 0 0 0))
          (fill (type none))
        )
        (polyline
          (pts
            (xy 1.27 -1.27)
            (xy 1.27 1.27)
            (xy -1.27 0)
            (xy 1.27 -1.27)
          )
          (stroke (width 0.254) (type default) (color 0 0 0 0))
          (fill (type none))
        )
        (polyline
          (pts
            (xy -3.048 -0.762)
            (xy -4.572 -2.286)
            (xy -3.81 -2.286)
            (xy -4.572 -2.286)
            (xy -4.572 -1.524)
          )
          (stroke (width 0) (type default) (color 0 0 0 0))
          (fill (type none))
        )
        (polyline
          (pts
            (xy -1.778 -0.762)
            (xy -3.302 -2.286)
            (xy -2.54 -2.286)
            (xy -3.302 -2.286)
            (xy -3.302 -1.524)
          )
          (stroke (width 0) (type default) (color 0 0 0 0))
          (fill (type none))
        )
      )
      (symbol "LED_1_1"
        (pin passive line (at -3.81 0 0) (length 2.54)
          (name "K" (effects (font (size 1.27 1.27))))
          (number "1" (effects (font (size 1.27 1.27))))
        )
        (pin passive line (at 3.81 0 180) (length 2.54)
          (name "A" (effects (font (size 1.27 1.27))))
          (number "2" (effects (font (size 1.27 1.27))))
        )
      )
    )
    (symbol "Device:R" (pin_numbers hide) (pin_names (offset 0)) (in_bom yes) (on_board yes)
      (property "Reference" "R" (id 0) (at 2.032 0 90)
        (effects (font (size 1.27 1.27)))
      )
      (property "Value" "R" (id 1) (at 0 0 90)
        (effects (font (size 1.27 1.27)))
      )
      (property "Footprint" "" (id 2) (at -1.778 0 90)
        (effects (font (size 1.27 1.27)) hide)
      )
      (property "Datasheet" "~" (id 3) (at 0 0 0)
        (effects (font (size 1.27 1.27)) hide)
      )
      (property "ki_keywords" "R res resistor" (id 4) (at 0 0 0)
        (effects (font (size 1.27 1.27)) hide)
      )
      (property "ki_description" "Resistor" (id 5) (at 0 0 0)
        (effects (font (size 1.27 1.27)) hide)
      )
      (property "ki_fp_filters" "R_*" (id 6) (at 0 0 0)
        (effects (font (size 1.27 1.27)) hide)
      )
      (symbol "R_0_1"
        (rectangle (start -1.016 -2.54) (end 1.016 2.54)
          (stroke (width 0.254) (type default) (color 0 0 0 0))
          (fill (type none))
        )
      )
      (symbol "R_1_1"
        (pin passive line (at 0 3.81 270) (length 1.27)
          (name "~" (effects (font (size 1.27 1.27))))
          (number "1" (effects (font (size 1.27 1.27))))
        )
        (pin passive line (at 0 -3.81 90) (length 1.27)
          (name "~" (effects (font (size 1.27 1.27))))
          (number "2" (effects (font (size 1.27 1.27))))
        )
      )
    )
    (symbol "ICM42605:ICM42605" (in_bom yes) (on_board yes)
      (property "Reference" "U" (id 0) (at -7.62 8.89 0)
        (effects (font (size 1.27 1.27)))
      )
      (property "Value" "ICM42605" (id 1) (at 7.62 8.89 0)
        (effects (font (size 1.27 1.27)))
      )
      (property "Footprint" "Package_LGA:LGA-14_3x2.5mm_P0.5mm_LayoutBorder3x4y" (id 2) (at -21.59 31.75 0)
        (effects (font (size 1.27 1.27)) hide)
      )
      (property "Datasheet" "" (id 3) (at -21.59 31.75 0)
        (effects (font (size 1.27 1.27)) hide)
      )
      (symbol "ICM42605_0_1"
        (rectangle (start -12.7 7.62) (end 12.7 -7.62)
          (stroke (width 0.1524) (type default) (color 0 0 0 0))
          (fill (type background))
        )
      )
      (symbol "ICM42605_1_1"
        (pin bidirectional line (at -15.24 0 0) (length 2.54)
          (name "AD0/SDO" (effects (font (size 1.27 1.27))))
          (number "1" (effects (font (size 1.27 1.27))))
        )
        (pin passive line (at 15.24 -5.08 180) (length 2.54)
          (name "RESV" (effects (font (size 1.27 1.27))))
          (number "10" (effects (font (size 1.27 1.27))))
        )
        (pin passive line (at 15.24 -5.08 180) (length 2.54) hide
          (name "RESV" (effects (font (size 1.27 1.27))))
          (number "11" (effects (font (size 1.27 1.27))))
        )
        (pin input line (at -15.24 -2.54 0) (length 2.54)
          (name "nCS" (effects (font (size 1.27 1.27))))
          (number "12" (effects (font (size 1.27 1.27))))
        )
        (pin input line (at -15.24 5.08 0) (length 2.54)
          (name "SCL/SCLK" (effects (font (size 1.27 1.27))))
          (number "13" (effects (font (size 1.27 1.27))))
        )
        (pin bidirectional line (at -15.24 2.54 0) (length 2.54)
          (name "SDA/SDI" (effects (font (size 1.27 1.27))))
          (number "14" (effects (font (size 1.27 1.27))))
        )
        (pin passive line (at 15.24 0 180) (length 2.54)
          (name "RESV" (effects (font (size 1.27 1.27))))
          (number "2" (effects (font (size 1.27 1.27))))
        )
        (pin passive line (at 15.24 0 180) (length 2.54) hide
          (name "RESV" (effects (font (size 1.27 1.27))))
          (number "3" (effects (font (size 1.27 1.27))))
        )
        (pin output line (at -15.24 -5.08 0) (length 2.54)
          (name "INT" (effects (font (size 1.27 1.27))))
          (number "4" (effects (font (size 1.27 1.27))))
        )
        (pin power_in line (at 1.27 10.16 270) (length 2.54)
          (name "VDDIO" (effects (font (size 1.27 1.27))))
          (number "5" (effects (font (size 1.27 1.27))))
        )
        (pin power_in line (at 0 -10.16 90) (length 2.54)
          (name "GND" (effects (font (size 1.27 1.27))))
          (number "6" (effects (font (size 1.27 1.27))))
        )
        (pin passive line (at 15.24 -2.54 180) (length 2.54)
          (name "RESV" (effects (font (size 1.27 1.27))))
          (number "7" (effects (font (size 1.27 1.27))))
        )
        (pin power_in line (at -1.27 10.16 270) (length 2.54)
          (name "VDD" (effects (font (size 1.27 1.27))))
          (number "8" (effects (font (size 1.27 1.27))))
        )
        (pin output line (at 15.24 5.08 180) (length 2.54)
          (name "FSYNC" (effects (font (size 1.27 1.27))))
          (number "9" (effects (font (size 1.27 1.27))))
        )
      )
    )
    (symbol "Interface_CAN_LIN:TJA1051T-3" (pin_names (offset 1.016)) (in_bom yes) (on_board yes)
      (property "Reference" "U" (id 0) (at -10.16 8.89 0)
        (effects (font (size 1.27 1.27)) (justify left))
      )
      (property "Value" "TJA1051T-3" (id 1) (at 1.27 8.89 0)
        (effects (font (size 1.27 1.27)) (justify left))
      )
      (property "Footprint" "Package_SO:SOIC-8_3.9x4.9mm_P1.27mm" (id 2) (at 0 -12.7 0)
        (effects (font (size 1.27 1.27) italic) hide)
      )
      (property "Datasheet" "http://www.nxp.com/documents/data_sheet/TJA1051.pdf" (id 3) (at 0 0 0)
        (effects (font (size 1.27 1.27)) hide)
      )
      (property "ki_keywords" "High-Speed CAN Transceiver" (id 4) (at 0 0 0)
        (effects (font (size 1.27 1.27)) hide)
      )
      (property "ki_description" "High-Speed CAN Transceiver, separate VIO, silent mode, SOIC-8" (id 5) (at 0 0 0)
        (effects (font (size 1.27 1.27)) hide)
      )
      (property "ki_fp_filters" "SOIC*3.9x4.9mm*P1.27mm*" (id 6) (at 0 0 0)
        (effects (font (size 1.27 1.27)) hide)
      )
      (symbol "TJA1051T-3_0_1"
        (rectangle (start -10.16 7.62) (end 10.16 -7.62)
          (stroke (width 0.254) (type default) (color 0 0 0 0))
          (fill (type background))
        )
      )
      (symbol "TJA1051T-3_1_1"
        (pin input line (at -12.7 5.08 0) (length 2.54)
          (name "TXD" (effects (font (size 1.27 1.27))))
          (number "1" (effects (font (size 1.27 1.27))))
        )
        (pin power_in line (at 0 -10.16 90) (length 2.54)
          (name "GND" (effects (font (size 1.27 1.27))))
          (number "2" (effects (font (size 1.27 1.27))))
        )
        (pin power_in line (at 0 10.16 270) (length 2.54)
          (name "VCC" (effects (font (size 1.27 1.27))))
          (number "3" (effects (font (size 1.27 1.27))))
        )
        (pin output line (at -12.7 2.54 0) (length 2.54)
          (name "RXD" (effects (font (size 1.27 1.27))))
          (number "4" (effects (font (size 1.27 1.27))))
        )
        (pin power_in line (at -12.7 -2.54 0) (length 2.54)
          (name "VIO" (effects (font (size 1.27 1.27))))
          (number "5" (effects (font (size 1.27 1.27))))
        )
        (pin bidirectional line (at 12.7 -2.54 180) (length 2.54)
          (name "CANL" (effects (font (size 1.27 1.27))))
          (number "6" (effects (font (size 1.27 1.27))))
        )
        (pin bidirectional line (at 12.7 2.54 180) (length 2.54)
          (name "CANH" (effects (font (size 1.27 1.27))))
          (number "7" (effects (font (size 1.27 1.27))))
        )
        (pin input line (at -12.7 -5.08 0) (length 2.54)
          (name "S" (effects (font (size 1.27 1.27))))
          (number "8" (effects (font (size 1.27 1.27))))
        )
      )
    )
    (symbol "STM32G0:STM32G0B1KxT" (in_bom yes) (on_board yes)
      (property "Reference" "U" (id 0) (at -15.24 26.67 0)
        (effects (font (size 1.27 1.27)) (justify left))
      )
      (property "Value" "STM32G0B1KxT" (id 1) (at 1.27 26.67 0)
        (effects (font (size 1.27 1.27)) (justify left))
      )
      (property "Footprint" "Package_QFP:LQFP-32_7x7mm_P0.8mm" (id 2) (at -2.54 -26.67 0)
        (effects (font (size 1.27 1.27)) (justify right) hide)
      )
      (property "Datasheet" "https://www.st.com/resource/en/datasheet/stm32g071kb.pdf" (id 3) (at 0 0 0)
        (effects (font (size 1.27 1.27)) hide)
      )
      (property "ki_keywords" "ARM Cortex-M0+ STM32G0 STM32G071" (id 4) (at 0 0 0)
        (effects (font (size 1.27 1.27)) hide)
      )
      (property "ki_description" "ARM Cortex-M0+ MCU, 64/128 kB flash, 36 kB SRAM, 64 MHz, 1.7-3.6 V, 30 GPIO, UFQFPN-32" (id 5) (at 0 0 0)
        (effects (font (size 1.27 1.27)) hide)
      )
      (property "ki_fp_filters" "UFQFPN*1EP*5x5mm*P0.5mm*" (id 6) (at 0 0 0)
        (effects (font (size 1.27 1.27)) hide)
      )
      (symbol "STM32G0B1KxT_0_1"
        (rectangle (start -15.24 -25.4) (end 15.24 25.4)
          (stroke (width 0.254) (type default) (color 0 0 0 0))
          (fill (type background))
        )
      )
      (symbol "STM32G0B1KxT_1_1"
        (pin bidirectional line (at 17.78 -2.54 180) (length 2.54)
          (name "PB9" (effects (font (size 1.27 1.27))))
          (number "1" (effects (font (size 1.27 1.27))))
        )
        (pin bidirectional line (at -17.78 12.7 0) (length 2.54)
          (name "PA3" (effects (font (size 1.27 1.27))))
          (number "10" (effects (font (size 1.27 1.27))))
        )
        (pin bidirectional line (at -17.78 10.16 0) (length 2.54)
          (name "PA4" (effects (font (size 1.27 1.27))))
          (number "11" (effects (font (size 1.27 1.27))))
        )
        (pin bidirectional line (at -17.78 7.62 0) (length 2.54)
          (name "PA5" (effects (font (size 1.27 1.27))))
          (number "12" (effects (font (size 1.27 1.27))))
        )
        (pin bidirectional line (at -17.78 5.08 0) (length 2.54)
          (name "PA6" (effects (font (size 1.27 1.27))))
          (number "13" (effects (font (size 1.27 1.27))))
        )
        (pin bidirectional line (at -17.78 2.54 0) (length 2.54)
          (name "PA7" (effects (font (size 1.27 1.27))))
          (number "14" (effects (font (size 1.27 1.27))))
        )
        (pin bidirectional line (at 17.78 20.32 180) (length 2.54)
          (name "PB0" (effects (font (size 1.27 1.27))))
          (number "15" (effects (font (size 1.27 1.27))))
        )
        (pin bidirectional line (at 17.78 17.78 180) (length 2.54)
          (name "PB1" (effects (font (size 1.27 1.27))))
          (number "16" (effects (font (size 1.27 1.27))))
        )
        (pin bidirectional line (at 17.78 15.24 180) (length 2.54)
          (name "PB2" (effects (font (size 1.27 1.27))))
          (number "17" (effects (font (size 1.27 1.27))))
        )
        (pin bidirectional line (at -17.78 0 0) (length 2.54)
          (name "PA8" (effects (font (size 1.27 1.27))))
          (number "18" (effects (font (size 1.27 1.27))))
        )
        (pin bidirectional line (at -17.78 -2.54 0) (length 2.54)
          (name "PA9" (effects (font (size 1.27 1.27))))
          (number "19" (effects (font (size 1.27 1.27))))
        )
        (pin bidirectional line (at 17.78 -10.16 180) (length 2.54)
          (name "OSC32_IN/PC14" (effects (font (size 1.27 1.27))))
          (number "2" (effects (font (size 1.27 1.27))))
        )
        (pin bidirectional line (at 17.78 -7.62 180) (length 2.54)
          (name "PC6" (effects (font (size 1.27 1.27))))
          (number "20" (effects (font (size 1.27 1.27))))
        )
        (pin bidirectional line (at -17.78 -5.08 0) (length 2.54)
          (name "PA10" (effects (font (size 1.27 1.27))))
          (number "21" (effects (font (size 1.27 1.27))))
        )
        (pin bidirectional line (at -17.78 -7.62 0) (length 2.54)
          (name "PA11_[PA9]" (effects (font (size 1.27 1.27))))
          (number "22" (effects (font (size 1.27 1.27))))
        )
        (pin bidirectional line (at -17.78 -10.16 0) (length 2.54)
          (name "PA12_[PA10]" (effects (font (size 1.27 1.27))))
          (number "23" (effects (font (size 1.27 1.27))))
        )
        (pin bidirectional line (at -17.78 -12.7 0) (length 2.54)
          (name "PA13" (effects (font (size 1.27 1.27))))
          (number "24" (effects (font (size 1.27 1.27))))
        )
        (pin bidirectional line (at -17.78 -15.24 0) (length 2.54)
          (name "PA14/BOOT0" (effects (font (size 1.27 1.27))))
          (number "25" (effects (font (size 1.27 1.27))))
        )
        (pin bidirectional line (at -17.78 -17.78 0) (length 2.54)
          (name "PA15" (effects (font (size 1.27 1.27))))
          (number "26" (effects (font (size 1.27 1.27))))
        )
        (pin bidirectional line (at 17.78 12.7 180) (length 2.54)
          (name "PB3" (effects (font (size 1.27 1.27))))
          (number "27" (effects (font (size 1.27 1.27))))
        )
        (pin bidirectional line (at 17.78 10.16 180) (length 2.54)
          (name "PB4" (effects (font (size 1.27 1.27))))
          (number "28" (effects (font (size 1.27 1.27))))
        )
        (pin bidirectional line (at 17.78 7.62 180) (length 2.54)
          (name "PB5" (effects (font (size 1.27 1.27))))
          (number "29" (effects (font (size 1.27 1.27))))
        )
        (pin bidirectional line (at 17.78 -12.7 180) (length 2.54)
          (name "OSC32_OUT/PC15" (effects (font (size 1.27 1.27))))
          (number "3" (effects (font (size 1.27 1.27))))
        )
        (pin bidirectional line (at 17.78 5.08 180) (length 2.54)
          (name "PB6" (effects (font (size 1.27 1.27))))
          (number "30" (effects (font (size 1.27 1.27))))
        )
        (pin bidirectional line (at 17.78 2.54 180) (length 2.54)
          (name "PB7" (effects (font (size 1.27 1.27))))
          (number "31" (effects (font (size 1.27 1.27))))
        )
        (pin bidirectional line (at 17.78 0 180) (length 2.54)
          (name "PB8" (effects (font (size 1.27 1.27))))
          (number "32" (effects (font (size 1.27 1.27))))
        )
        (pin power_in line (at 0 27.94 270) (length 2.54)
          (name "VDD/VDDA" (effects (font (size 1.27 1.27))))
          (number "4" (effects (font (size 1.27 1.27))))
        )
        (pin power_in line (at 0 -27.94 90) (length 2.54)
          (name "VSS/VSSA" (effects (font (size 1.27 1.27))))
          (number "5" (effects (font (size 1.27 1.27))))
        )
        (pin bidirectional line (at 17.78 -17.78 180) (length 2.54)
          (name "~{RST}/PF2" (effects (font (size 1.27 1.27))))
          (number "6" (effects (font (size 1.27 1.27))))
        )
        (pin bidirectional line (at -17.78 20.32 0) (length 2.54)
          (name "PA0" (effects (font (size 1.27 1.27))))
          (number "7" (effects (font (size 1.27 1.27))))
        )
        (pin bidirectional line (at -17.78 17.78 0) (length 2.54)
          (name "PA1" (effects (font (size 1.27 1.27))))
          (number "8" (effects (font (size 1.27 1.27))))
        )
        (pin bidirectional line (at -17.78 15.24 0) (length 2.54)
          (name "PA2" (effects (font (size 1.27 1.27))))
          (number "9" (effects (font (size 1.27 1.27))))
        )
      )
    )
    (symbol "power:+3V3" (power) (pin_names (offset 0)) (in_bom yes) (on_board yes)
      (property "Reference" "#PWR" (id 0) (at 0 -3.81 0)
        (effects (font (size 1.27 1.27)) hide)
      )
      (property "Value" "+3V3" (id 1) (at 0 3.556 0)
        (effects (font (size 1.27 1.27)))
      )
      (property "Footprint" "" (id 2) (at 0 0 0)
        (effects (font (size 1.27 1.27)) hide)
      )
      (property "Datasheet" "" (id 3) (at 0 0 0)
        (effects (font (size 1.27 1.27)) hide)
      )
      (property "ki_keywords" "power-flag" (id 4) (at 0 0 0)
        (effects (font (size 1.27 1.27)) hide)
      )
      (property "ki_description" "Power symbol creates a global label with name \"+3V3\"" (id 5) (at 0 0 0)
        (effects (font (size 1.27 1.27)) hide)
      )
      (symbol "+3V3_0_1"
        (polyline
          (pts
            (xy -0.762 1.27)
            (xy 0 2.54)
          )
          (stroke (width 0) (type default) (color 0 0 0 0))
          (fill (type none))
        )
        (polyline
          (pts
            (xy 0 0)
            (xy 0 2.54)
          )
          (stroke (width 0) (type default) (color 0 0 0 0))
          (fill (type none))
        )
        (polyline
          (pts
            (xy 0 2.54)
            (xy 0.762 1.27)
          )
          (stroke (width 0) (type default) (color 0 0 0 0))
          (fill (type none))
        )
      )
      (symbol "+3V3_1_1"
        (pin power_in line (at 0 0 90) (length 0) hide
          (name "+3V3" (effects (font (size 1.27 1.27))))
          (number "1" (effects (font (size 1.27 1.27))))
        )
      )
    )
    (symbol "power:+5V" (power) (pin_names (offset 0)) (in_bom yes) (on_board yes)
      (property "Reference" "#PWR" (id 0) (at 0 -3.81 0)
        (effects (font (size 1.27 1.27)) hide)
      )
      (property "Value" "+5V" (id 1) (at 0 3.556 0)
        (effects (font (size 1.27 1.27)))
      )
      (property "Footprint" "" (id 2) (at 0 0 0)
        (effects (font (size 1.27 1.27)) hide)
      )
      (property "Datasheet" "" (id 3) (at 0 0 0)
        (effects (font (size 1.27 1.27)) hide)
      )
      (property "ki_keywords" "power-flag" (id 4) (at 0 0 0)
        (effects (font (size 1.27 1.27)) hide)
      )
      (property "ki_description" "Power symbol creates a global label with name \"+5V\"" (id 5) (at 0 0 0)
        (effects (font (size 1.27 1.27)) hide)
      )
      (symbol "+5V_0_1"
        (polyline
          (pts
            (xy -0.762 1.27)
            (xy 0 2.54)
          )
          (stroke (width 0) (type default) (color 0 0 0 0))
          (fill (type none))
        )
        (polyline
          (pts
            (xy 0 0)
            (xy 0 2.54)
          )
          (stroke (width 0) (type default) (color 0 0 0 0))
          (fill (type none))
        )
        (polyline
          (pts
            (xy 0 2.54)
            (xy 0.762 1.27)
          )
          (stroke (width 0) (type default) (color 0 0 0 0))
          (fill (type none))
        )
      )
      (symbol "+5V_1_1"
        (pin power_in line (at 0 0 90) (length 0) hide
          (name "+5V" (effects (font (size 1.27 1.27))))
          (number "1" (effects (font (size 1.27 1.27))))
        )
      )
    )
    (symbol "power:GND" (power) (pin_names (offset 0)) (in_bom yes) (on_board yes)
      (property "Reference" "#PWR" (id 0) (at 0 -6.35 0)
        (effects (font (size 1.27 1.27)) hide)
      )
      (property "Value" "GND" (id 1) (at 0 -3.81 0)
        (effects (font (size 1.27 1.27)))
      )
      (property "Footprint" "" (id 2) (at 0 0 0)
        (effects (font (size 1.27 1.27)) hide)
      )
      (property "Datasheet" "" (id 3) (at 0 0 0)
        (effects (font (size 1.27 1.27)) hide)
      )
      (property "ki_keywords" "power-flag" (id 4) (at 0 0 0)
        (effects (font (size 1.27 1.27)) hide)
      )
      (property "ki_description" "Power symbol creates a global label with name \"GND\" , ground" (id 5) (at 0 0 0)
        (effects (font (size 1.27 1.27)) hide)
      )
      (symbol "GND_0_1"
        (polyline
          (pts
            (xy 0 0)
            (xy 0 -1.27)
            (xy 1.27 -1.27)
            (xy 0 -2.54)
            (xy -1.27 -1.27)
            (xy 0 -1.27)
          )
          (stroke (width 0) (type default) (color 0 0 0 0))
          (fill (type none))
        )
      )
      (symbol "GND_1_1"
        (pin power_in line (at 0 0 270) (length 0) hide
          (name "GND" (effects (font (size 1.27 1.27))))
          (number "1" (effects (font (size 1.27 1.27))))
        )
      )
    )
    (symbol "power:PWR_FLAG" (power) (pin_numbers hide) (pin_names (offset 0) hide) (in_bom yes) (on_board yes)
      (property "Reference" "#FLG" (id 0) (at 0 1.905 0)
        (effects (font (size 1.27 1.27)) hide)
      )
      (property "Value" "PWR_FLAG" (id 1) (at 0 3.81 0)
        (effects (font (size 1.27 1.27)))
      )
      (property "Footprint" "" (id 2) (at 0 0 0)
        (effects (font (size 1.27 1.27)) hide)
      )
      (property "Datasheet" "~" (id 3) (at 0 0 0)
        (effects (font (size 1.27 1.27)) hide)
      )
      (property "ki_keywords" "power-flag" (id 4) (at 0 0 0)
        (effects (font (size 1.27 1.27)) hide)
      )
      (property "ki_description" "Special symbol for telling ERC where power comes from" (id 5) (at 0 0 0)
        (effects (font (size 1.27 1.27)) hide)
      )
      (symbol "PWR_FLAG_0_0"
        (pin power_out line (at 0 0 90) (length 0)
          (name "pwr" (effects (font (size 1.27 1.27))))
          (number "1" (effects (font (size 1.27 1.27))))
        )
      )
      (symbol "PWR_FLAG_0_1"
        (polyline
          (pts
            (xy 0 0)
            (xy 0 1.27)
            (xy -1.016 1.905)
            (xy 0 2.54)
            (xy 1.016 1.905)
            (xy 0 1.27)
          )
          (stroke (width 0) (type default) (color 0 0 0 0))
          (fill (type none))
        )
      )
    )
  )


  (junction (at 154.94 38.1) (diameter 0.9144) (color 0 0 0 0)
    (uuid 3b914c36-abfa-4740-b6b5-3a7d181f5e31)
  )
  (junction (at 154.94 48.26) (diameter 0.9144) (color 0 0 0 0)
    (uuid 72959b9b-e72f-4e55-870f-be5ea58e5c36)
  )
  (junction (at 214.63 60.96) (diameter 0.9144) (color 0 0 0 0)
    (uuid 89eedc24-8750-407f-90e4-18b136d8a245)
  )
  (junction (at 58.42 34.29) (diameter 0) (color 0 0 0 0)
    (uuid 92d38b6e-10bb-4476-90f2-2e4d27e77bb1)
  )
  (junction (at 242.57 45.72) (diameter 0.9144) (color 0 0 0 0)
    (uuid a373fa12-5f78-48ac-a7ef-4de8108b6504)
  )
  (junction (at 127 118.11) (diameter 0.9144) (color 0 0 0 0)
    (uuid b1afdc82-ee5a-4cef-b119-9cb72898d220)
  )
  (junction (at 104.14 118.11) (diameter 0.9144) (color 0 0 0 0)
    (uuid cf17ebe9-c2e6-40d4-9f90-bac1f12ad709)
  )
  (junction (at 162.56 48.26) (diameter 0.9144) (color 0 0 0 0)
    (uuid e82f0090-e329-44d4-aed6-bd7661c35030)
  )

  (no_connect (at 76.2 64.77) (uuid 03c2012e-3d08-456f-b61d-c4deea887ae3))
  (no_connect (at 173.99 63.5) (uuid 0eea07f1-fa53-4b3d-bf27-3d40beaffd9f))
  (no_connect (at 40.64 72.39) (uuid 3303a84e-9584-4191-b83e-6c534f9ff7b9))
  (no_connect (at 40.64 64.77) (uuid 3f0f219d-0fe1-4292-bb60-55702de0814c))
  (no_connect (at 40.64 49.53) (uuid 42a8d8e8-d0a5-4798-9f8d-badcea8614a1))
  (no_connect (at 40.64 69.85) (uuid 47c147b0-c571-458b-902f-af55fb9fd1f2))
  (no_connect (at 40.64 67.31) (uuid 510eaf7e-8c25-45d1-8929-5f4da9c16226))
  (no_connect (at 76.2 74.93) (uuid 6c5f257f-dba0-49ff-818a-94641b745876))
  (no_connect (at 40.64 52.07) (uuid 71267d5a-1a65-4b33-80ae-f14716ec5bf4))
  (no_connect (at 40.64 62.23) (uuid 87295cbe-ed55-471a-aeb9-8c0e0ab150de))
  (no_connect (at 40.64 46.99) (uuid 88f5a0c2-cbc1-4840-9752-880eb7e2412b))
  (no_connect (at 173.99 66.04) (uuid 8a8a3fa5-8346-41c4-a778-52e3ca144b34))
  (no_connect (at 40.64 57.15) (uuid 95ebbd84-b5ce-4f96-987d-be051a4aaa12))
  (no_connect (at 40.64 54.61) (uuid b5536bc0-4bab-4f8a-be93-a16c0c6cda39))
  (no_connect (at 76.2 85.09) (uuid c3be0d4e-2924-4778-8f0b-b85bdaf32a1a))
  (no_connect (at 173.99 60.96) (uuid cf579450-4cb4-4c6f-9d76-c102e56d4899))
  (no_connect (at 40.64 59.69) (uuid d109badc-b9a5-4f96-b4f9-f49fb28708be))
  (no_connect (at 76.2 80.01) (uuid d40983b3-4dfe-4f11-a1a4-4dd9df5f5460))
  (no_connect (at 76.2 77.47) (uuid ef51adb2-ff9e-4002-a0aa-e8b44dda867d))
  (no_connect (at 40.64 85.09) (uuid efe0a590-d6e5-481e-ab53-168de05b4d8c))

  (wire (pts (xy 172.72 48.26) (xy 175.26 48.26))
    (stroke (width 0) (type solid) (color 0 0 0 0))
    (uuid 02edb2df-c18f-4201-9c26-3a809ffa0560)
  )
  (wire (pts (xy 58.42 31.75) (xy 58.42 34.29))
    (stroke (width 0) (type default) (color 0 0 0 0))
    (uuid 049305e5-23df-4a21-b1a1-dec44b82f758)
  )
  (wire (pts (xy 20.32 80.01) (xy 40.64 80.01))
    (stroke (width 0) (type solid) (color 0 0 0 0))
    (uuid 0535edc6-1e3a-4c82-8615-41863dde5c6f)
  )
  (wire (pts (xy 76.2 54.61) (xy 97.79 54.61))
    (stroke (width 0) (type solid) (color 0 0 0 0))
    (uuid 053ec101-a6dc-4037-b5db-1eaab869bb1d)
  )
  (wire (pts (xy 157.48 50.8) (xy 157.48 48.26))
    (stroke (width 0) (type solid) (color 0 0 0 0))
    (uuid 0740ece8-2ea9-44cf-be8f-9e79a11008f5)
  )
  (wire (pts (xy 121.92 60.96) (xy 143.51 60.96))
    (stroke (width 0) (type default) (color 0 0 0 0))
    (uuid 07aa09e5-72da-4a26-8b7a-ab9700635fc2)
  )
  (wire (pts (xy 20.32 82.55) (xy 40.64 82.55))
    (stroke (width 0) (type solid) (color 0 0 0 0))
    (uuid 0863ca7e-8161-42dc-a413-3e719cc0b0ce)
  )
  (wire (pts (xy 55.88 34.29) (xy 58.42 34.29))
    (stroke (width 0) (type default) (color 0 0 0 0))
    (uuid 0cdce257-716f-4e8d-8878-9517e9dbfcfe)
  )
  (wire (pts (xy 154.94 38.1) (xy 154.94 48.26))
    (stroke (width 0) (type solid) (color 0 0 0 0))
    (uuid 0dfd884a-80b3-4578-aed3-387516f298ea)
  )
  (wire (pts (xy 20.32 77.47) (xy 40.64 77.47))
    (stroke (width 0) (type default) (color 0 0 0 0))
    (uuid 0e687a90-40ac-49dc-b8f0-fe867b5f2d8d)
  )
  (wire (pts (xy 160.02 50.8) (xy 160.02 48.26))
    (stroke (width 0) (type solid) (color 0 0 0 0))
    (uuid 117cc99f-49dd-416a-9f32-d455f29f8907)
  )
  (wire (pts (xy 163.83 101.6) (xy 166.37 101.6))
    (stroke (width 0) (type solid) (color 0 0 0 0))
    (uuid 17d155fe-dc11-4a1d-8007-90470675864e)
  )
  (wire (pts (xy 127 118.11) (xy 127 115.57))
    (stroke (width 0) (type solid) (color 0 0 0 0))
    (uuid 19ec0c04-4dca-40dd-970c-d811c6b1b5fa)
  )
  (wire (pts (xy 154.94 35.56) (xy 154.94 38.1))
    (stroke (width 0) (type solid) (color 0 0 0 0))
    (uuid 1cb6ee74-8f84-4d1c-b2b4-d1323e8a67aa)
  )
  (wire (pts (xy 76.2 36.83) (xy 76.2 34.29))
    (stroke (width 0) (type default) (color 0 0 0 0))
    (uuid 2574a4f3-703d-4230-a195-7bce5fe9917f)
  )
  (wire (pts (xy 163.83 105.41) (xy 166.37 105.41))
    (stroke (width 0) (type solid) (color 0 0 0 0))
    (uuid 2592c0ef-fef1-4f88-b620-5257f7b41b2f)
  )
  (wire (pts (xy 232.41 123.19) (xy 241.3 123.19))
    (stroke (width 0) (type solid) (color 0 0 0 0))
    (uuid 2938dc9d-310b-460c-86cd-f3dfb8651b76)
  )
  (wire (pts (xy 242.57 43.18) (xy 242.57 45.72))
    (stroke (width 0) (type solid) (color 0 0 0 0))
    (uuid 2b34e202-0b0d-48ab-9c72-f23a32bedaf5)
  )
  (wire (pts (xy 217.17 55.88) (xy 229.87 55.88))
    (stroke (width 0) (type solid) (color 0 0 0 0))
    (uuid 2b9968c7-e101-4f36-87ab-37cd88b7bc87)
  )
  (wire (pts (xy 238.76 120.65) (xy 238.76 118.11))
    (stroke (width 0) (type solid) (color 0 0 0 0))
    (uuid 2d047ee0-7d63-40b1-b30e-0436af11baee)
  )
  (wire (pts (xy 124.46 118.11) (xy 127 118.11))
    (stroke (width 0) (type solid) (color 0 0 0 0))
    (uuid 2fabe685-7d35-4b43-9cc2-b62c4d84db81)
  )
  (wire (pts (xy 255.27 55.88) (xy 264.16 55.88))
    (stroke (width 0) (type solid) (color 0 0 0 0))
    (uuid 369ebbff-ee2e-4eb6-95ea-6d0e3b640d65)
  )
  (wire (pts (xy 40.64 36.83) (xy 40.64 34.29))
    (stroke (width 0) (type default) (color 0 0 0 0))
    (uuid 3827c66f-dc11-4f08-a7f7-6dfd507be269)
  )
  (wire (pts (xy 142.24 38.1) (xy 144.78 38.1))
    (stroke (width 0) (type solid) (color 0 0 0 0))
    (uuid 3cd2f21f-0287-4783-a988-6b06427644c6)
  )
  (wire (pts (xy 173.99 55.88) (xy 190.5 55.88))
    (stroke (width 0) (type default) (color 0 0 0 0))
    (uuid 3fa9419b-18a0-45ed-8a45-ccd79439258e)
  )
  (wire (pts (xy 76.2 59.69) (xy 97.79 59.69))
    (stroke (width 0) (type solid) (color 0 0 0 0))
    (uuid 429cf386-6f19-4b94-a118-f063a2db52d0)
  )
  (wire (pts (xy 160.02 48.26) (xy 162.56 48.26))
    (stroke (width 0) (type solid) (color 0 0 0 0))
    (uuid 42fb55b7-1beb-4389-a6ce-abfca0a13eaa)
  )
  (wire (pts (xy 121.92 160.02) (xy 124.46 160.02))
    (stroke (width 0) (type solid) (color 0 0 0 0))
    (uuid 45499a0c-8e63-420e-bc8f-ccbf717acef2)
  )
  (wire (pts (xy 185.42 127) (xy 195.58 127))
    (stroke (width 0) (type default) (color 0 0 0 0))
    (uuid 4744024e-2c8e-43d6-92c3-638552ce0283)
  )
  (wire (pts (xy 214.63 60.96) (xy 214.63 45.72))
    (stroke (width 0) (type solid) (color 0 0 0 0))
    (uuid 48e99111-4494-4aaa-958c-d2336c433a94)
  )
  (wire (pts (xy 76.2 34.29) (xy 68.58 34.29))
    (stroke (width 0) (type default) (color 0 0 0 0))
    (uuid 4a01f4fa-b757-405b-a870-c3cac7b30800)
  )
  (wire (pts (xy 104.14 118.11) (xy 106.68 118.11))
    (stroke (width 0) (type solid) (color 0 0 0 0))
    (uuid 543391fd-f580-40a3-87f5-bb8c84a7c167)
  )
  (wire (pts (xy 229.87 60.96) (xy 214.63 60.96))
    (stroke (width 0) (type solid) (color 0 0 0 0))
    (uuid 5445b667-7b52-4cd4-b26a-9ecf8c711fac)
  )
  (wire (pts (xy 127 105.41) (xy 127 107.95))
    (stroke (width 0) (type solid) (color 0 0 0 0))
    (uuid 545870b6-558a-4c50-a21f-c3324aac0d44)
  )
  (wire (pts (xy 142.24 48.26) (xy 144.78 48.26))
    (stroke (width 0) (type solid) (color 0 0 0 0))
    (uuid 5ad08b04-5d82-4d5f-a098-ddade78ab303)
  )
  (wire (pts (xy 40.64 34.29) (xy 48.26 34.29))
    (stroke (width 0) (type default) (color 0 0 0 0))
    (uuid 5d0de0a5-ba86-476a-a7ef-11424019a5ab)
  )
  (wire (pts (xy 157.48 48.26) (xy 154.94 48.26))
    (stroke (width 0) (type solid) (color 0 0 0 0))
    (uuid 600265e4-89df-434b-a666-caf6cf3f7638)
  )
  (wire (pts (xy 242.57 45.72) (xy 245.11 45.72))
    (stroke (width 0) (type solid) (color 0 0 0 0))
    (uuid 628bfb04-ce6f-4dc6-b293-7cc158e73676)
  )
  (wire (pts (xy 241.3 120.65) (xy 238.76 120.65))
    (stroke (width 0) (type solid) (color 0 0 0 0))
    (uuid 65be3fc5-1e93-47b6-86c4-74b5ae2c9f02)
  )
  (wire (pts (xy 88.9 160.02) (xy 104.14 160.02))
    (stroke (width 0) (type solid) (color 0 0 0 0))
    (uuid 661413db-d7af-4866-930e-d21179913b4f)
  )
  (wire (pts (xy 30.48 170.18) (xy 50.8 170.18))
    (stroke (width 0) (type solid) (color 0 0 0 0))
    (uuid 693097e8-ed80-46b0-be8b-9e0749a2f6c8)
  )
  (wire (pts (xy 76.2 52.07) (xy 97.79 52.07))
    (stroke (width 0) (type default) (color 0 0 0 0))
    (uuid 6a024bfa-f195-4eeb-974e-ab94fb9f9a06)
  )
  (wire (pts (xy 104.14 105.41) (xy 104.14 107.95))
    (stroke (width 0) (type solid) (color 0 0 0 0))
    (uuid 6a50cb02-1214-4852-8675-0a526e94ea76)
  )
  (wire (pts (xy 76.2 49.53) (xy 97.79 49.53))
    (stroke (width 0) (type default) (color 0 0 0 0))
    (uuid 6b1a0eb7-63b6-4a11-8058-8f62f4a5c088)
  )
  (wire (pts (xy 76.2 69.85) (xy 97.79 69.85))
    (stroke (width 0) (type default) (color 0 0 0 0))
    (uuid 7030a6ef-1b8c-4269-b26c-3341c1e35d96)
  )
  (wire (pts (xy 241.3 128.27) (xy 238.76 128.27))
    (stroke (width 0) (type solid) (color 0 0 0 0))
    (uuid 760022c8-3777-4a22-9064-ea38f1647206)
  )
  (wire (pts (xy 121.92 63.5) (xy 143.51 63.5))
    (stroke (width 0) (type default) (color 0 0 0 0))
    (uuid 79fdd0b3-321c-41ef-9e46-4735f5e421b1)
  )
  (wire (pts (xy 30.48 172.72) (xy 50.8 172.72))
    (stroke (width 0) (type solid) (color 0 0 0 0))
    (uuid 7a45aa52-d026-4f29-972e-4be542ae5856)
  )
  (wire (pts (xy 121.92 58.42) (xy 143.51 58.42))
    (stroke (width 0) (type default) (color 0 0 0 0))
    (uuid 7c48b698-2989-4b6d-a33f-c149d96ab6ae)
  )
  (wire (pts (xy 76.2 62.23) (xy 97.79 62.23))
    (stroke (width 0) (type default) (color 0 0 0 0))
    (uuid 807faf75-69a7-4c4b-ac17-1a5b797dddf9)
  )
  (wire (pts (xy 252.73 45.72) (xy 255.27 45.72))
    (stroke (width 0) (type solid) (color 0 0 0 0))
    (uuid 82a53414-5813-46ff-89bb-0ba22999c039)
  )
  (wire (pts (xy 212.09 60.96) (xy 214.63 60.96))
    (stroke (width 0) (type solid) (color 0 0 0 0))
    (uuid 85183f7f-bfb0-4b40-99b6-1fa2b31848de)
  )
  (wire (pts (xy 121.92 55.88) (xy 143.51 55.88))
    (stroke (width 0) (type default) (color 0 0 0 0))
    (uuid 89609046-05b2-4e48-a3a9-063669ae83f8)
  )
  (wire (pts (xy 50.8 177.8) (xy 48.26 177.8))
    (stroke (width 0) (type solid) (color 0 0 0 0))
    (uuid 8b03cab9-bcf8-4441-ac73-30dac3efc278)
  )
  (wire (pts (xy 48.26 177.8) (xy 48.26 180.34))
    (stroke (width 0) (type solid) (color 0 0 0 0))
    (uuid 8df9c9bb-5a8d-445a-9af8-4312785e1d01)
  )
  (wire (pts (xy 227.33 66.04) (xy 227.33 63.5))
    (stroke (width 0) (type default) (color 0 0 0 0))
    (uuid 940c0dda-aafa-414f-9507-673ce18f0723)
  )
  (wire (pts (xy 48.26 165.1) (xy 50.8 165.1))
    (stroke (width 0) (type solid) (color 0 0 0 0))
    (uuid 9da835fa-0963-4ff3-9aaa-d1212802cac0)
  )
  (wire (pts (xy 158.75 71.12) (xy 158.75 73.66))
    (stroke (width 0) (type solid) (color 0 0 0 0))
    (uuid 9ea32235-87fc-41d5-818f-c58ae9a20ff5)
  )
  (wire (pts (xy 101.6 118.11) (xy 104.14 118.11))
    (stroke (width 0) (type solid) (color 0 0 0 0))
    (uuid a37ca12b-5233-43ad-bbc5-eb0f992f7532)
  )
  (wire (pts (xy 238.76 128.27) (xy 238.76 130.81))
    (stroke (width 0) (type solid) (color 0 0 0 0))
    (uuid a3c7f823-3c11-4d45-8ad3-54edcb71b8b2)
  )
  (wire (pts (xy 162.56 48.26) (xy 165.1 48.26))
    (stroke (width 0) (type solid) (color 0 0 0 0))
    (uuid a8e08e83-5e34-4b07-9880-9e44937d39b4)
  )
  (wire (pts (xy 242.57 68.58) (xy 242.57 71.12))
    (stroke (width 0) (type solid) (color 0 0 0 0))
    (uuid aa58ede2-966d-423e-84a5-69cb74c2b1c0)
  )
  (wire (pts (xy 232.41 125.73) (xy 241.3 125.73))
    (stroke (width 0) (type solid) (color 0 0 0 0))
    (uuid abcd916c-efb2-412a-a015-fab6f79908a4)
  )
  (wire (pts (xy 217.17 53.34) (xy 229.87 53.34))
    (stroke (width 0) (type solid) (color 0 0 0 0))
    (uuid b07c8bd2-a811-4113-901b-e249acd98038)
  )
  (wire (pts (xy 76.2 67.31) (xy 97.79 67.31))
    (stroke (width 0) (type solid) (color 0 0 0 0))
    (uuid b3ac9cd2-e7f8-45f7-85ca-e4866d286e05)
  )
  (wire (pts (xy 48.26 162.56) (xy 48.26 165.1))
    (stroke (width 0) (type solid) (color 0 0 0 0))
    (uuid b810ec8e-a73b-478a-8c4e-5d6f160df850)
  )
  (wire (pts (xy 162.56 45.72) (xy 162.56 48.26))
    (stroke (width 0) (type solid) (color 0 0 0 0))
    (uuid b9a3c1e7-b04c-44b5-8851-966adbc004e1)
  )
  (wire (pts (xy 240.03 45.72) (xy 242.57 45.72))
    (stroke (width 0) (type solid) (color 0 0 0 0))
    (uuid b9f7f8d1-90a3-49b7-90ce-4ed42f9389b2)
  )
  (wire (pts (xy 58.42 34.29) (xy 58.42 39.37))
    (stroke (width 0) (type solid) (color 0 0 0 0))
    (uuid be34510d-c08e-47d4-9b1d-c0ac855873da)
  )
  (wire (pts (xy 121.92 66.04) (xy 143.51 66.04))
    (stroke (width 0) (type default) (color 0 0 0 0))
    (uuid c3bd5a33-3291-4ee8-9941-680e0d2e6efc)
  )
  (wire (pts (xy 154.94 48.26) (xy 152.4 48.26))
    (stroke (width 0) (type solid) (color 0 0 0 0))
    (uuid c4656be4-1d4f-4c6a-81c7-9e075a44cff1)
  )
  (wire (pts (xy 104.14 115.57) (xy 104.14 118.11))
    (stroke (width 0) (type solid) (color 0 0 0 0))
    (uuid cfffcec2-60b1-4ea5-b388-27b8aee25f50)
  )
  (wire (pts (xy 255.27 60.96) (xy 264.16 60.96))
    (stroke (width 0) (type solid) (color 0 0 0 0))
    (uuid d3657b2b-4e76-42df-9926-dfe141ed2758)
  )
  (wire (pts (xy 30.48 175.26) (xy 50.8 175.26))
    (stroke (width 0) (type solid) (color 0 0 0 0))
    (uuid d6037c48-df6a-469f-8979-e945035647e1)
  )
  (wire (pts (xy 76.2 57.15) (xy 97.79 57.15))
    (stroke (width 0) (type solid) (color 0 0 0 0))
    (uuid d63d2814-586b-40e4-b9fc-e82e6e98bb7f)
  )
  (wire (pts (xy 76.2 46.99) (xy 97.79 46.99))
    (stroke (width 0) (type solid) (color 0 0 0 0))
    (uuid d6cd2bad-5f4e-4477-965b-8de5ecbe02dc)
  )
  (wire (pts (xy 111.76 160.02) (xy 114.3 160.02))
    (stroke (width 0) (type solid) (color 0 0 0 0))
    (uuid dbf9e78b-3ef7-49e4-a371-358a9d08b9ce)
  )
  (wire (pts (xy 104.14 120.65) (xy 104.14 118.11))
    (stroke (width 0) (type solid) (color 0 0 0 0))
    (uuid de39eb1d-b171-46ee-9b27-cbbd229e8caa)
  )
  (wire (pts (xy 242.57 45.72) (xy 242.57 48.26))
    (stroke (width 0) (type solid) (color 0 0 0 0))
    (uuid df5c1e14-1883-4762-a1ee-de22f0f358ec)
  )
  (wire (pts (xy 214.63 45.72) (xy 232.41 45.72))
    (stroke (width 0) (type solid) (color 0 0 0 0))
    (uuid e2a3e3a1-7c9b-4672-8b8d-cbd471163ec1)
  )
  (wire (pts (xy 124.46 120.65) (xy 127 120.65))
    (stroke (width 0) (type solid) (color 0 0 0 0))
    (uuid e384de41-64ce-4204-bb69-57259025532c)
  )
  (wire (pts (xy 168.91 127) (xy 177.8 127))
    (stroke (width 0) (type default) (color 0 0 0 0))
    (uuid e4ddfdbc-7c46-4869-96a4-349861fc5d83)
  )
  (wire (pts (xy 152.4 38.1) (xy 154.94 38.1))
    (stroke (width 0) (type solid) (color 0 0 0 0))
    (uuid e79d6b7e-80bf-471f-a3c1-719c94c06260)
  )
  (wire (pts (xy 106.68 120.65) (xy 104.14 120.65))
    (stroke (width 0) (type solid) (color 0 0 0 0))
    (uuid e992870e-1b22-4dec-bd9f-97ffe0413b5f)
  )
  (wire (pts (xy 227.33 63.5) (xy 229.87 63.5))
    (stroke (width 0) (type default) (color 0 0 0 0))
    (uuid eba6c7c9-2b53-47aa-ba6a-1a4a78635526)
  )
  (wire (pts (xy 20.32 74.93) (xy 40.64 74.93))
    (stroke (width 0) (type default) (color 0 0 0 0))
    (uuid ec4b286f-865b-4428-8d67-9aba495aca7b)
  )
  (wire (pts (xy 58.42 34.29) (xy 60.96 34.29))
    (stroke (width 0) (type default) (color 0 0 0 0))
    (uuid ef338fa8-0089-4717-a044-53a631b196ca)
  )
  (wire (pts (xy 30.48 167.64) (xy 50.8 167.64))
    (stroke (width 0) (type solid) (color 0 0 0 0))
    (uuid f44529fe-94aa-4ecc-81ef-d6dcfaa87ad4)
  )
  (wire (pts (xy 127 120.65) (xy 127 123.19))
    (stroke (width 0) (type solid) (color 0 0 0 0))
    (uuid f4b85a74-1973-4c4c-9335-a5681972ddc7)
  )
  (wire (pts (xy 58.42 95.25) (xy 58.42 97.79))
    (stroke (width 0) (type solid) (color 0 0 0 0))
    (uuid f5b665f0-d4af-4c6f-97bd-185f6404152d)
  )
  (wire (pts (xy 127 118.11) (xy 129.54 118.11))
    (stroke (width 0) (type solid) (color 0 0 0 0))
    (uuid fbdd5bbf-df44-4096-ab43-ae13f341ed83)
  )

  (text "ICM-42605 IMU" (at 151.13 29.21 0)
    (effects (font (size 1.27 1.27)) (justify left bottom))
    (uuid 99af98e0-cbf9-441c-852d-e0cbfaf1eb79)
  )

  (label "USART1_RX_DEBUG" (at 30.48 170.18 0)
    (effects (font (size 1.27 1.27)) (justify left bottom))
    (uuid 189e02ac-808d-46c0-b06e-a417cb94040e)
  )
  (label "SPI1_MOSI_ICM42605" (at 121.92 58.42 0)
    (effects (font (size 1.27 1.27)) (justify left bottom))
    (uuid 2776a9d9-1f7b-4b36-8c1c-0e29698b6829)
  )
  (label "USART1_RX_DEBUG" (at 20.32 77.47 0)
    (effects (font (size 1.27 1.27)) (justify left bottom))
    (uuid 2af19db5-bfd2-4d70-b450-5d75162e905e)
  )
  (label "FDCAN1_RX" (at 217.17 55.88 0)
    (effects (font (size 1.27 1.27)) (justify left bottom))
    (uuid 37d85bd9-a705-4527-a46a-6e4fdcd10993)
  )
  (label "SPI1_SCK_ICM42605" (at 97.79 54.61 180)
    (effects (font (size 1.27 1.27)) (justify right bottom))
    (uuid 4c151266-f299-4843-81f4-72dc4ee57b95)
  )
  (label "CAN1_P" (at 232.41 123.19 0)
    (effects (font (size 1.27 1.27)) (justify left bottom))
    (uuid 504c453d-df55-4f6f-a118-9349c6dd3f52)
  )
  (label "INT_ICM42605" (at 97.79 49.53 180)
    (effects (font (size 1.27 1.27)) (justify right bottom))
    (uuid 50911e9e-8b8d-496f-8ca0-22f0c4c1f6e3)
  )
  (label "SWDIO" (at 30.48 172.72 0)
    (effects (font (size 1.27 1.27)) (justify left bottom))
    (uuid 5eb7f911-1219-4d3a-8099-0d47db5bf699)
  )
  (label "SPI1_MISO_ICM42605" (at 121.92 60.96 0)
    (effects (font (size 1.27 1.27)) (justify left bottom))
    (uuid 68856ba7-d4b2-4239-b0ba-589615b55a8c)
  )
  (label "INT2_ICM42605" (at 190.5 55.88 180)
    (effects (font (size 1.27 1.27)) (justify right bottom))
    (uuid 68898221-d6dd-42f8-aa0f-c77743b34722)
  )
  (label "FDCAN1_TX" (at 97.79 69.85 180)
    (effects (font (size 1.27 1.27)) (justify right bottom))
    (uuid 68f53a8d-47e0-42ba-bef6-91bbeee53102)
  )
  (label "SPI1_SCK_ICM42605" (at 121.92 55.88 0)
    (effects (font (size 1.27 1.27)) (justify left bottom))
    (uuid 74bbb0f6-6df2-43d4-b6d9-df98a572eac3)
  )
  (label "INT2_ICM42605" (at 97.79 52.07 180)
    (effects (font (size 1.27 1.27)) (justify right bottom))
    (uuid 74f39850-5b59-49e2-8157-f245df11f1bd)
  )
  (label "USART1_TX_DEBUG" (at 30.48 167.64 0)
    (effects (font (size 1.27 1.27)) (justify left bottom))
    (uuid 7c0ddffa-17e3-4c34-b1c2-b6351a2cc949)
  )
  (label "SPI1_MISO_ICM42605" (at 97.79 57.15 180)
    (effects (font (size 1.27 1.27)) (justify right bottom))
    (uuid 85f7aacb-bc64-4e81-a3ba-608d144d95d2)
  )
  (label "SPI1_nCS_ICM42605" (at 121.92 63.5 0)
    (effects (font (size 1.27 1.27)) (justify left bottom))
    (uuid 86074d54-a4d9-403d-8d9d-047d9018e39f)
  )
  (label "CAN1_N" (at 232.41 125.73 0)
    (effects (font (size 1.27 1.27)) (justify left bottom))
    (uuid 8da76026-252e-4734-927f-703d06ff9754)
  )
  (label "CAN1_P" (at 264.16 55.88 180)
    (effects (font (size 1.27 1.27)) (justify right bottom))
    (uuid 91a24060-cf18-40fd-b368-13c3d62154ef)
  )
  (label "USART1_TX_DEBUG" (at 20.32 74.93 0)
    (effects (font (size 1.27 1.27)) (justify left bottom))
    (uuid 936e93f4-6042-4ebb-9dc0-00341034e86d)
  )
  (label "CAN1_N" (at 264.16 60.96 180)
    (effects (font (size 1.27 1.27)) (justify right bottom))
    (uuid 96bcae62-54a4-4017-ba90-ec5c8ae58df7)
  )
  (label "CAN1_N" (at 195.58 127 180)
    (effects (font (size 1.27 1.27)) (justify right bottom))
    (uuid a19a3e1e-78c5-41e6-b990-a9de0096bb00)
  )
  (label "CAN1_P" (at 168.91 127 0)
    (effects (font (size 1.27 1.27)) (justify left bottom))
    (uuid aa7110e5-b6c4-42de-95b6-1ad45ebbf697)
  )
  (label "SWCLK" (at 20.32 82.55 0)
    (effects (font (size 1.27 1.27)) (justify left bottom))
    (uuid b87642d6-f03a-411a-bfb3-21fddf48b5ae)
  )
  (label "SPI1_MOSI_ICM42605" (at 97.79 59.69 180)
    (effects (font (size 1.27 1.27)) (justify right bottom))
    (uuid bcc209c9-cbec-42e5-9ca5-52122fa9f318)
  )
  (label "FDCAN1_RX" (at 97.79 67.31 180)
    (effects (font (size 1.27 1.27)) (justify right bottom))
    (uuid c2274e7b-1250-44f5-921f-3484183dc2e8)
  )
  (label "FDCAN1_TX" (at 217.17 53.34 0)
    (effects (font (size 1.27 1.27)) (justify left bottom))
    (uuid cbd8ee7e-3676-4e2a-848e-fb62087f9d39)
  )
  (label "INT_ICM42605" (at 121.92 66.04 0)
    (effects (font (size 1.27 1.27)) (justify left bottom))
    (uuid cd6634f4-f324-48e3-b0ed-4095d8060763)
  )
  (label "SWCLK" (at 30.48 175.26 0)
    (effects (font (size 1.27 1.27)) (justify left bottom))
    (uuid ce217973-294e-4b1f-b0d8-1b4a5066bdda)
  )
  (label "STATUS" (at 88.9 160.02 0)
    (effects (font (size 1.27 1.27)) (justify left bottom))
    (uuid cf371cb1-94f6-4c7c-bbb6-e2ad8d3f3689)
  )
  (label "SPI1_nCS_ICM42605" (at 97.79 46.99 180)
    (effects (font (size 1.27 1.27)) (justify right bottom))
    (uuid f5035a03-63b3-473d-bb52-2d55ee697af0)
  )
  (label "STATUS" (at 97.79 62.23 180)
    (effects (font (size 1.27 1.27)) (justify right bottom))
    (uuid f950e71e-48fd-484b-a67a-14a31dc30255)
  )
  (label "SWDIO" (at 20.32 80.01 0)
    (effects (font (size 1.27 1.27)) (justify left bottom))
    (uuid fabc9cb1-9dc0-4086-9985-8cfc6d204bb4)
  )

  (symbol (lib_id "Device:C") (at 148.59 48.26 90) (unit 1)
    (in_bom yes) (on_board yes) (fields_autoplaced)
    (uuid 06d74cad-5ff0-4f30-9a6f-8c6ec0b513b8)
    (property "Reference" "C6" (id 0) (at 148.59 41.91 90))
    (property "Value" "0.1uF" (id 1) (at 148.59 44.45 90))
    (property "Footprint" "Capacitor_SMD:C_0402_1005Metric" (id 2) (at 152.4 47.2948 0)
      (effects (font (size 1.27 1.27)) hide)
    )
    (property "Datasheet" "~" (id 3) (at 148.59 48.26 0)
      (effects (font (size 1.27 1.27)) hide)
    )
    (property "LCSC" "C1525" (id 4) (at 148.59 48.26 90)
      (effects (font (size 1.27 1.27)) hide)
    )
    (pin "1" (uuid 16d4c47b-5b52-40b2-85a5-576287a5a8bd))
    (pin "2" (uuid 6840f280-2fba-46d4-9df6-e17f2ac08791))
  )

  (symbol (lib_id "Device:C") (at 148.59 38.1 90) (unit 1)
    (in_bom yes) (on_board yes) (fields_autoplaced)
    (uuid 0800051a-0476-4dab-98fa-42d527d36797)
    (property "Reference" "C5" (id 0) (at 148.59 30.48 90))
    (property "Value" "2.2uF" (id 1) (at 148.59 33.02 90))
    (property "Footprint" "Capacitor_SMD:C_0402_1005Metric" (id 2) (at 152.4 37.1348 0)
      (effects (font (size 1.27 1.27)) hide)
    )
    (property "Datasheet" "~" (id 3) (at 148.59 38.1 0)
      (effects (font (size 1.27 1.27)) hide)
    )
    (property "LCSC" "C23733" (id 4) (at 148.59 38.1 90)
      (effects (font (size 1.27 1.27)) hide)
    )
    (pin "1" (uuid d26312b4-4de4-45f6-a827-b3398c0b906b))
    (pin "2" (uuid 6349b5d0-681d-4f34-b812-feaa66b6fcc7))
  )

  (symbol (lib_id "power:GND") (at 76.2 36.83 0) (unit 1)
    (in_bom yes) (on_board yes) (fields_autoplaced)
    (uuid 08799c7b-cbd4-4fb3-8b30-e07dc5afb67d)
    (property "Reference" "#PWR06" (id 0) (at 76.2 43.18 0)
      (effects (font (size 1.27 1.27)) hide)
    )
    (property "Value" "GND" (id 1) (at 76.2 41.91 0))
    (property "Footprint" "" (id 2) (at 76.2 36.83 0)
      (effects (font (size 1.27 1.27)) hide)
    )
    (property "Datasheet" "" (id 3) (at 76.2 36.83 0)
      (effects (font (size 1.27 1.27)) hide)
    )
    (pin "1" (uuid a273ee6d-a104-4847-8975-8bf238dbc4d8))
  )

  (symbol (lib_id "power:+5V") (at 101.6 118.11 90) (unit 1)
    (in_bom yes) (on_board yes) (fields_autoplaced)
    (uuid 10478608-215d-461d-bcde-e3f9e9a794cd)
    (property "Reference" "#PWR07" (id 0) (at 105.41 118.11 0)
      (effects (font (size 1.27 1.27)) hide)
    )
    (property "Value" "+5V" (id 1) (at 97.79 118.7449 90)
      (effects (font (size 1.27 1.27)) (justify left))
    )
    (property "Footprint" "" (id 2) (at 101.6 118.11 0)
      (effects (font (size 1.27 1.27)) hide)
    )
    (property "Datasheet" "" (id 3) (at 101.6 118.11 0)
      (effects (font (size 1.27 1.27)) hide)
    )
    (pin "1" (uuid 59314e5a-7df8-46b8-a702-8434592d8cc8))
  )

  (symbol (lib_id "power:GND") (at 142.24 38.1 270) (unit 1)
    (in_bom yes) (on_board yes) (fields_autoplaced)
    (uuid 12e6a1a7-b0f9-4a64-a94d-7872e5e6da44)
    (property "Reference" "#PWR08" (id 0) (at 135.89 38.1 0)
      (effects (font (size 1.27 1.27)) hide)
    )
    (property "Value" "GND" (id 1) (at 138.43 38.7349 90)
      (effects (font (size 1.27 1.27)) (justify right))
    )
    (property "Footprint" "" (id 2) (at 142.24 38.1 0)
      (effects (font (size 1.27 1.27)) hide)
    )
    (property "Datasheet" "" (id 3) (at 142.24 38.1 0)
      (effects (font (size 1.27 1.27)) hide)
    )
    (pin "1" (uuid d8c509a8-ebbf-4131-862d-690449a49ec6))
  )

  (symbol (lib_id "power:+5V") (at 163.83 105.41 90) (unit 1)
    (in_bom yes) (on_board yes) (fields_autoplaced)
    (uuid 18ebc53b-830b-45d6-8b95-9eb872754453)
    (property "Reference" "#PWR022" (id 0) (at 167.64 105.41 0)
      (effects (font (size 1.27 1.27)) hide)
    )
    (property "Value" "+5V" (id 1) (at 160.02 106.0449 90)
      (effects (font (size 1.27 1.27)) (justify left))
    )
    (property "Footprint" "" (id 2) (at 163.83 105.41 0)
      (effects (font (size 1.27 1.27)) hide)
    )
    (property "Datasheet" "" (id 3) (at 163.83 105.41 0)
      (effects (font (size 1.27 1.27)) hide)
    )
    (pin "1" (uuid 1ec46a35-d712-4ff3-9564-9de88e4fc561))
  )

  (symbol (lib_id "BL9161:BL9161-33BARN") (at 115.57 119.38 0) (unit 1)
    (in_bom yes) (on_board yes)
    (uuid 21d1d343-8bbd-4231-b891-84df2915c93a)
    (property "Reference" "U2" (id 0) (at 115.57 127 0))
    (property "Value" "BL9161-33BARN" (id 1) (at 115.57 124.46 0))
    (property "Footprint" "Package_TO_SOT_SMD:SOT-23-5" (id 2) (at 92.71 107.95 0)
      (effects (font (size 1.27 1.27)) hide)
    )
    (property "Datasheet" "" (id 3) (at 92.71 107.95 0)
      (effects (font (size 1.27 1.27)) hide)
    )
    (pin "1" (uuid 61081375-64ba-4d0c-94ca-ec30a67823ce))
    (pin "2" (uuid 759e3c5e-0397-4836-8767-495608a2d5cb))
    (pin "3" (uuid 5f69d0a7-7c20-42da-a65e-0e7b4561cf63))
    (pin "5" (uuid 3734387d-344c-4dc3-9692-04b3d047a449))
  )

  (symbol (lib_id "power:GND") (at 242.57 71.12 0) (unit 1)
    (in_bom yes) (on_board yes) (fields_autoplaced)
    (uuid 40093782-8d1b-4eea-8df3-3a17850e73ca)
    (property "Reference" "#PWR033" (id 0) (at 242.57 77.47 0)
      (effects (font (size 1.27 1.27)) hide)
    )
    (property "Value" "GND" (id 1) (at 242.57 76.2 0))
    (property "Footprint" "" (id 2) (at 242.57 71.12 0)
      (effects (font (size 1.27 1.27)) hide)
    )
    (property "Datasheet" "" (id 3) (at 242.57 71.12 0)
      (effects (font (size 1.27 1.27)) hide)
    )
    (pin "1" (uuid 29353d86-04d6-48ac-8533-0607bc5b5a0f))
  )

  (symbol (lib_id "Device:C") (at 64.77 34.29 90) (unit 1)
    (in_bom yes) (on_board yes) (fields_autoplaced)
    (uuid 4dcd288c-0a7d-43a0-b00c-20ef4c127592)
    (property "Reference" "C2" (id 0) (at 64.77 26.67 90))
    (property "Value" "4.7uF" (id 1) (at 64.77 29.21 90))
    (property "Footprint" "Capacitor_SMD:C_0402_1005Metric" (id 2) (at 68.58 33.3248 0)
      (effects (font (size 1.27 1.27)) hide)
    )
    (property "Datasheet" "~" (id 3) (at 64.77 34.29 0)
      (effects (font (size 1.27 1.27)) hide)
    )
    (pin "1" (uuid 064e643d-ec5c-4226-9d23-61ba2f028449))
    (pin "2" (uuid 211dfd37-e33e-470c-b1a8-653f93495a72))
  )

  (symbol (lib_id "ICM42605:ICM42605") (at 158.75 60.96 0) (unit 1)
    (in_bom yes) (on_board yes) (fields_autoplaced)
    (uuid 57c19f28-871f-49e6-828a-40fd32888220)
    (property "Reference" "U3" (id 0) (at 160.7694 71.12 0)
      (effects (font (size 1.27 1.27)) (justify left))
    )
    (property "Value" "ICM42605" (id 1) (at 160.7694 73.66 0)
      (effects (font (size 1.27 1.27)) (justify left))
    )
    (property "Footprint" "Package_LGA:LGA-14_3x2.5mm_P0.5mm_LayoutBorder3x4y" (id 2) (at 137.16 29.21 0)
      (effects (font (size 1.27 1.27)) hide)
    )
    (property "Datasheet" "" (id 3) (at 137.16 29.21 0)
      (effects (font (size 1.27 1.27)) hide)
    )
    (pin "1" (uuid 6becdf84-f3e2-43f7-8d3f-c42f5a5ee206))
    (pin "10" (uuid 4eecb89c-602a-405a-9581-c7de48f1bfea))
    (pin "11" (uuid 50fbf6cc-85f4-46c7-991c-01ed4ce42876))
    (pin "12" (uuid 05999bde-d773-47c3-bccb-5941741c5fd2))
    (pin "13" (uuid feadd54d-df28-48f9-962a-ca1cd94a4a53))
    (pin "14" (uuid 8f7b2ad3-9257-4be1-8c2c-fd6f3ecfa93b))
    (pin "2" (uuid a07f4319-aa44-402c-9b3f-73b4aaba1ad1))
    (pin "3" (uuid 94a2fd04-9377-45a7-9971-95ba08d636f6))
    (pin "4" (uuid 0d7b7781-1e19-4ed1-8a52-e9eaae4de78f))
    (pin "5" (uuid eead3f26-5ba4-467f-a991-5657330d769b))
    (pin "6" (uuid 67a9ee2d-5fd9-4053-8159-e7d9a029fa36))
    (pin "7" (uuid f8ef42a1-ab60-430f-a2a0-0e03dddcbed8))
    (pin "8" (uuid 14bfe8d8-58b0-4ea6-9ff9-b7b50a03401c))
    (pin "9" (uuid 72a0d622-a918-465c-be5b-ca6c9ae00ba0))
  )

  (symbol (lib_id "power:+5V") (at 242.57 43.18 0) (unit 1)
    (in_bom yes) (on_board yes) (fields_autoplaced)
    (uuid 58baebd4-a88f-41b1-8268-909e2e11d7e1)
    (property "Reference" "#PWR032" (id 0) (at 242.57 46.99 0)
      (effects (font (size 1.27 1.27)) hide)
    )
    (property "Value" "+5V" (id 1) (at 242.57 39.37 0))
    (property "Footprint" "" (id 2) (at 242.57 43.18 0)
      (effects (font (size 1.27 1.27)) hide)
    )
    (property "Datasheet" "" (id 3) (at 242.57 43.18 0)
      (effects (font (size 1.27 1.27)) hide)
    )
    (pin "1" (uuid ac9dce3d-3e0e-40bc-ba22-41a6f8525cae))
  )

  (symbol (lib_id "Connector_Generic:Conn_01x04") (at 246.38 123.19 0) (unit 1)
    (in_bom yes) (on_board yes) (fields_autoplaced)
    (uuid 5907d37c-8b28-4eeb-811a-da2e3d7487b7)
    (property "Reference" "J3" (id 0) (at 248.92 123.8249 0)
      (effects (font (size 1.27 1.27)) (justify left))
    )
    (property "Value" "Conn_01x04" (id 1) (at 248.92 126.3649 0)
      (effects (font (size 1.27 1.27)) (justify left))
    )
    (property "Footprint" "Connector_JST:JST_GH_SM04B-GHS-TB_1x04-1MP_P1.25mm_Horizontal" (id 2) (at 246.38 123.19 0)
      (effects (font (size 1.27 1.27)) hide)
    )
    (property "Datasheet" "~" (id 3) (at 246.38 123.19 0)
      (effects (font (size 1.27 1.27)) hide)
    )
    (pin "1" (uuid ea428c77-6f09-4f44-801a-a9e936c11199))
    (pin "2" (uuid d2c808fd-7cdf-4a1a-b16c-0a616cec2910))
    (pin "3" (uuid 65b90652-8b1f-477c-a762-3016bd737ec7))
    (pin "4" (uuid 4bfebb23-d4c0-41e7-a023-615b75859532))
  )

  (symbol (lib_id "power:GND") (at 175.26 48.26 90) (unit 1)
    (in_bom yes) (on_board yes) (fields_autoplaced)
    (uuid 59bf8035-279b-4620-a45f-2ffcd8139b4c)
    (property "Reference" "#PWR016" (id 0) (at 181.61 48.26 0)
      (effects (font (size 1.27 1.27)) hide)
    )
    (property "Value" "GND" (id 1) (at 179.07 48.8949 90)
      (effects (font (size 1.27 1.27)) (justify right))
    )
    (property "Footprint" "" (id 2) (at 175.26 48.26 0)
      (effects (font (size 1.27 1.27)) hide)
    )
    (property "Datasheet" "" (id 3) (at 175.26 48.26 0)
      (effects (font (size 1.27 1.27)) hide)
    )
    (pin "1" (uuid 03d2247d-3e11-4a28-b1ab-c8a42846b027))
  )

  (symbol (lib_id "power:GND") (at 238.76 130.81 0) (unit 1)
    (in_bom yes) (on_board yes) (fields_autoplaced)
    (uuid 5e19bb1f-24f7-475a-badf-bb57682f5e9c)
    (property "Reference" "#PWR031" (id 0) (at 238.76 137.16 0)
      (effects (font (size 1.27 1.27)) hide)
    )
    (property "Value" "GND" (id 1) (at 238.76 135.89 0))
    (property "Footprint" "" (id 2) (at 238.76 130.81 0)
      (effects (font (size 1.27 1.27)) hide)
    )
    (property "Datasheet" "" (id 3) (at 238.76 130.81 0)
      (effects (font (size 1.27 1.27)) hide)
    )
    (pin "1" (uuid 674b585d-b39b-43cb-a8b8-a6d623c5cff5))
  )

  (symbol (lib_id "power:GND") (at 127 123.19 0) (unit 1)
    (in_bom yes) (on_board yes) (fields_autoplaced)
    (uuid 677e3d29-cf79-4a63-b581-d8c6dde171ef)
    (property "Reference" "#PWR014" (id 0) (at 127 129.54 0)
      (effects (font (size 1.27 1.27)) hide)
    )
    (property "Value" "GND" (id 1) (at 127 128.27 0))
    (property "Footprint" "" (id 2) (at 127 123.19 0)
      (effects (font (size 1.27 1.27)) hide)
    )
    (property "Datasheet" "" (id 3) (at 127 123.19 0)
      (effects (font (size 1.27 1.27)) hide)
    )
    (pin "1" (uuid 6e5c0760-8d19-47f1-8096-d5835170ca7f))
  )

  (symbol (lib_id "power:+3V3") (at 154.94 35.56 0) (unit 1)
    (in_bom yes) (on_board yes) (fields_autoplaced)
    (uuid 6bf01f55-e138-4fb1-8c7a-15cb7e56224f)
    (property "Reference" "#PWR0102" (id 0) (at 154.94 39.37 0)
      (effects (font (size 1.27 1.27)) hide)
    )
    (property "Value" "+3V3" (id 1) (at 154.94 30.48 0))
    (property "Footprint" "" (id 2) (at 154.94 35.56 0)
      (effects (font (size 1.27 1.27)) hide)
    )
    (property "Datasheet" "" (id 3) (at 154.94 35.56 0)
      (effects (font (size 1.27 1.27)) hide)
    )
    (pin "1" (uuid 30295594-b2f3-4a17-9f04-0e077c5807e9))
  )

  (symbol (lib_id "power:+5V") (at 238.76 118.11 0) (unit 1)
    (in_bom yes) (on_board yes) (fields_autoplaced)
    (uuid 74a8e57b-0e0b-4c13-9110-b64b7628bacf)
    (property "Reference" "#PWR030" (id 0) (at 238.76 121.92 0)
      (effects (font (size 1.27 1.27)) hide)
    )
    (property "Value" "+5V" (id 1) (at 238.76 114.3 0))
    (property "Footprint" "" (id 2) (at 238.76 118.11 0)
      (effects (font (size 1.27 1.27)) hide)
    )
    (property "Datasheet" "" (id 3) (at 238.76 118.11 0)
      (effects (font (size 1.27 1.27)) hide)
    )
    (pin "1" (uuid 781d46b6-dd48-4b46-a769-663a09f437be))
  )

  (symbol (lib_id "Device:C") (at 104.14 111.76 0) (unit 1)
    (in_bom yes) (on_board yes) (fields_autoplaced)
    (uuid 7bb88243-5998-47ef-b592-913b94c1ec53)
    (property "Reference" "C3" (id 0) (at 107.95 111.1249 0)
      (effects (font (size 1.27 1.27)) (justify left))
    )
    (property "Value" "1uF" (id 1) (at 107.95 113.6649 0)
      (effects (font (size 1.27 1.27)) (justify left))
    )
    (property "Footprint" "Capacitor_SMD:C_0402_1005Metric" (id 2) (at 105.1052 115.57 0)
      (effects (font (size 1.27 1.27)) hide)
    )
    (property "Datasheet" "~" (id 3) (at 104.14 111.76 0)
      (effects (font (size 1.27 1.27)) hide)
    )
    (pin "1" (uuid 63bd22e0-6e47-4ea4-a2e4-052030772de7))
    (pin "2" (uuid bb078f24-f3ce-4ed3-a51a-87bb9ce5a715))
  )

  (symbol (lib_id "power:GND") (at 158.75 73.66 0) (unit 1)
    (in_bom yes) (on_board yes) (fields_autoplaced)
    (uuid 856fc909-ae51-4e24-b218-213c9a089ffd)
    (property "Reference" "#PWR012" (id 0) (at 158.75 80.01 0)
      (effects (font (size 1.27 1.27)) hide)
    )
    (property "Value" "GND" (id 1) (at 158.75 78.74 0))
    (property "Footprint" "" (id 2) (at 158.75 73.66 0)
      (effects (font (size 1.27 1.27)) hide)
    )
    (property "Datasheet" "" (id 3) (at 158.75 73.66 0)
      (effects (font (size 1.27 1.27)) hide)
    )
    (pin "1" (uuid 3fb45b11-c05e-4d6c-9a5a-743775abced5))
  )

  (symbol (lib_id "power:GND") (at 142.24 48.26 270) (unit 1)
    (in_bom yes) (on_board yes) (fields_autoplaced)
    (uuid 860d6853-74c8-4924-9200-1571e894dc8b)
    (property "Reference" "#PWR011" (id 0) (at 135.89 48.26 0)
      (effects (font (size 1.27 1.27)) hide)
    )
    (property "Value" "GND" (id 1) (at 138.43 48.8949 90)
      (effects (font (size 1.27 1.27)) (justify right))
    )
    (property "Footprint" "" (id 2) (at 142.24 48.26 0)
      (effects (font (size 1.27 1.27)) hide)
    )
    (property "Datasheet" "" (id 3) (at 142.24 48.26 0)
      (effects (font (size 1.27 1.27)) hide)
    )
    (pin "1" (uuid 853be22d-282c-4e52-bd9b-a8f63211528e))
  )

  (symbol (lib_id "power:PWR_FLAG") (at 166.37 105.41 270) (unit 1)
    (in_bom yes) (on_board yes) (fields_autoplaced)
    (uuid 86992179-f451-4d4f-bc66-c380c234d86c)
    (property "Reference" "#FLG02" (id 0) (at 168.275 105.41 0)
      (effects (font (size 1.27 1.27)) hide)
    )
    (property "Value" "PWR_FLAG" (id 1) (at 170.18 106.0449 90)
      (effects (font (size 1.27 1.27)) (justify left))
    )
    (property "Footprint" "" (id 2) (at 166.37 105.41 0)
      (effects (font (size 1.27 1.27)) hide)
    )
    (property "Datasheet" "~" (id 3) (at 166.37 105.41 0)
      (effects (font (size 1.27 1.27)) hide)
    )
    (pin "1" (uuid 45f53bf0-40c0-4d78-89de-ac7401108de9))
  )

  (symbol (lib_id "Connector_Generic:Conn_01x06") (at 55.88 170.18 0) (unit 1)
    (in_bom yes) (on_board yes) (fields_autoplaced)
    (uuid 870579d4-a3f8-4e85-b89e-818f843abdcb)
    (property "Reference" "J1" (id 0) (at 58.42 170.8149 0)
      (effects (font (size 1.27 1.27)) (justify left))
    )
    (property "Value" "Conn_01x06" (id 1) (at 58.42 173.3549 0)
      (effects (font (size 1.27 1.27)) (justify left))
    )
    (property "Footprint" "Connector_JST:JST_SH_SM06B-SRSS-TB_1x06-1MP_P1.00mm_Horizontal" (id 2) (at 55.88 170.18 0)
      (effects (font (size 1.27 1.27)) hide)
    )
    (property "Datasheet" "~" (id 3) (at 55.88 170.18 0)
      (effects (font (size 1.27 1.27)) hide)
    )
    (pin "1" (uuid 01d5f9da-595e-40b9-b460-9b48ff09cfba))
    (pin "2" (uuid 289468c3-365b-4406-ae97-4ef47442f96f))
    (pin "3" (uuid 9cdfd29f-704e-4e22-ab5e-4bf3a03b3bc3))
    (pin "4" (uuid d932d294-d2fb-47e1-93db-4bffadfb5d60))
    (pin "5" (uuid f3976af9-1d5c-491a-ab6b-d41a4e155189))
    (pin "6" (uuid 3be3e187-265d-4897-bee4-cc3b79f28e47))
  )

  (symbol (lib_id "Device:C") (at 52.07 34.29 90) (unit 1)
    (in_bom yes) (on_board yes) (fields_autoplaced)
    (uuid 87e986de-a910-4b3e-a73d-e8ed9ffeaed5)
    (property "Reference" "C1" (id 0) (at 52.07 26.67 90))
    (property "Value" "0.1uF" (id 1) (at 52.07 29.21 90))
    (property "Footprint" "Capacitor_SMD:C_0402_1005Metric" (id 2) (at 55.88 33.3248 0)
      (effects (font (size 1.27 1.27)) hide)
    )
    (property "Datasheet" "~" (id 3) (at 52.07 34.29 0)
      (effects (font (size 1.27 1.27)) hide)
    )
    (pin "1" (uuid 41a7afab-7a01-43f1-bd15-6d9f95d7f846))
    (pin "2" (uuid 77bf8cf1-d825-46b8-b33e-9597dc7abd8c))
  )

  (symbol (lib_id "power:GND") (at 227.33 66.04 0) (unit 1)
    (in_bom yes) (on_board yes) (fields_autoplaced)
    (uuid 8cb461a9-2710-496b-a47a-72dffd0f1af4)
    (property "Reference" "#PWR027" (id 0) (at 227.33 72.39 0)
      (effects (font (size 1.27 1.27)) hide)
    )
    (property "Value" "GND" (id 1) (at 227.33 71.12 0))
    (property "Footprint" "" (id 2) (at 227.33 66.04 0)
      (effects (font (size 1.27 1.27)) hide)
    )
    (property "Datasheet" "" (id 3) (at 227.33 66.04 0)
      (effects (font (size 1.27 1.27)) hide)
    )
    (pin "1" (uuid ead73b10-597e-4d4e-85be-bfb0910f86fb))
  )

  (symbol (lib_id "power:PWR_FLAG") (at 166.37 101.6 270) (unit 1)
    (in_bom yes) (on_board yes) (fields_autoplaced)
    (uuid 99d273d0-ffea-439a-b2bf-064aa1ff833e)
    (property "Reference" "#FLG01" (id 0) (at 168.275 101.6 0)
      (effects (font (size 1.27 1.27)) hide)
    )
    (property "Value" "PWR_FLAG" (id 1) (at 170.18 102.2349 90)
      (effects (font (size 1.27 1.27)) (justify left))
    )
    (property "Footprint" "" (id 2) (at 166.37 101.6 0)
      (effects (font (size 1.27 1.27)) hide)
    )
    (property "Datasheet" "~" (id 3) (at 166.37 101.6 0)
      (effects (font (size 1.27 1.27)) hide)
    )
    (pin "1" (uuid c51fdc69-b32f-4313-ba75-2df143c3771b))
  )

  (symbol (lib_id "power:+3V3") (at 129.54 118.11 270) (unit 1)
    (in_bom yes) (on_board yes) (fields_autoplaced)
    (uuid 9ae54a40-6553-44f8-a756-baebb6b1f263)
    (property "Reference" "#PWR015" (id 0) (at 125.73 118.11 0)
      (effects (font (size 1.27 1.27)) hide)
    )
    (property "Value" "+3V3" (id 1) (at 133.35 118.7449 90)
      (effects (font (size 1.27 1.27)) (justify left))
    )
    (property "Footprint" "" (id 2) (at 129.54 118.11 0)
      (effects (font (size 1.27 1.27)) hide)
    )
    (property "Datasheet" "" (id 3) (at 129.54 118.11 0)
      (effects (font (size 1.27 1.27)) hide)
    )
    (pin "1" (uuid e3ad0d71-2256-4845-85d6-3db3ad2f3fde))
  )

  (symbol (lib_id "power:GND") (at 40.64 36.83 0) (mirror y) (unit 1)
    (in_bom yes) (on_board yes) (fields_autoplaced)
    (uuid 9be526ac-c03b-4265-9410-285135c118f4)
    (property "Reference" "#PWR01" (id 0) (at 40.64 43.18 0)
      (effects (font (size 1.27 1.27)) hide)
    )
    (property "Value" "GND" (id 1) (at 40.64 41.91 0))
    (property "Footprint" "" (id 2) (at 40.64 36.83 0)
      (effects (font (size 1.27 1.27)) hide)
    )
    (property "Datasheet" "" (id 3) (at 40.64 36.83 0)
      (effects (font (size 1.27 1.27)) hide)
    )
    (pin "1" (uuid 97d8ac9f-fdaa-4304-b2dc-5bdbc4bf72cf))
  )

  (symbol (lib_id "Device:C") (at 168.91 48.26 90) (unit 1)
    (in_bom yes) (on_board yes) (fields_autoplaced)
    (uuid a0cc2399-4370-4b21-8343-c4e1b4b56094)
    (property "Reference" "C7" (id 0) (at 168.91 41.91 90))
    (property "Value" "10nF" (id 1) (at 168.91 44.45 90))
    (property "Footprint" "Capacitor_SMD:C_0402_1005Metric" (id 2) (at 172.72 47.2948 0)
      (effects (font (size 1.27 1.27)) hide)
    )
    (property "Datasheet" "~" (id 3) (at 168.91 48.26 0)
      (effects (font (size 1.27 1.27)) hide)
    )
    (property "LCSC" "C15195" (id 4) (at 168.91 48.26 0)
      (effects (font (size 1.27 1.27)) hide)
    )
    (pin "1" (uuid e8eaece3-43f0-48e2-84a3-912dd8d10af7))
    (pin "2" (uuid 2e805643-81bd-483f-a371-c6d0e33d63b1))
  )

  (symbol (lib_id "power:+3V3") (at 48.26 162.56 0) (unit 1)
    (in_bom yes) (on_board yes) (fields_autoplaced)
    (uuid a2a39225-8968-4f0e-a32f-1067ad7d1002)
    (property "Reference" "#PWR02" (id 0) (at 48.26 166.37 0)
      (effects (font (size 1.27 1.27)) hide)
    )
    (property "Value" "+3V3" (id 1) (at 48.26 158.75 0))
    (property "Footprint" "" (id 2) (at 48.26 162.56 0)
      (effects (font (size 1.27 1.27)) hide)
    )
    (property "Datasheet" "" (id 3) (at 48.26 162.56 0)
      (effects (font (size 1.27 1.27)) hide)
    )
    (pin "1" (uuid deca1440-ae9e-4345-a346-fdd605e9e1c4))
  )

  (symbol (lib_id "Device:R") (at 118.11 160.02 90) (unit 1)
    (in_bom yes) (on_board yes)
    (uuid a73f4f5a-6e4d-472e-9b51-954e3d116bd7)
    (property "Reference" "R1" (id 0) (at 118.11 157.48 90))
    (property "Value" "1K" (id 1) (at 118.11 160.02 90))
    (property "Footprint" "Resistor_SMD:R_0402_1005Metric" (id 2) (at 118.11 161.798 90)
      (effects (font (size 1.27 1.27)) hide)
    )
    (property "Datasheet" "~" (id 3) (at 118.11 160.02 0)
      (effects (font (size 1.27 1.27)) hide)
    )
    (pin "1" (uuid 1c98bb65-fd91-471b-bdef-ddd533629105))
    (pin "2" (uuid a1980470-c6d3-47b4-affb-fe9502f27b90))
  )

  (symbol (lib_id "power:+3V3") (at 212.09 60.96 90) (unit 1)
    (in_bom yes) (on_board yes) (fields_autoplaced)
    (uuid a99e8602-ce26-46af-bf6d-74d87543de6f)
    (property "Reference" "#PWR026" (id 0) (at 215.9 60.96 0)
      (effects (font (size 1.27 1.27)) hide)
    )
    (property "Value" "+3V3" (id 1) (at 208.28 61.5949 90)
      (effects (font (size 1.27 1.27)) (justify left))
    )
    (property "Footprint" "" (id 2) (at 212.09 60.96 0)
      (effects (font (size 1.27 1.27)) hide)
    )
    (property "Datasheet" "" (id 3) (at 212.09 60.96 0)
      (effects (font (size 1.27 1.27)) hide)
    )
    (pin "1" (uuid 3b6dd4ee-11c2-4737-a9fa-7ec95710931c))
  )

  (symbol (lib_id "Device:C") (at 248.92 45.72 90) (unit 1)
    (in_bom yes) (on_board yes) (fields_autoplaced)
    (uuid b77a25d4-3a0d-4247-9d5e-f5f4027f7c21)
    (property "Reference" "C10" (id 0) (at 248.92 39.37 90))
    (property "Value" "47nF" (id 1) (at 248.92 41.91 90))
    (property "Footprint" "Capacitor_SMD:C_0402_1005Metric" (id 2) (at 252.73 44.7548 0)
      (effects (font (size 1.27 1.27)) hide)
    )
    (property "Datasheet" "~" (id 3) (at 248.92 45.72 0)
      (effects (font (size 1.27 1.27)) hide)
    )
    (pin "1" (uuid 5088530e-80fe-4d53-936c-e65a83b4e333))
    (pin "2" (uuid 96fc4956-5228-4273-a21c-de2d56d81526))
  )

  (symbol (lib_id "power:GND") (at 255.27 45.72 90) (unit 1)
    (in_bom yes) (on_board yes) (fields_autoplaced)
    (uuid c25873a0-a879-4098-a3da-0cee0d184bec)
    (property "Reference" "#PWR034" (id 0) (at 261.62 45.72 0)
      (effects (font (size 1.27 1.27)) hide)
    )
    (property "Value" "GND" (id 1) (at 259.08 46.3549 90)
      (effects (font (size 1.27 1.27)) (justify right))
    )
    (property "Footprint" "" (id 2) (at 255.27 45.72 0)
      (effects (font (size 1.27 1.27)) hide)
    )
    (property "Datasheet" "" (id 3) (at 255.27 45.72 0)
      (effects (font (size 1.27 1.27)) hide)
    )
    (pin "1" (uuid 698a101f-2fee-4678-b5fc-9fdf32270aaa))
  )

  (symbol (lib_id "Interface_CAN_LIN:TJA1051T-3") (at 242.57 58.42 0) (unit 1)
    (in_bom yes) (on_board yes)
    (uuid c3ace563-a15c-4758-acd6-49efd4d3fa11)
    (property "Reference" "U4" (id 0) (at 236.22 49.53 0))
    (property "Value" "TJA1051T-3" (id 1) (at 250.19 49.53 0))
    (property "Footprint" "Package_SO:SOIC-8_3.9x4.9mm_P1.27mm" (id 2) (at 242.57 71.12 0)
      (effects (font (size 1.27 1.27) italic) hide)
    )
    (property "Datasheet" "http://www.nxp.com/documents/data_sheet/TJA1051.pdf" (id 3) (at 242.57 58.42 0)
      (effects (font (size 1.27 1.27)) hide)
    )
    (pin "1" (uuid 9ea22c32-83ab-4a20-a2e6-26acf984ba9a))
    (pin "2" (uuid f371ad47-08cf-4381-9cba-ad7e9adace19))
    (pin "3" (uuid 5fe1f4da-807c-4005-8dc9-2f51ad6c96dc))
    (pin "4" (uuid 6629f6ae-dfc4-4b63-8db6-b430726f9943))
    (pin "5" (uuid 2e36ffe2-773f-443f-87e2-fa64231645df))
    (pin "6" (uuid daab5cff-b0ef-4c22-91c1-77c143752bc6))
    (pin "7" (uuid 774ee617-d106-4453-8f24-9a7825d0e73c))
    (pin "8" (uuid ad7eab90-e53d-4f4f-b511-039f3307ba47))
  )

  (symbol (lib_id "power:GND") (at 48.26 180.34 0) (unit 1)
    (in_bom yes) (on_board yes) (fields_autoplaced)
    (uuid c4407a4a-bf33-4747-81ad-6fa55417949a)
    (property "Reference" "#PWR03" (id 0) (at 48.26 186.69 0)
      (effects (font (size 1.27 1.27)) hide)
    )
    (property "Value" "GND" (id 1) (at 48.26 185.42 0))
    (property "Footprint" "" (id 2) (at 48.26 180.34 0)
      (effects (font (size 1.27 1.27)) hide)
    )
    (property "Datasheet" "" (id 3) (at 48.26 180.34 0)
      (effects (font (size 1.27 1.27)) hide)
    )
    (pin "1" (uuid ade206d2-9ef8-4d83-a80d-0f6095ba51ec))
  )

  (symbol (lib_id "power:GND") (at 124.46 160.02 90) (unit 1)
    (in_bom yes) (on_board yes) (fields_autoplaced)
    (uuid cece7abf-dbc4-4c81-9d53-0352d507d02c)
    (property "Reference" "#PWR010" (id 0) (at 130.81 160.02 0)
      (effects (font (size 1.27 1.27)) hide)
    )
    (property "Value" "GND" (id 1) (at 128.27 160.6549 90)
      (effects (font (size 1.27 1.27)) (justify right))
    )
    (property "Footprint" "" (id 2) (at 124.46 160.02 0)
      (effects (font (size 1.27 1.27)) hide)
    )
    (property "Datasheet" "" (id 3) (at 124.46 160.02 0)
      (effects (font (size 1.27 1.27)) hide)
    )
    (pin "1" (uuid 2b671a5b-c639-4d97-8fe9-ebf349c6496c))
  )

  (symbol (lib_id "power:GND") (at 163.83 101.6 270) (unit 1)
    (in_bom yes) (on_board yes) (fields_autoplaced)
    (uuid dad47b65-c67c-4ee1-b84b-fe8024daa1d4)
    (property "Reference" "#PWR021" (id 0) (at 157.48 101.6 0)
      (effects (font (size 1.27 1.27)) hide)
    )
    (property "Value" "GND" (id 1) (at 160.02 102.2349 90)
      (effects (font (size 1.27 1.27)) (justify right))
    )
    (property "Footprint" "" (id 2) (at 163.83 101.6 0)
      (effects (font (size 1.27 1.27)) hide)
    )
    (property "Datasheet" "" (id 3) (at 163.83 101.6 0)
      (effects (font (size 1.27 1.27)) hide)
    )
    (pin "1" (uuid 71eabf77-d308-4e49-a231-22b400b2331e))
  )

  (symbol (lib_id "power:+3V3") (at 162.56 45.72 0) (unit 1)
    (in_bom yes) (on_board yes) (fields_autoplaced)
    (uuid db60161d-177f-4767-bd72-74e70e70ce89)
    (property "Reference" "#PWR0101" (id 0) (at 162.56 49.53 0)
      (effects (font (size 1.27 1.27)) hide)
    )
    (property "Value" "+3V3" (id 1) (at 162.56 40.64 0))
    (property "Footprint" "" (id 2) (at 162.56 45.72 0)
      (effects (font (size 1.27 1.27)) hide)
    )
    (property "Datasheet" "" (id 3) (at 162.56 45.72 0)
      (effects (font (size 1.27 1.27)) hide)
    )
    (pin "1" (uuid a47337c1-4b80-4022-93ab-c03d0b969907))
  )

  (symbol (lib_id "STM32G0:STM32G0B1KxT") (at 58.42 67.31 0) (unit 1)
    (in_bom yes) (on_board yes)
    (uuid dc8df503-c5d3-472d-9ab8-3dfe9a79b93e)
    (property "Reference" "U1" (id 0) (at 50.8 40.64 0))
    (property "Value" "STM32G0B1KxT" (id 1) (at 67.31 40.64 0))
    (property "Footprint" "Package_QFP:LQFP-32_7x7mm_P0.8mm" (id 2) (at 55.88 93.98 0)
      (effects (font (size 1.27 1.27)) (justify right) hide)
    )
    (property "Datasheet" "https://www.st.com/resource/en/datasheet/stm32g071kb.pdf" (id 3) (at 58.42 67.31 0)
      (effects (font (size 1.27 1.27)) hide)
    )
    (pin "1" (uuid 2700c106-02eb-4f8e-aedb-87ec1863fa7b))
    (pin "10" (uuid 45920cd1-a483-40b5-b7e8-79d016df882a))
    (pin "11" (uuid d94447f3-8959-48a5-a128-14cd1a440e04))
    (pin "12" (uuid 6c61a509-a062-4dde-9342-bc7aff96d88e))
    (pin "13" (uuid 2295af9e-64ec-440b-840f-94c96345d387))
    (pin "14" (uuid fdb9bc3f-86d7-42a0-9213-a0ac1ada5eea))
    (pin "15" (uuid d90b794e-3baf-4d53-b7b4-7a4ab5e65547))
    (pin "16" (uuid 76674d84-2332-42b9-8609-49e1783da619))
    (pin "17" (uuid 782b035d-e367-4fce-8939-d1d441bf228f))
    (pin "18" (uuid beca0a7f-e627-41bb-b94d-b67d3a8b20e0))
    (pin "19" (uuid f6dc2a45-657c-43e0-9107-bdeb35df376e))
    (pin "2" (uuid d0b769b6-06ed-47a7-ada4-9994db5d30d1))
    (pin "20" (uuid 6c8df531-706b-4951-94e8-4918e129645b))
    (pin "21" (uuid 5583639e-4df1-4455-bf22-e7bdb0462e42))
    (pin "22" (uuid 4c78f92e-4023-4baf-a010-0b2161b09fda))
    (pin "23" (uuid ba7f3f5f-62c7-45c0-891d-0a4b7bd0277b))
    (pin "24" (uuid 53d7f7a6-afd0-4267-8208-86036defbf0d))
    (pin "25" (uuid db881d36-3c8e-4335-85df-84c38fe30351))
    (pin "26" (uuid 507b6d9d-2520-47bc-95ee-04688a6996fa))
    (pin "27" (uuid e0270fae-0352-488f-a52f-f0544135488f))
    (pin "28" (uuid 909c12e2-2fa8-4e1a-ad9b-d24a19162fd5))
    (pin "29" (uuid 3863d2d3-afb3-41a1-aa7f-b4e921929900))
    (pin "3" (uuid 35806bee-5f0b-419e-80cf-50c376089579))
    (pin "30" (uuid 60526c9e-c898-4b14-9b80-6e4be09a754f))
    (pin "31" (uuid 544e0755-bdc6-4f0f-9c7e-9e7ff134ea49))
    (pin "32" (uuid b960b425-3db8-465d-a51c-191ba88204d8))
    (pin "4" (uuid 7c7098b7-90fc-49ab-8ca6-e8b355725702))
    (pin "5" (uuid a035d06a-59fd-4fbe-82f6-0a506f9568d5))
    (pin "6" (uuid 3f453ad8-e331-42b0-8439-e92c97c13e5a))
    (pin "7" (uuid 9a63b679-fca5-4f6c-af45-cd00a38018fa))
    (pin "8" (uuid 29bb8cc4-118c-48fd-8a9f-3c45547b5574))
    (pin "9" (uuid 5bf08293-0341-4fbc-ba18-cc6a4bc84923))
  )

  (symbol (lib_id "power:GND") (at 127 105.41 180) (unit 1)
    (in_bom yes) (on_board yes) (fields_autoplaced)
    (uuid df9b44ea-e7e3-42dd-b78d-a584ab095e43)
    (property "Reference" "#PWR013" (id 0) (at 127 99.06 0)
      (effects (font (size 1.27 1.27)) hide)
    )
    (property "Value" "GND" (id 1) (at 127 101.6 0))
    (property "Footprint" "" (id 2) (at 127 105.41 0)
      (effects (font (size 1.27 1.27)) hide)
    )
    (property "Datasheet" "" (id 3) (at 127 105.41 0)
      (effects (font (size 1.27 1.27)) hide)
    )
    (pin "1" (uuid de2cba48-dd2c-45c6-8074-33cd1eb9e44a))
  )

  (symbol (lib_id "Device:C") (at 236.22 45.72 90) (unit 1)
    (in_bom yes) (on_board yes) (fields_autoplaced)
    (uuid e1815007-e1a6-41db-98f0-fe0a598baf08)
    (property "Reference" "C9" (id 0) (at 236.22 39.37 90))
    (property "Value" "0.1uF" (id 1) (at 236.22 41.91 90))
    (property "Footprint" "Capacitor_SMD:C_0402_1005Metric" (id 2) (at 240.03 44.7548 0)
      (effects (font (size 1.27 1.27)) hide)
    )
    (property "Datasheet" "~" (id 3) (at 236.22 45.72 0)
      (effects (font (size 1.27 1.27)) hide)
    )
    (pin "1" (uuid 34c4c1ca-829b-464f-8606-88a984a2d12f))
    (pin "2" (uuid 642aaa5e-e605-47c1-a133-adc520e129cc))
  )

  (symbol (lib_id "Device:LED") (at 107.95 160.02 180) (unit 1)
    (in_bom yes) (on_board yes) (fields_autoplaced)
    (uuid e637d3f2-edf2-4d06-8f4a-11c7ab16c38c)
    (property "Reference" "D1" (id 0) (at 108.1405 153.67 0))
    (property "Value" "BLUE" (id 1) (at 108.1405 156.21 0))
    (property "Footprint" "LED_SMD:LED_0603_1608Metric" (id 2) (at 107.95 160.02 0)
      (effects (font (size 1.27 1.27)) hide)
    )
    (property "Datasheet" "~" (id 3) (at 107.95 160.02 0)
      (effects (font (size 1.27 1.27)) hide)
    )
    (pin "1" (uuid d50bf328-faa9-4684-b799-8f287168cfeb))
    (pin "2" (uuid 8f5cfab3-6d97-4d3e-8fb9-7f2b3b884a79))
  )

  (symbol (lib_id "Device:R") (at 181.61 127 90) (unit 1)
    (in_bom yes) (on_board yes)
    (uuid e637e1dc-0332-4785-92ea-85953bd7e73e)
    (property "Reference" "R4" (id 0) (at 181.61 124.46 90))
    (property "Value" "120" (id 1) (at 181.61 127 90))
    (property "Footprint" "Resistor_SMD:R_0402_1005Metric" (id 2) (at 181.61 128.778 90)
      (effects (font (size 1.27 1.27)) hide)
    )
    (property "Datasheet" "~" (id 3) (at 181.61 127 0)
      (effects (font (size 1.27 1.27)) hide)
    )
    (pin "1" (uuid 04f09f17-353d-4889-a9e9-63c1fb0b6a2e))
    (pin "2" (uuid 7a522f8f-6137-484e-8f05-6461ab8997e8))
  )

  (symbol (lib_id "power:GND") (at 58.42 97.79 0) (unit 1)
    (in_bom yes) (on_board yes) (fields_autoplaced)
    (uuid eea985ce-2161-4a62-ac90-40121e0999d6)
    (property "Reference" "#PWR05" (id 0) (at 58.42 104.14 0)
      (effects (font (size 1.27 1.27)) hide)
    )
    (property "Value" "GND" (id 1) (at 58.42 102.87 0))
    (property "Footprint" "" (id 2) (at 58.42 97.79 0)
      (effects (font (size 1.27 1.27)) hide)
    )
    (property "Datasheet" "" (id 3) (at 58.42 97.79 0)
      (effects (font (size 1.27 1.27)) hide)
    )
    (pin "1" (uuid ccb0186a-abbf-416c-aac5-ea2c529ebce2))
  )

  (symbol (lib_id "power:+3V3") (at 58.42 31.75 0) (unit 1)
    (in_bom yes) (on_board yes) (fields_autoplaced)
    (uuid f453d422-1408-4cad-989a-eaaeedef982e)
    (property "Reference" "#PWR04" (id 0) (at 58.42 35.56 0)
      (effects (font (size 1.27 1.27)) hide)
    )
    (property "Value" "+3V3" (id 1) (at 58.42 26.67 0))
    (property "Footprint" "" (id 2) (at 58.42 31.75 0)
      (effects (font (size 1.27 1.27)) hide)
    )
    (property "Datasheet" "" (id 3) (at 58.42 31.75 0)
      (effects (font (size 1.27 1.27)) hide)
    )
    (pin "1" (uuid 1cf23c13-f01a-4ab7-97a4-80201da77ce1))
  )

  (symbol (lib_id "power:GND") (at 104.14 105.41 180) (unit 1)
    (in_bom yes) (on_board yes) (fields_autoplaced)
    (uuid f4e6d558-7092-4b09-bcbd-d1e8e9db62cf)
    (property "Reference" "#PWR09" (id 0) (at 104.14 99.06 0)
      (effects (font (size 1.27 1.27)) hide)
    )
    (property "Value" "GND" (id 1) (at 104.14 101.6 0))
    (property "Footprint" "" (id 2) (at 104.14 105.41 0)
      (effects (font (size 1.27 1.27)) hide)
    )
    (property "Datasheet" "" (id 3) (at 104.14 105.41 0)
      (effects (font (size 1.27 1.27)) hide)
    )
    (pin "1" (uuid 1b448efe-40d0-49c6-9bf0-7999a527bd67))
  )

  (symbol (lib_id "Device:C") (at 127 111.76 0) (unit 1)
    (in_bom yes) (on_board yes) (fields_autoplaced)
    (uuid f9fc2002-9a70-4670-a7ec-9a23d1b929a6)
    (property "Reference" "C4" (id 0) (at 130.81 111.1249 0)
      (effects (font (size 1.27 1.27)) (justify left))
    )
    (property "Value" "1uF" (id 1) (at 130.81 113.6649 0)
      (effects (font (size 1.27 1.27)) (justify left))
    )
    (property "Footprint" "Capacitor_SMD:C_0402_1005Metric" (id 2) (at 127.9652 115.57 0)
      (effects (font (size 1.27 1.27)) hide)
    )
    (property "Datasheet" "~" (id 3) (at 127 111.76 0)
      (effects (font (size 1.27 1.27)) hide)
    )
    (pin "1" (uuid f5630be0-c5e7-45d1-aad5-42ad54cd86ab))
    (pin "2" (uuid 3a6b133b-e03e-4c75-a379-7a8572c0cdba))
  )

  (sheet_instances
    (path "/" (page "1"))
  )

  (symbol_instances
    (path "/99d273d0-ffea-439a-b2bf-064aa1ff833e"
      (reference "#FLG01") (unit 1) (value "PWR_FLAG") (footprint "")
    )
    (path "/86992179-f451-4d4f-bc66-c380c234d86c"
      (reference "#FLG02") (unit 1) (value "PWR_FLAG") (footprint "")
    )
    (path "/9be526ac-c03b-4265-9410-285135c118f4"
      (reference "#PWR01") (unit 1) (value "GND") (footprint "")
    )
    (path "/a2a39225-8968-4f0e-a32f-1067ad7d1002"
      (reference "#PWR02") (unit 1) (value "+3V3") (footprint "")
    )
    (path "/c4407a4a-bf33-4747-81ad-6fa55417949a"
      (reference "#PWR03") (unit 1) (value "GND") (footprint "")
    )
    (path "/f453d422-1408-4cad-989a-eaaeedef982e"
      (reference "#PWR04") (unit 1) (value "+3V3") (footprint "")
    )
    (path "/eea985ce-2161-4a62-ac90-40121e0999d6"
      (reference "#PWR05") (unit 1) (value "GND") (footprint "")
    )
    (path "/08799c7b-cbd4-4fb3-8b30-e07dc5afb67d"
      (reference "#PWR06") (unit 1) (value "GND") (footprint "")
    )
    (path "/10478608-215d-461d-bcde-e3f9e9a794cd"
      (reference "#PWR07") (unit 1) (value "+5V") (footprint "")
    )
    (path "/12e6a1a7-b0f9-4a64-a94d-7872e5e6da44"
      (reference "#PWR08") (unit 1) (value "GND") (footprint "")
    )
    (path "/f4e6d558-7092-4b09-bcbd-d1e8e9db62cf"
      (reference "#PWR09") (unit 1) (value "GND") (footprint "")
    )
    (path "/cece7abf-dbc4-4c81-9d53-0352d507d02c"
      (reference "#PWR010") (unit 1) (value "GND") (footprint "")
    )
    (path "/860d6853-74c8-4924-9200-1571e894dc8b"
      (reference "#PWR011") (unit 1) (value "GND") (footprint "")
    )
    (path "/856fc909-ae51-4e24-b218-213c9a089ffd"
      (reference "#PWR012") (unit 1) (value "GND") (footprint "")
    )
    (path "/df9b44ea-e7e3-42dd-b78d-a584ab095e43"
      (reference "#PWR013") (unit 1) (value "GND") (footprint "")
    )
    (path "/677e3d29-cf79-4a63-b581-d8c6dde171ef"
      (reference "#PWR014") (unit 1) (value "GND") (footprint "")
    )
    (path "/9ae54a40-6553-44f8-a756-baebb6b1f263"
      (reference "#PWR015") (unit 1) (value "+3V3") (footprint "")
    )
    (path "/59bf8035-279b-4620-a45f-2ffcd8139b4c"
      (reference "#PWR016") (unit 1) (value "GND") (footprint "")
    )
    (path "/dad47b65-c67c-4ee1-b84b-fe8024daa1d4"
      (reference "#PWR021") (unit 1) (value "GND") (footprint "")
    )
    (path "/18ebc53b-830b-45d6-8b95-9eb872754453"
      (reference "#PWR022") (unit 1) (value "+5V") (footprint "")
    )
    (path "/a99e8602-ce26-46af-bf6d-74d87543de6f"
      (reference "#PWR026") (unit 1) (value "+3V3") (footprint "")
    )
    (path "/8cb461a9-2710-496b-a47a-72dffd0f1af4"
      (reference "#PWR027") (unit 1) (value "GND") (footprint "")
    )
    (path "/74a8e57b-0e0b-4c13-9110-b64b7628bacf"
      (reference "#PWR030") (unit 1) (value "+5V") (footprint "")
    )
    (path "/5e19bb1f-24f7-475a-badf-bb57682f5e9c"
      (reference "#PWR031") (unit 1) (value "GND") (footprint "")
    )
    (path "/58baebd4-a88f-41b1-8268-909e2e11d7e1"
      (reference "#PWR032") (unit 1) (value "+5V") (footprint "")
    )
    (path "/40093782-8d1b-4eea-8df3-3a17850e73ca"
      (reference "#PWR033") (unit 1) (value "GND") (footprint "")
    )
    (path "/c25873a0-a879-4098-a3da-0cee0d184bec"
      (reference "#PWR034") (unit 1) (value "GND") (footprint "")
    )
    (path "/db60161d-177f-4767-bd72-74e70e70ce89"
      (reference "#PWR0101") (unit 1) (value "+3V3") (footprint "")
    )
    (path "/6bf01f55-e138-4fb1-8c7a-15cb7e56224f"
      (reference "#PWR0102") (unit 1) (value "+3V3") (footprint "")
    )
    (path "/87e986de-a910-4b3e-a73d-e8ed9ffeaed5"
      (reference "C1") (unit 1) (value "0.1uF") (footprint "Capacitor_SMD:C_0402_1005Metric")
    )
    (path "/4dcd288c-0a7d-43a0-b00c-20ef4c127592"
      (reference "C2") (unit 1) (value "4.7uF") (footprint "Capacitor_SMD:C_0402_1005Metric")
    )
    (path "/7bb88243-5998-47ef-b592-913b94c1ec53"
      (reference "C3") (unit 1) (value "1uF") (footprint "Capacitor_SMD:C_0402_1005Metric")
    )
    (path "/f9fc2002-9a70-4670-a7ec-9a23d1b929a6"
      (reference "C4") (unit 1) (value "1uF") (footprint "Capacitor_SMD:C_0402_1005Metric")
    )
    (path "/0800051a-0476-4dab-98fa-42d527d36797"
      (reference "C5") (unit 1) (value "2.2uF") (footprint "Capacitor_SMD:C_0402_1005Metric")
    )
    (path "/06d74cad-5ff0-4f30-9a6f-8c6ec0b513b8"
      (reference "C6") (unit 1) (value "0.1uF") (footprint "Capacitor_SMD:C_0402_1005Metric")
    )
    (path "/a0cc2399-4370-4b21-8343-c4e1b4b56094"
      (reference "C7") (unit 1) (value "10nF") (footprint "Capacitor_SMD:C_0402_1005Metric")
    )
    (path "/e1815007-e1a6-41db-98f0-fe0a598baf08"
      (reference "C9") (unit 1) (value "0.1uF") (footprint "Capacitor_SMD:C_0402_1005Metric")
    )
    (path "/b77a25d4-3a0d-4247-9d5e-f5f4027f7c21"
      (reference "C10") (unit 1) (value "47nF") (footprint "Capacitor_SMD:C_0402_1005Metric")
    )
    (path "/e637d3f2-edf2-4d06-8f4a-11c7ab16c38c"
      (reference "D1") (unit 1) (value "BLUE") (footprint "LED_SMD:LED_0603_1608Metric")
    )
    (path "/870579d4-a3f8-4e85-b89e-818f843abdcb"
      (reference "J1") (unit 1) (value "Conn_01x06") (footprint "Connector_JST:JST_SH_SM06B-SRSS-TB_1x06-1MP_P1.00mm_Horizontal")
    )
    (path "/5907d37c-8b28-4eeb-811a-da2e3d7487b7"
      (reference "J3") (unit 1) (value "Conn_01x04") (footprint "Connector_JST:JST_GH_SM04B-GHS-TB_1x04-1MP_P1.25mm_Horizontal")
    )
    (path "/a73f4f5a-6e4d-472e-9b51-954e3d116bd7"
      (reference "R1") (unit 1) (value "1K") (footprint "Resistor_SMD:R_0402_1005Metric")
    )
    (path "/e637e1dc-0332-4785-92ea-85953bd7e73e"
      (reference "R4") (unit 1) (value "120") (footprint "Resistor_SMD:R_0402_1005Metric")
    )
    (path "/dc8df503-c5d3-472d-9ab8-3dfe9a79b93e"
      (reference "U1") (unit 1) (value "STM32G0B1KxT") (footprint "Package_QFP:LQFP-32_7x7mm_P0.8mm")
    )
    (path "/21d1d343-8bbd-4231-b891-84df2915c93a"
      (reference "U2") (unit 1) (value "BL9161-33BARN") (footprint "Package_TO_SOT_SMD:SOT-23-5")
    )
    (path "/57c19f28-871f-49e6-828a-40fd32888220"
      (reference "U3") (unit 1) (value "ICM42605") (footprint "Package_LGA:LGA-14_3x2.5mm_P0.5mm_LayoutBorder3x4y")
    )
    (path "/c3ace563-a15c-4758-acd6-49efd4d3fa11"
      (reference "U4") (unit 1) (value "TJA1051T-3") (footprint "Package_SO:SOIC-8_3.9x4.9mm_P1.27mm")
    )
  )
)
