(footprint "PSON35P100X100X35-6N" (version 20211014) (generator pcbnew)
  (layer "F.Cu")
  (tedit 6356F9AC)
  (attr through_hole)
  (fp_text reference "REF**" (at -0.018 -1.074281) (layer "F.SilkS")
    (effects (font (size 0.24 0.24) (thickness 0.15)))
    (tstamp c18a8232-2812-441c-b452-72556788df09)
  )
  (fp_text value "PSON35P100X100X35-6N" (at 2.268 1.096241) (layer "F.Fab")
    (effects (font (size 0.24 0.24) (thickness 0.15)))
    (tstamp 76064319-833f-45cf-8e77-e1de873476ed)
  )
  (fp_poly (pts
      (xy -0.525 -0.15)
      (xy -0.025 -0.15)
      (xy -0.025 0.15)
      (xy -0.525 0.15)
    ) (layer "F.Mask") (width 0.01) (fill solid) (tstamp 0090a063-4b59-476c-811d-abf6cb6c915a))
  (fp_poly (pts
      (xy -0.525 -0.5)
      (xy -0.025 -0.5)
      (xy -0.025 -0.2)
      (xy -0.525 -0.2)
    ) (layer "F.Mask") (width 0.01) (fill solid) (tstamp 10918024-0fdc-4411-95e2-c6f71ab4b6d7))
  (fp_poly (pts
      (xy -0.525 0.2)
      (xy -0.025 0.2)
      (xy -0.025 0.5)
      (xy -0.525 0.5)
    ) (layer "F.Mask") (width 0.01) (fill solid) (tstamp 1f0de089-f701-40a7-9e77-420249782e97))
  (fp_poly (pts
      (xy 0.025 -0.5)
      (xy 0.525 -0.5)
      (xy 0.525 -0.2)
      (xy 0.025 -0.2)
    ) (layer "F.Mask") (width 0.01) (fill solid) (tstamp a3a37446-fdb0-4fb7-b66f-221a36f80c87))
  (fp_poly (pts
      (xy 0.025 -0.15)
      (xy 0.525 -0.15)
      (xy 0.525 0.15)
      (xy 0.025 0.15)
    ) (layer "F.Mask") (width 0.01) (fill solid) (tstamp f1618d7c-757b-4f0d-b3ff-9eb9d5867471))
  (fp_poly (pts
      (xy 0.025 0.2)
      (xy 0.525 0.2)
      (xy 0.525 0.5)
      (xy 0.025 0.5)
    ) (layer "F.Mask") (width 0.01) (fill solid) (tstamp f970e44e-2f8e-41f1-8cf5-5e84eaed8ad2))
  (fp_line (start 0.75 -0.75) (end 0.75 0.75) (layer "F.CrtYd") (width 0.05) (tstamp 04829197-8715-4b12-b330-a91d097dc3da))
  (fp_line (start -0.75 0.75) (end -0.75 -0.75) (layer "F.CrtYd") (width 0.05) (tstamp 71ef430d-ff19-4ef5-bc0c-895b5b3ead80))
  (fp_line (start 0.75 0.75) (end -0.75 0.75) (layer "F.CrtYd") (width 0.05) (tstamp 806cdcf3-cbdc-4795-a66b-8e2c64d92676))
  (fp_line (start -0.75 -0.75) (end 0.75 -0.75) (layer "F.CrtYd") (width 0.05) (tstamp 95104330-eb0b-49b9-b7ca-3af654515c3b))
  (fp_line (start 0.5 0.5) (end -0.5 0.5) (layer "F.Fab") (width 0.127) (tstamp 13d73432-336e-40e1-9296-e23447189cde))
  (fp_line (start 0.5 -0.5) (end 0.5 0.5) (layer "F.Fab") (width 0.127) (tstamp 4d944d69-0a09-457b-a4a4-f1351e5ca286))
  (fp_line (start -0.5 0.5) (end -0.5 -0.5) (layer "F.Fab") (width 0.127) (tstamp 589addab-5782-4cbc-a4c4-b994ca2a4b95))
  (fp_line (start -0.5 -0.5) (end 0.5 -0.5) (layer "F.Fab") (width 0.127) (tstamp d9498f29-920c-42b6-86a3-49e8f6ed475f))
  (fp_circle (center -1.1 -0.35) (end -1 -0.35) (layer "F.Fab") (width 0.2) (fill none) (tstamp 3ed231eb-8035-4e1f-a5e7-7ce86ab6ed45))
  (pad "1" smd rect (at -0.275 -0.35) (size 0.4 0.2) (layers "F.Cu" "F.Paste") (tstamp a926d2bd-4570-4b47-8648-6539e80d9c78))
  (pad "2" smd rect (at -0.275 0) (size 0.4 0.2) (layers "F.Cu" "F.Paste") (tstamp 42924860-8617-4c12-9221-056d468b0bb9))
  (pad "3" smd rect (at -0.275 0.35) (size 0.4 0.2) (layers "F.Cu" "F.Paste") (tstamp eaddb1e9-95ff-402c-9204-3f2f9a3500db))
  (pad "4" smd rect (at 0.275 0.35) (size 0.4 0.2) (layers "F.Cu" "F.Paste") (tstamp f4f8365d-722f-454f-a7e6-11b90505013c))
  (pad "5" smd rect (at 0.275 0) (size 0.4 0.2) (layers "F.Cu" "F.Paste") (tstamp 9cb22c43-7a40-4921-8f66-eed53d037b8e))
  (pad "6" smd rect (at 0.275 -0.35) (size 0.4 0.2) (layers "F.Cu" "F.Paste") (tstamp 350c7a2c-55f3-48e2-a265-53ae95536e0a))
)
