(footprint "LOGO" (version 20210606) (generator bitmap2component) (layer "F.Cu")
  (at 0 0)
(attr board_only exclude_from_pos_files exclude_from_bom)
 (fp_text reference "G***" (at 0 0) (layer F.SilkS)
  (effects (font (thickness 0.3)))
  )
  (fp_text value "LOGO" (at 0.75 0) (layer F.SilkS) hide
  (effects (font (thickness 0.3)))
  )
  (fp_poly (pts (xy -5.573338 -0.220000) (xy -5.530606 -0.219490) (xy -5.496481 -0.218111) (xy -5.475129 -0.216091) (xy -5.470000 -0.214331) (xy -5.473802 -0.204257) (xy -5.484690 -0.177637) (xy -5.501889 -0.136314)
     (xy -5.524624 -0.082133) (xy -5.552118 -0.016937) (xy -5.583596 0.057430) (xy -5.618284 0.139125) (xy -5.651021 0.216023) (xy -5.698156 0.326166) (xy -5.738591 0.419431) (xy -5.773205 0.497449)
     (xy -5.802879 0.561852) (xy -5.828489 0.614270) (xy -5.850917 0.656334) (xy -5.871040 0.689675) (xy -5.889737 0.715924) (xy -5.907887 0.736713) (xy -5.926369 0.753672) (xy -5.946062 0.768432)
     (xy -5.950238 0.771273) (xy -5.986093 0.790423) (xy -6.027384 0.805793) (xy -6.040891 0.809256) (xy -6.078748 0.815116) (xy -6.121557 0.818381) (xy -6.162504 0.818883) (xy -6.194776 0.816454)
     (xy -6.207500 0.813377) (xy -6.214644 0.801455) (xy -6.218750 0.771957) (xy -6.219988 0.726666) (xy -6.219976 0.645000) (xy -6.157323 0.644843) (xy -6.116085 0.642750) (xy -6.086724 0.635439)
     (xy -6.062185 0.621555) (xy -6.031514 0.592656) (xy -6.009307 0.558262) (xy -6.000048 0.525456) (xy -6.000000 0.523307) (xy -6.003499 0.510151) (xy -6.013452 0.480591) (xy -6.029043 0.436854)
     (xy -6.049456 0.381167) (xy -6.073875 0.315758) (xy -6.101484 0.242854) (xy -6.129317 0.170258) (xy -6.159563 0.091810) (xy -6.187879 0.018347) (xy -6.213373 -0.047814) (xy -6.235153 -0.104357)
     (xy -6.252325 -0.148964) (xy -6.263998 -0.179319) (xy -6.269070 -0.192552) (xy -6.279505 -0.220000) (xy -6.063405 -0.220000) (xy -5.974249 0.024546) (xy -5.950159 0.089738) (xy -5.928062 0.147851)
     (xy -5.908915 0.196503) (xy -5.893675 0.233315) (xy -5.883298 0.255904) (xy -5.878834 0.262046) (xy -5.873467 0.251233) (xy -5.861607 0.224454) (xy -5.844341 0.184252) (xy -5.822751 0.133172)
     (xy -5.797921 0.073756) (xy -5.774625 0.017500) (xy -5.676676 -0.220001) )(layer F.SilkS) (width  0.000000)
  )
  (fp_poly (pts (xy -8.434760 -0.232041) (xy -8.356451 -0.215884) (xy -8.281632 -0.183772) (xy -8.212916 -0.135348) (xy -8.180180 -0.103293) (xy -8.134340 -0.043488) (xy -8.104632 0.019855) (xy -8.089284 0.091510)
     (xy -8.086132 0.150110) (xy -8.086963 0.196049) (xy -8.090916 0.230362) (xy -8.099690 0.261370) (xy -8.114986 0.297396) (xy -8.117184 0.302117) (xy -8.162336 0.376180) (xy -8.221011 0.437171)
     (xy -8.290609 0.483849) (xy -8.368530 0.514975) (xy -8.452173 0.529310) (xy -8.538939 0.525615) (xy -8.572541 0.519143) (xy -8.651987 0.490917) (xy -8.720899 0.447670) (xy -8.778041 0.391948)
     (xy -8.822178 0.326295) (xy -8.852074 0.253254) (xy -8.866491 0.175371) (xy -8.865746 0.149336) (xy -8.676617 0.149336) (xy -8.667485 0.210841) (xy -8.640190 0.267910) (xy -8.627572 0.284784)
     (xy -8.580742 0.327616) (xy -8.526533 0.351966) (xy -8.465816 0.357571) (xy -8.415000 0.348899) (xy -8.367269 0.326040) (xy -8.326644 0.288102) (xy -8.295771 0.239500) (xy -8.277295 0.184652)
     (xy -8.273860 0.127973) (xy -8.275377 0.115753) (xy -8.293305 0.056593) (xy -8.324348 0.008392) (xy -8.365409 -0.028091) (xy -8.413390 -0.052094) (xy -8.465197 -0.062857) (xy -8.517732 -0.059619)
     (xy -8.567898 -0.041620) (xy -8.612599 -0.008098) (xy -8.639769 0.026245) (xy -8.667430 0.086701) (xy -8.676617 0.149336) (xy -8.865746 0.149336) (xy -8.864196 0.095190) (xy -8.843950 0.015255)
     (xy -8.831538 -0.014012) (xy -8.787176 -0.086056) (xy -8.730622 -0.144296) (xy -8.664490 -0.188372) (xy -8.591393 -0.217927) (xy -8.513946 -0.232603) )(layer F.SilkS) (width  0.000000)
  )
  (fp_poly (pts (xy -7.770000 -0.169664) (xy -7.717500 -0.197324) (xy -7.690821 -0.210320) (xy -7.666643 -0.218489) (xy -7.638937 -0.222924) (xy -7.601672 -0.224720) (xy -7.565000 -0.224993) (xy -7.516763 -0.224422)
     (xy -7.482139 -0.221922) (xy -7.454755 -0.216328) (xy -7.428239 -0.206473) (xy -7.405545 -0.195808) (xy -7.333447 -0.149660) (xy -7.274299 -0.089502) (xy -7.229822 -0.017874) (xy -7.201736 0.062682)
     (xy -7.193150 0.117831) (xy -7.195453 0.201326) (xy -7.215355 0.279233) (xy -7.250802 0.349668) (xy -7.299739 0.410747) (xy -7.360112 0.460589) (xy -7.429866 0.497310) (xy -7.506947 0.519026)
     (xy -7.589301 0.523855) (xy -7.631294 0.519432) (xy -7.670491 0.510278) (xy -7.711957 0.496475) (xy -7.723206 0.491823) (xy -7.768825 0.471644) (xy -7.771913 0.493322) (xy -7.774581 0.503391)
     (xy -7.781679 0.509741) (xy -7.797064 0.513224) (xy -7.824596 0.514692) (xy -7.868131 0.514999) (xy -7.870000 0.515000) (xy -7.965000 0.515000) (xy -7.965000 0.297699) (xy -7.770000 0.297699)
     (xy -7.742710 0.315581) (xy -7.683160 0.344197) (xy -7.618965 0.357007) (xy -7.555422 0.353471) (xy -7.510180 0.339230) (xy -7.467065 0.316472) (xy -7.437446 0.291611) (xy -7.415115 0.259099)
     (xy -7.410380 0.250000) (xy -7.389214 0.187749) (xy -7.386338 0.125762) (xy -7.400752 0.067237) (xy -7.431457 0.015374) (xy -7.477454 -0.026627) (xy -7.501155 -0.040590) (xy -7.549113 -0.056040)
     (xy -7.604894 -0.060159) (xy -7.661940 -0.053666) (xy -7.713694 -0.037280) (xy -7.752135 -0.013069) (xy -7.759183 -0.004479) (xy -7.764120 0.008609) (xy -7.767309 0.029494) (xy -7.769108 0.061476)
     (xy -7.769879 0.107856) (xy -7.770000 0.150399) (xy -7.770000 0.297699) (xy -7.965000 0.297699) (xy -7.965000 -0.473823) (xy -7.895000 -0.486453) (xy -7.855459 -0.493622) (xy -7.820130 -0.500087)
     (xy -7.797500 -0.504292) (xy -7.770000 -0.509500) )(layer F.SilkS) (width  0.000000)
  )
  (fp_poly (pts (xy -6.880000 -0.337289) (xy -6.879583 -0.282029) (xy -6.878425 -0.234803) (xy -6.876671 -0.198769) (xy -6.874465 -0.177086) (xy -6.872500 -0.172178) (xy -6.826614 -0.195183) (xy -6.792032 -0.210319)
     (xy -6.762465 -0.219224) (xy -6.731622 -0.223541) (xy -6.693214 -0.224909) (xy -6.670000 -0.225000) (xy -6.621572 -0.224215) (xy -6.586284 -0.221054) (xy -6.557311 -0.214315) (xy -6.527829 -0.202792)
     (xy -6.517643 -0.198119) (xy -6.453922 -0.158659) (xy -6.395914 -0.104598) (xy -6.349005 -0.041332) (xy -6.334617 -0.014782) (xy -6.320908 0.015569) (xy -6.312300 0.042240) (xy -6.307614 0.071665)
     (xy -6.305669 0.110276) (xy -6.305311 0.145000) (xy -6.305817 0.194080) (xy -6.308407 0.229552) (xy -6.314148 0.257781) (xy -6.324109 0.285133) (xy -6.331605 0.301751) (xy -6.375892 0.374012)
     (xy -6.433773 0.433928) (xy -6.502361 0.479963) (xy -6.578770 0.510580) (xy -6.660114 0.524244) (xy -6.741294 0.519796) (xy -6.780511 0.510409) (xy -6.821992 0.496471) (xy -6.833206 0.491823)
     (xy -6.878825 0.471644) (xy -6.881913 0.493322) (xy -6.884781 0.503558) (xy -6.892459 0.510147) (xy -6.908850 0.514091) (xy -6.937857 0.516393) (xy -6.977500 0.517875) (xy -7.070000 0.520750)
     (xy -7.070000 0.288982) (xy -6.880000 0.288982) (xy -6.847500 0.313643) (xy -6.794231 0.342282) (xy -6.733102 0.356044) (xy -6.670152 0.354434) (xy -6.611422 0.336955) (xy -6.604632 0.333605)
     (xy -6.556379 0.297903) (xy -6.520330 0.249551) (xy -6.498459 0.193087) (xy -6.492739 0.133047) (xy -6.499327 0.091593) (xy -6.517339 0.051311) (xy -6.546830 0.010702) (xy -6.582417 -0.024227)
     (xy -6.618714 -0.047467) (xy -6.626717 -0.050567) (xy -6.655424 -0.056092) (xy -6.694708 -0.058789) (xy -6.729519 -0.058329) (xy -6.774530 -0.053594) (xy -6.808356 -0.043783) (xy -6.838606 -0.027111)
     (xy -6.880000 0.000283) (xy -6.880000 0.288982) (xy -7.070000 0.288982) (xy -7.070000 -0.476205) (xy -6.975000 -0.491224) (xy -6.880000 -0.506244) )(layer F.SilkS) (width  0.000000)
  )
  (fp_poly (pts (xy -3.495900 -0.497950) (xy -3.493923 -0.495776) (xy -3.493164 -0.483932) (xy -3.492552 -0.454036) (xy -3.492093 -0.408037) (xy -3.491793 -0.347883) (xy -3.491658 -0.275521) (xy -3.491694 -0.192900)
     (xy -3.491905 -0.101968) (xy -3.492299 -0.004673) (xy -3.492398 0.015000) (xy -3.495000 0.515000) (xy -3.685000 0.515000) (xy -3.688202 0.487117) (xy -3.691403 0.459235) (xy -3.723202 0.478404)
     (xy -3.790337 0.507925) (xy -3.866075 0.522302) (xy -3.944932 0.520590) (xy -3.957405 0.518771) (xy -4.036869 0.495948) (xy -4.109446 0.455902) (xy -4.171840 0.401082) (xy -4.220755 0.333941)
     (xy -4.230357 0.315792) (xy -4.258017 0.238749) (xy -4.268385 0.158426) (xy -4.267530 0.147197) (xy -4.076080 0.147197) (xy -4.067652 0.201683) (xy -4.045666 0.253012) (xy -4.010487 0.297997)
     (xy -3.962479 0.333449) (xy -3.922360 0.350593) (xy -3.887697 0.355663) (xy -3.843289 0.354231) (xy -3.797969 0.347202) (xy -3.760568 0.335481) (xy -3.756639 0.333605) (xy -3.731411 0.320386)
     (xy -3.713521 0.308032) (xy -3.701707 0.292975) (xy -3.694709 0.271647) (xy -3.691265 0.240480) (xy -3.690116 0.195903) (xy -3.690000 0.145000) (xy -3.690252 0.085254) (xy -3.691917 0.042041)
     (xy -3.696362 0.011892) (xy -3.704952 -0.008661) (xy -3.719053 -0.023086) (xy -3.740032 -0.034850) (xy -3.765103 -0.045688) (xy -3.824056 -0.060810) (xy -3.887532 -0.061200) (xy -3.947596 -0.047137)
     (xy -3.966911 -0.038561) (xy -4.016365 -0.003325) (xy -4.050801 0.041505) (xy -4.070585 0.092742) (xy -4.076080 0.147197) (xy -4.267530 0.147197) (xy -4.262269 0.078146) (xy -4.240475 0.001233)
     (xy -4.203813 -0.068991) (xy -4.153088 -0.129203) (xy -4.114681 -0.160220) (xy -4.037551 -0.202462) (xy -3.956925 -0.225278) (xy -3.872367 -0.228695) (xy -3.783440 -0.212740) (xy -3.707500 -0.185457)
     (xy -3.700756 -0.183869) (xy -3.696003 -0.187785) (xy -3.692896 -0.199993) (xy -3.691090 -0.223284) (xy -3.690242 -0.260447) (xy -3.690005 -0.314272) (xy -3.690000 -0.327033) (xy -3.690000 -0.476205)
     (xy -3.594025 -0.491378) (xy -3.543893 -0.498367) (xy -3.511677 -0.500536) )(layer F.SilkS) (width  0.000000)
  )
  (fp_poly (pts (xy -2.706746 -0.444251) (xy -2.702911 -0.425763) (xy -2.700747 -0.392102) (xy -2.700006 -0.340981) (xy -2.700000 -0.335000) (xy -2.700000 -0.220000) (xy -2.490000 -0.220000) (xy -2.490000 -0.060000)
     (xy -2.700000 -0.060000) (xy -2.700000 0.129285) (xy -2.699763 0.197309) (xy -2.698912 0.248075) (xy -2.697236 0.284325) (xy -2.694526 0.308795) (xy -2.690573 0.324227) (xy -2.685166 0.333359)
     (xy -2.684301 0.334270) (xy -2.658849 0.350877) (xy -2.622931 0.358287) (xy -2.572981 0.357115) (xy -2.559430 0.355730) (xy -2.500000 0.349006) (xy -2.500000 0.507500) (xy -2.529708 0.513441)
     (xy -2.578269 0.520562) (xy -2.631802 0.524361) (xy -2.682488 0.524573) (xy -2.722506 0.520933) (xy -2.726736 0.520117) (xy -2.790394 0.499204) (xy -2.839078 0.465890) (xy -2.874443 0.418895)
     (xy -2.884523 0.397684) (xy -2.890011 0.380459) (xy -2.894105 0.356823) (xy -2.896978 0.324012) (xy -2.898802 0.279262) (xy -2.899752 0.219807) (xy -2.900000 0.150321) (xy -2.900000 -0.060000)
     (xy -3.050000 -0.060000) (xy -3.050000 -0.220000) (xy -2.900000 -0.220000) (xy -2.900000 -0.314810) (xy -2.899721 -0.358952) (xy -2.898291 -0.387052) (xy -2.894819 -0.403063) (xy -2.888416 -0.410941)
     (xy -2.878192 -0.414642) (xy -2.877500 -0.414803) (xy -2.816746 -0.428721) (xy -2.772706 -0.438599) (xy -2.742636 -0.445021) (xy -2.723791 -0.448569) (xy -2.713427 -0.449826) (xy -2.712500 -0.449853)
     )(layer F.SilkS) (width  0.000000)
  )
  (fp_poly (pts (xy -1.610020 -0.225621) (xy -1.533424 -0.200412) (xy -1.464914 -0.160727) (xy -1.406370 -0.108298) (xy -1.359676 -0.044856) (xy -1.326714 0.027867) (xy -1.309365 0.108139) (xy -1.309512 0.194228)
     (xy -1.310922 0.205810) (xy -1.330695 0.280909) (xy -1.367594 0.352276) (xy -1.418751 0.415709) (xy -1.481297 0.467006) (xy -1.495000 0.475486) (xy -1.564096 0.506004) (xy -1.642021 0.523756)
     (xy -1.721788 0.527807) (xy -1.796410 0.517224) (xy -1.800000 0.516261) (xy -1.884478 0.483505) (xy -1.956477 0.435521) (xy -2.015057 0.373072) (xy -2.052195 0.312058) (xy -2.067465 0.279500)
     (xy -2.077094 0.252705) (xy -2.082367 0.225125) (xy -2.084572 0.190213) (xy -2.084989 0.146160) (xy -1.899945 0.146160) (xy -1.890292 0.207844) (xy -1.863417 0.264380) (xy -1.822083 0.311436)
     (xy -1.775086 0.341968) (xy -1.722565 0.356337) (xy -1.665743 0.354666) (xy -1.611307 0.337626) (xy -1.586314 0.323020) (xy -1.556660 0.296126) (xy -1.529766 0.262115) (xy -1.522511 0.250000)
     (xy -1.509297 0.221547) (xy -1.502608 0.194298) (xy -1.501015 0.160160) (xy -1.501900 0.133233) (xy -1.504927 0.092737) (xy -1.510818 0.064955) (xy -1.521826 0.042614) (xy -1.535737 0.023880)
     (xy -1.582973 -0.024020) (xy -1.632799 -0.052843) (xy -1.687601 -0.063511) (xy -1.746694 -0.057617) (xy -1.795972 -0.037493) (xy -1.839086 -0.001822) (xy -1.872857 0.045165) (xy -1.894102 0.099238)
     (xy -1.899945 0.146160) (xy -2.084989 0.146160) (xy -2.084998 0.145210) (xy -2.084382 0.096515) (xy -2.081809 0.061571) (xy -2.076189 0.034148) (xy -2.066433 0.008015) (xy -2.057779 -0.010373)
     (xy -2.010114 -0.087172) (xy -1.950372 -0.148038) (xy -1.878359 -0.193120) (xy -1.793883 -0.222568) (xy -1.779936 -0.225685) (xy -1.692818 -0.234623) )(layer F.SilkS) (width  0.000000)
  )
  (fp_poly (pts (xy -9.660000 -0.080000) (xy -9.210000 -0.080000) (xy -9.210000 -0.470000) (xy -9.000000 -0.470000) (xy -9.000000 0.520699) (xy -9.102500 0.517849) (xy -9.205000 0.515000) (xy -9.207708 0.312500)
     (xy -9.210415 0.110000) (xy -9.660000 0.110000) (xy -9.660000 0.520000) (xy -9.758334 0.520000) (xy -9.800857 0.519361) (xy -9.835582 0.517641) (xy -9.857845 0.515137) (xy -9.863334 0.513333)
     (xy -9.864656 0.502301) (xy -9.865891 0.473220) (xy -9.867012 0.428042) (xy -9.867994 0.368715) (xy -9.868810 0.297193) (xy -9.869433 0.215424) (xy -9.869839 0.125361) (xy -9.869999 0.028954)
     (xy -9.870000 0.018333) (xy -9.870000 -0.470000) (xy -9.660000 -0.470000) )(layer F.SilkS) (width  0.000000)
  )
  (fp_poly (pts (xy -4.332111 -0.382501) (xy -4.335000 -0.295000) (xy -4.890000 -0.289684) (xy -4.890000 -0.070000) (xy -4.520000 -0.070000) (xy -4.520000 0.099548) (xy -4.885000 0.105000) (xy -4.885000 0.335000)
     (xy -4.330000 0.340316) (xy -4.330000 0.520000) (xy -5.090000 0.520000) (xy -5.090000 -0.470000) (xy -4.709611 -0.470001) (xy -4.329222 -0.470001) )(layer F.SilkS) (width  0.000000)
  )
  (fp_poly (pts (xy -3.150000 0.520000) (xy -3.243334 0.520000) (xy -3.284731 0.519327) (xy -3.318255 0.517524) (xy -3.339098 0.514911) (xy -3.343334 0.513333) (xy -3.344860 0.502138) (xy -3.346263 0.473220)
     (xy -3.347502 0.428853) (xy -3.348537 0.371313) (xy -3.349325 0.302877) (xy -3.349827 0.225819) (xy -3.350000 0.143333) (xy -3.350000 -0.220000) (xy -3.150000 -0.220000) )(layer F.SilkS) (width  0.000000)
  )
  (fp_poly (pts (xy -2.210000 0.520000) (xy -2.400000 0.520000) (xy -2.400000 -0.220000) (xy -2.210000 -0.220000) )(layer F.SilkS) (width  0.000000)
  )
  (fp_poly (pts (xy -0.744482 -0.232273) (xy -0.709498 -0.226838) (xy -0.676831 -0.215581) (xy -0.656625 -0.206233) (xy -0.619035 -0.183737) (xy -0.583172 -0.155660) (xy -0.565801 -0.138225) (xy -0.547357 -0.115447)
     (xy -0.532705 -0.093244) (xy -0.521413 -0.069021) (xy -0.513048 -0.040183) (xy -0.507178 -0.004134) (xy -0.503371 0.041721) (xy -0.501194 0.099976) (xy -0.500215 0.173227) (xy -0.500000 0.256781)
     (xy -0.500000 0.520000) (xy -0.690000 0.520000) (xy -0.690220 0.287500) (xy -0.690444 0.211756) (xy -0.691086 0.153155) (xy -0.692348 0.108842) (xy -0.694428 0.075961) (xy -0.697528 0.051656)
     (xy -0.701847 0.033072) (xy -0.707585 0.017353) (xy -0.709434 0.013163) (xy -0.736838 -0.024847) (xy -0.776397 -0.050969) (xy -0.823665 -0.064467) (xy -0.874196 -0.064610) (xy -0.923545 -0.050662)
     (xy -0.960000 -0.028204) (xy -0.985000 -0.007777) (xy -0.990000 0.253611) (xy -0.995000 0.515000) (xy -1.190000 0.520724) (xy -1.190000 -0.220000) (xy -1.090000 -0.220000) (xy -1.044609 -0.219812)
     (xy -1.015569 -0.218678) (xy -0.999230 -0.215749) (xy -0.991943 -0.210176) (xy -0.990059 -0.201108) (xy -0.990000 -0.196705) (xy -0.990000 -0.173410) (xy -0.929197 -0.203548) (xy -0.892763 -0.219971)
     (xy -0.860973 -0.229154) (xy -0.824830 -0.233052) (xy -0.790563 -0.233685) )(layer F.SilkS) (width  0.000000)
  )
  (fp_poly (pts (xy -3.206558 -0.519364) (xy -3.172182 -0.496274) (xy -3.148628 -0.461478) (xy -3.140000 -0.418233) (xy -3.149071 -0.376868) (xy -3.173289 -0.342011) (xy -3.208163 -0.318215) (xy -3.246775 -0.310000)
     (xy -3.278484 -0.314035) (xy -3.305192 -0.323918) (xy -3.307833 -0.325608) (xy -3.333716 -0.352539) (xy -3.352848 -0.388303) (xy -3.359963 -0.422004) (xy -3.351509 -0.456121) (xy -3.329926 -0.489644)
     (xy -3.300731 -0.514742) (xy -3.291350 -0.519442) (xy -3.247649 -0.528002) )(layer F.SilkS) (width  0.000000)
  )
  (fp_poly (pts (xy -2.278840 -0.525585) (xy -2.242996 -0.509326) (xy -2.215004 -0.481865) (xy -2.198186 -0.446088) (xy -2.195865 -0.404885) (xy -2.203762 -0.376423) (xy -2.228475 -0.340134) (xy -2.263606 -0.317396)
     (xy -2.304153 -0.309318) (xy -2.345118 -0.317010) (xy -2.377670 -0.337824) (xy -2.404994 -0.375087) (xy -2.415120 -0.416475) (xy -2.408484 -0.457464) (xy -2.385521 -0.493530) (xy -2.360796 -0.512940)
     (xy -2.319215 -0.527752) )(layer F.SilkS) (width  0.000000)
  )
)
