(footprint "PSON35P100X100X35-6N" (version 20211014) (generator pcbnew)
  (layer "F.Cu")
  (tedit 6356F9AC)
  (property "Sheetfile" "peripherals.kicad_sch")
  (property "Sheetname" "Peripherals")
  (attr through_hole)
  (fp_text reference "REF**" (at -0.018 -1.074281) (layer "F.SilkS") hide
    (effects (font (size 0.24 0.24) (thickness 0.15)))
    (tstamp 4330ade3-4e14-43f4-a62d-a1b0143680e0)
  )
  (fp_text value "74LVC1T45GS" (at 2.268 1.096241) (layer "F.Fab")
    (effects (font (size 0.24 0.24) (thickness 0.15)))
    (tstamp 9a2826c5-9aaa-4733-8bf0-9c1c2a87b623)
  )
  (fp_poly (pts
      (xy -0.525 -0.5)
      (xy -0.025 -0.5)
      (xy -0.025 -0.2)
      (xy -0.525 -0.2)
    ) (layer "F.Mask") (width 0.01) (fill solid) (tstamp 7c7b797e-4a79-44bc-92c5-58e526a89116))
  (fp_poly (pts
      (xy 0.025 -0.5)
      (xy 0.525 -0.5)
      (xy 0.525 -0.2)
      (xy 0.025 -0.2)
    ) (layer "F.Mask") (width 0.01) (fill solid) (tstamp 91c52b93-11f4-4013-ac6a-8bf7794df79a))
  (fp_poly (pts
      (xy -0.525 0.2)
      (xy -0.025 0.2)
      (xy -0.025 0.5)
      (xy -0.525 0.5)
    ) (layer "F.Mask") (width 0.01) (fill solid) (tstamp b81e966b-c8cc-4257-b35f-cb309b0b545f))
  (fp_poly (pts
      (xy 0.025 0.2)
      (xy 0.525 0.2)
      (xy 0.525 0.5)
      (xy 0.025 0.5)
    ) (layer "F.Mask") (width 0.01) (fill solid) (tstamp c74027b4-6692-4fe6-b1da-ec03369a334d))
  (fp_poly (pts
      (xy -0.525 -0.15)
      (xy -0.025 -0.15)
      (xy -0.025 0.15)
      (xy -0.525 0.15)
    ) (layer "F.Mask") (width 0.01) (fill solid) (tstamp d70a1d48-481f-4d23-bb23-b96f57b70e88))
  (fp_poly (pts
      (xy 0.025 -0.15)
      (xy 0.525 -0.15)
      (xy 0.525 0.15)
      (xy 0.025 0.15)
    ) (layer "F.Mask") (width 0.01) (fill solid) (tstamp e9d375d6-1193-475d-978f-e111bf349d72))
  (fp_line (start 0.75 -0.75) (end 0.75 0.75) (layer "F.CrtYd") (width 0.05) (tstamp 2b3216ad-476d-4b09-824f-051f13627f4d))
  (fp_line (start 0.75 0.75) (end -0.75 0.75) (layer "F.CrtYd") (width 0.05) (tstamp 786be74d-6992-468b-a320-cec17208bcfb))
  (fp_line (start -0.75 0.75) (end -0.75 -0.75) (layer "F.CrtYd") (width 0.05) (tstamp cd5af953-8f43-438d-8c09-b0bde9335b3c))
  (fp_line (start -0.75 -0.75) (end 0.75 -0.75) (layer "F.CrtYd") (width 0.05) (tstamp dce80d01-ef58-4b80-81eb-634ca71b71bd))
  (fp_line (start -0.5 0.5) (end -0.5 -0.5) (layer "F.Fab") (width 0.127) (tstamp 00ab07ac-05a3-4272-988c-7777d5299de1))
  (fp_line (start -0.5 -0.5) (end 0.5 -0.5) (layer "F.Fab") (width 0.127) (tstamp 3113bdfe-a6cb-4834-8ba8-98ca5cfb3ac9))
  (fp_line (start 0.5 0.5) (end -0.5 0.5) (layer "F.Fab") (width 0.127) (tstamp 3ab49ef0-3488-4a05-bf2c-325ded6b9f6e))
  (fp_line (start 0.5 -0.5) (end 0.5 0.5) (layer "F.Fab") (width 0.127) (tstamp 9a01585f-fa11-412d-8144-03fb78be517e))
  (fp_circle (center -1.1 -0.35) (end -1 -0.35) (layer "F.Fab") (width 0.2) (fill none) (tstamp 7d2e1c8c-ec1b-4fe0-bda0-e1c4619c9288))
  (pad "1" smd rect (at -0.275 -0.35) (size 0.4 0.2) (layers "F.Cu" "F.Paste") (tstamp 803f600e-506e-4d21-8e2a-c5d0347857ca))
  (pad "2" smd rect (at -0.275 0) (size 0.4 0.2) (layers "F.Cu" "F.Paste") (tstamp 28712c29-3d10-46b8-b955-4781262b0ca8))
  (pad "3" smd rect (at -0.275 0.35) (size 0.4 0.2) (layers "F.Cu" "F.Paste") (tstamp 47e969f2-e270-4c86-976a-5e6db857785e))
  (pad "4" smd rect (at 0.275 0.35) (size 0.4 0.2) (layers "F.Cu" "F.Paste") (tstamp 619c8f64-b2cd-4444-b978-4038e055e481))
  (pad "5" smd rect (at 0.275 0) (size 0.4 0.2) (layers "F.Cu" "F.Paste") (tstamp cf6de073-3953-4e2e-9492-e0cc4f79cf47))
  (pad "6" smd rect (at 0.275 -0.35) (size 0.4 0.2) (layers "F.Cu" "F.Paste") (tstamp 68a76831-9261-4e2c-b52e-8f3ad855b20c))
)
