%TF.GenerationSoftware,KiCad,Pcbnew,(7.0.0)*%
%TF.CreationDate,2023-03-19T21:59:39-07:00*%
%TF.ProjectId,F3 Gimbal Schematic,46332047-696d-4626-916c-20536368656d,rev?*%
%TF.SameCoordinates,Original*%
%TF.FileFunction,Copper,L3,Inr*%
%TF.FilePolarity,Positive*%
%FSLAX46Y46*%
G04 Gerber Fmt 4.6, Leading zero omitted, Abs format (unit mm)*
G04 Created by KiCad (PCBNEW (7.0.0)) date 2023-03-19 21:59:39*
%MOMM*%
%LPD*%
G01*
G04 APERTURE LIST*
%ADD10C,0.100000*%
%ADD11C,0.150000*%
%ADD12C,0.300000*%
%ADD13C,0.400000*%
%TA.AperFunction,ComponentPad*%
%ADD14C,2.550000*%
%TD*%
%TA.AperFunction,ComponentPad*%
%ADD15C,1.500000*%
%TD*%
%TA.AperFunction,ViaPad*%
%ADD16C,0.700000*%
%TD*%
%TA.AperFunction,ViaPad*%
%ADD17C,0.900000*%
%TD*%
%TA.AperFunction,ViaPad*%
%ADD18C,0.600000*%
%TD*%
%TA.AperFunction,Conductor*%
%ADD19C,0.250000*%
%TD*%
%TA.AperFunction,Conductor*%
%ADD20C,0.200000*%
%TD*%
%TA.AperFunction,Conductor*%
%ADD21C,1.000000*%
%TD*%
%TA.AperFunction,Conductor*%
%ADD22C,0.500000*%
%TD*%
%TA.AperFunction,Conductor*%
%ADD23C,2.500000*%
%TD*%
G04 APERTURE END LIST*
D10*
D11*
X177002200Y-166007200D02*
X285002200Y-166007200D01*
X285002200Y-198007200D01*
X177002200Y-198007200D01*
X177002200Y-166007200D01*
D10*
D11*
X10000000Y-10000000D02*
X287002200Y-10000000D01*
X287002200Y-200007200D01*
X10000000Y-200007200D01*
X10000000Y-10000000D01*
D10*
D11*
X12000000Y-12000000D02*
X285002200Y-12000000D01*
X285002200Y-198007200D01*
X12000000Y-198007200D01*
X12000000Y-12000000D01*
D10*
D11*
X60000000Y-12000000D02*
X60000000Y-10000000D01*
D10*
D11*
X110000000Y-12000000D02*
X110000000Y-10000000D01*
D10*
D11*
X160000000Y-12000000D02*
X160000000Y-10000000D01*
D10*
D11*
X210000000Y-12000000D02*
X210000000Y-10000000D01*
D10*
D11*
X260000000Y-12000000D02*
X260000000Y-10000000D01*
D10*
D11*
X35990476Y-11477595D02*
X35247619Y-11477595D01*
X35619047Y-11477595D02*
X35619047Y-10177595D01*
X35619047Y-10177595D02*
X35495238Y-10363309D01*
X35495238Y-10363309D02*
X35371428Y-10487119D01*
X35371428Y-10487119D02*
X35247619Y-10549023D01*
D10*
D11*
X85247619Y-10301404D02*
X85309523Y-10239500D01*
X85309523Y-10239500D02*
X85433333Y-10177595D01*
X85433333Y-10177595D02*
X85742857Y-10177595D01*
X85742857Y-10177595D02*
X85866666Y-10239500D01*
X85866666Y-10239500D02*
X85928571Y-10301404D01*
X85928571Y-10301404D02*
X85990476Y-10425214D01*
X85990476Y-10425214D02*
X85990476Y-10549023D01*
X85990476Y-10549023D02*
X85928571Y-10734738D01*
X85928571Y-10734738D02*
X85185714Y-11477595D01*
X85185714Y-11477595D02*
X85990476Y-11477595D01*
D10*
D11*
X135185714Y-10177595D02*
X135990476Y-10177595D01*
X135990476Y-10177595D02*
X135557142Y-10672833D01*
X135557142Y-10672833D02*
X135742857Y-10672833D01*
X135742857Y-10672833D02*
X135866666Y-10734738D01*
X135866666Y-10734738D02*
X135928571Y-10796642D01*
X135928571Y-10796642D02*
X135990476Y-10920452D01*
X135990476Y-10920452D02*
X135990476Y-11229976D01*
X135990476Y-11229976D02*
X135928571Y-11353785D01*
X135928571Y-11353785D02*
X135866666Y-11415690D01*
X135866666Y-11415690D02*
X135742857Y-11477595D01*
X135742857Y-11477595D02*
X135371428Y-11477595D01*
X135371428Y-11477595D02*
X135247619Y-11415690D01*
X135247619Y-11415690D02*
X135185714Y-11353785D01*
D10*
D11*
X185866666Y-10610928D02*
X185866666Y-11477595D01*
X185557142Y-10115690D02*
X185247619Y-11044261D01*
X185247619Y-11044261D02*
X186052380Y-11044261D01*
D10*
D11*
X235928571Y-10177595D02*
X235309523Y-10177595D01*
X235309523Y-10177595D02*
X235247619Y-10796642D01*
X235247619Y-10796642D02*
X235309523Y-10734738D01*
X235309523Y-10734738D02*
X235433333Y-10672833D01*
X235433333Y-10672833D02*
X235742857Y-10672833D01*
X235742857Y-10672833D02*
X235866666Y-10734738D01*
X235866666Y-10734738D02*
X235928571Y-10796642D01*
X235928571Y-10796642D02*
X235990476Y-10920452D01*
X235990476Y-10920452D02*
X235990476Y-11229976D01*
X235990476Y-11229976D02*
X235928571Y-11353785D01*
X235928571Y-11353785D02*
X235866666Y-11415690D01*
X235866666Y-11415690D02*
X235742857Y-11477595D01*
X235742857Y-11477595D02*
X235433333Y-11477595D01*
X235433333Y-11477595D02*
X235309523Y-11415690D01*
X235309523Y-11415690D02*
X235247619Y-11353785D01*
D10*
D11*
X285866666Y-10177595D02*
X285619047Y-10177595D01*
X285619047Y-10177595D02*
X285495238Y-10239500D01*
X285495238Y-10239500D02*
X285433333Y-10301404D01*
X285433333Y-10301404D02*
X285309523Y-10487119D01*
X285309523Y-10487119D02*
X285247619Y-10734738D01*
X285247619Y-10734738D02*
X285247619Y-11229976D01*
X285247619Y-11229976D02*
X285309523Y-11353785D01*
X285309523Y-11353785D02*
X285371428Y-11415690D01*
X285371428Y-11415690D02*
X285495238Y-11477595D01*
X285495238Y-11477595D02*
X285742857Y-11477595D01*
X285742857Y-11477595D02*
X285866666Y-11415690D01*
X285866666Y-11415690D02*
X285928571Y-11353785D01*
X285928571Y-11353785D02*
X285990476Y-11229976D01*
X285990476Y-11229976D02*
X285990476Y-10920452D01*
X285990476Y-10920452D02*
X285928571Y-10796642D01*
X285928571Y-10796642D02*
X285866666Y-10734738D01*
X285866666Y-10734738D02*
X285742857Y-10672833D01*
X285742857Y-10672833D02*
X285495238Y-10672833D01*
X285495238Y-10672833D02*
X285371428Y-10734738D01*
X285371428Y-10734738D02*
X285309523Y-10796642D01*
X285309523Y-10796642D02*
X285247619Y-10920452D01*
D10*
D11*
X60000000Y-198007200D02*
X60000000Y-200007200D01*
D10*
D11*
X110000000Y-198007200D02*
X110000000Y-200007200D01*
D10*
D11*
X160000000Y-198007200D02*
X160000000Y-200007200D01*
D10*
D11*
X210000000Y-198007200D02*
X210000000Y-200007200D01*
D10*
D11*
X260000000Y-198007200D02*
X260000000Y-200007200D01*
D10*
D11*
X35990476Y-199484795D02*
X35247619Y-199484795D01*
X35619047Y-199484795D02*
X35619047Y-198184795D01*
X35619047Y-198184795D02*
X35495238Y-198370509D01*
X35495238Y-198370509D02*
X35371428Y-198494319D01*
X35371428Y-198494319D02*
X35247619Y-198556223D01*
D10*
D11*
X85247619Y-198308604D02*
X85309523Y-198246700D01*
X85309523Y-198246700D02*
X85433333Y-198184795D01*
X85433333Y-198184795D02*
X85742857Y-198184795D01*
X85742857Y-198184795D02*
X85866666Y-198246700D01*
X85866666Y-198246700D02*
X85928571Y-198308604D01*
X85928571Y-198308604D02*
X85990476Y-198432414D01*
X85990476Y-198432414D02*
X85990476Y-198556223D01*
X85990476Y-198556223D02*
X85928571Y-198741938D01*
X85928571Y-198741938D02*
X85185714Y-199484795D01*
X85185714Y-199484795D02*
X85990476Y-199484795D01*
D10*
D11*
X135185714Y-198184795D02*
X135990476Y-198184795D01*
X135990476Y-198184795D02*
X135557142Y-198680033D01*
X135557142Y-198680033D02*
X135742857Y-198680033D01*
X135742857Y-198680033D02*
X135866666Y-198741938D01*
X135866666Y-198741938D02*
X135928571Y-198803842D01*
X135928571Y-198803842D02*
X135990476Y-198927652D01*
X135990476Y-198927652D02*
X135990476Y-199237176D01*
X135990476Y-199237176D02*
X135928571Y-199360985D01*
X135928571Y-199360985D02*
X135866666Y-199422890D01*
X135866666Y-199422890D02*
X135742857Y-199484795D01*
X135742857Y-199484795D02*
X135371428Y-199484795D01*
X135371428Y-199484795D02*
X135247619Y-199422890D01*
X135247619Y-199422890D02*
X135185714Y-199360985D01*
D10*
D11*
X185866666Y-198618128D02*
X185866666Y-199484795D01*
X185557142Y-198122890D02*
X185247619Y-199051461D01*
X185247619Y-199051461D02*
X186052380Y-199051461D01*
D10*
D11*
X235928571Y-198184795D02*
X235309523Y-198184795D01*
X235309523Y-198184795D02*
X235247619Y-198803842D01*
X235247619Y-198803842D02*
X235309523Y-198741938D01*
X235309523Y-198741938D02*
X235433333Y-198680033D01*
X235433333Y-198680033D02*
X235742857Y-198680033D01*
X235742857Y-198680033D02*
X235866666Y-198741938D01*
X235866666Y-198741938D02*
X235928571Y-198803842D01*
X235928571Y-198803842D02*
X235990476Y-198927652D01*
X235990476Y-198927652D02*
X235990476Y-199237176D01*
X235990476Y-199237176D02*
X235928571Y-199360985D01*
X235928571Y-199360985D02*
X235866666Y-199422890D01*
X235866666Y-199422890D02*
X235742857Y-199484795D01*
X235742857Y-199484795D02*
X235433333Y-199484795D01*
X235433333Y-199484795D02*
X235309523Y-199422890D01*
X235309523Y-199422890D02*
X235247619Y-199360985D01*
D10*
D11*
X285866666Y-198184795D02*
X285619047Y-198184795D01*
X285619047Y-198184795D02*
X285495238Y-198246700D01*
X285495238Y-198246700D02*
X285433333Y-198308604D01*
X285433333Y-198308604D02*
X285309523Y-198494319D01*
X285309523Y-198494319D02*
X285247619Y-198741938D01*
X285247619Y-198741938D02*
X285247619Y-199237176D01*
X285247619Y-199237176D02*
X285309523Y-199360985D01*
X285309523Y-199360985D02*
X285371428Y-199422890D01*
X285371428Y-199422890D02*
X285495238Y-199484795D01*
X285495238Y-199484795D02*
X285742857Y-199484795D01*
X285742857Y-199484795D02*
X285866666Y-199422890D01*
X285866666Y-199422890D02*
X285928571Y-199360985D01*
X285928571Y-199360985D02*
X285990476Y-199237176D01*
X285990476Y-199237176D02*
X285990476Y-198927652D01*
X285990476Y-198927652D02*
X285928571Y-198803842D01*
X285928571Y-198803842D02*
X285866666Y-198741938D01*
X285866666Y-198741938D02*
X285742857Y-198680033D01*
X285742857Y-198680033D02*
X285495238Y-198680033D01*
X285495238Y-198680033D02*
X285371428Y-198741938D01*
X285371428Y-198741938D02*
X285309523Y-198803842D01*
X285309523Y-198803842D02*
X285247619Y-198927652D01*
D10*
D11*
X10000000Y-60000000D02*
X12000000Y-60000000D01*
D10*
D11*
X10000000Y-110000000D02*
X12000000Y-110000000D01*
D10*
D11*
X10000000Y-160000000D02*
X12000000Y-160000000D01*
D10*
D11*
X10690476Y-35106166D02*
X11309523Y-35106166D01*
X10566666Y-35477595D02*
X10999999Y-34177595D01*
X10999999Y-34177595D02*
X11433333Y-35477595D01*
D10*
D11*
X11092857Y-84796642D02*
X11278571Y-84858547D01*
X11278571Y-84858547D02*
X11340476Y-84920452D01*
X11340476Y-84920452D02*
X11402380Y-85044261D01*
X11402380Y-85044261D02*
X11402380Y-85229976D01*
X11402380Y-85229976D02*
X11340476Y-85353785D01*
X11340476Y-85353785D02*
X11278571Y-85415690D01*
X11278571Y-85415690D02*
X11154761Y-85477595D01*
X11154761Y-85477595D02*
X10659523Y-85477595D01*
X10659523Y-85477595D02*
X10659523Y-84177595D01*
X10659523Y-84177595D02*
X11092857Y-84177595D01*
X11092857Y-84177595D02*
X11216666Y-84239500D01*
X11216666Y-84239500D02*
X11278571Y-84301404D01*
X11278571Y-84301404D02*
X11340476Y-84425214D01*
X11340476Y-84425214D02*
X11340476Y-84549023D01*
X11340476Y-84549023D02*
X11278571Y-84672833D01*
X11278571Y-84672833D02*
X11216666Y-84734738D01*
X11216666Y-84734738D02*
X11092857Y-84796642D01*
X11092857Y-84796642D02*
X10659523Y-84796642D01*
D10*
D11*
X11402380Y-135353785D02*
X11340476Y-135415690D01*
X11340476Y-135415690D02*
X11154761Y-135477595D01*
X11154761Y-135477595D02*
X11030952Y-135477595D01*
X11030952Y-135477595D02*
X10845238Y-135415690D01*
X10845238Y-135415690D02*
X10721428Y-135291880D01*
X10721428Y-135291880D02*
X10659523Y-135168071D01*
X10659523Y-135168071D02*
X10597619Y-134920452D01*
X10597619Y-134920452D02*
X10597619Y-134734738D01*
X10597619Y-134734738D02*
X10659523Y-134487119D01*
X10659523Y-134487119D02*
X10721428Y-134363309D01*
X10721428Y-134363309D02*
X10845238Y-134239500D01*
X10845238Y-134239500D02*
X11030952Y-134177595D01*
X11030952Y-134177595D02*
X11154761Y-134177595D01*
X11154761Y-134177595D02*
X11340476Y-134239500D01*
X11340476Y-134239500D02*
X11402380Y-134301404D01*
D10*
D11*
X10659523Y-185477595D02*
X10659523Y-184177595D01*
X10659523Y-184177595D02*
X10969047Y-184177595D01*
X10969047Y-184177595D02*
X11154761Y-184239500D01*
X11154761Y-184239500D02*
X11278571Y-184363309D01*
X11278571Y-184363309D02*
X11340476Y-184487119D01*
X11340476Y-184487119D02*
X11402380Y-184734738D01*
X11402380Y-184734738D02*
X11402380Y-184920452D01*
X11402380Y-184920452D02*
X11340476Y-185168071D01*
X11340476Y-185168071D02*
X11278571Y-185291880D01*
X11278571Y-185291880D02*
X11154761Y-185415690D01*
X11154761Y-185415690D02*
X10969047Y-185477595D01*
X10969047Y-185477595D02*
X10659523Y-185477595D01*
D10*
D11*
X287002200Y-60000000D02*
X285002200Y-60000000D01*
D10*
D11*
X287002200Y-110000000D02*
X285002200Y-110000000D01*
D10*
D11*
X287002200Y-160000000D02*
X285002200Y-160000000D01*
D10*
D11*
X285692676Y-35106166D02*
X286311723Y-35106166D01*
X285568866Y-35477595D02*
X286002199Y-34177595D01*
X286002199Y-34177595D02*
X286435533Y-35477595D01*
D10*
D11*
X286095057Y-84796642D02*
X286280771Y-84858547D01*
X286280771Y-84858547D02*
X286342676Y-84920452D01*
X286342676Y-84920452D02*
X286404580Y-85044261D01*
X286404580Y-85044261D02*
X286404580Y-85229976D01*
X286404580Y-85229976D02*
X286342676Y-85353785D01*
X286342676Y-85353785D02*
X286280771Y-85415690D01*
X286280771Y-85415690D02*
X286156961Y-85477595D01*
X286156961Y-85477595D02*
X285661723Y-85477595D01*
X285661723Y-85477595D02*
X285661723Y-84177595D01*
X285661723Y-84177595D02*
X286095057Y-84177595D01*
X286095057Y-84177595D02*
X286218866Y-84239500D01*
X286218866Y-84239500D02*
X286280771Y-84301404D01*
X286280771Y-84301404D02*
X286342676Y-84425214D01*
X286342676Y-84425214D02*
X286342676Y-84549023D01*
X286342676Y-84549023D02*
X286280771Y-84672833D01*
X286280771Y-84672833D02*
X286218866Y-84734738D01*
X286218866Y-84734738D02*
X286095057Y-84796642D01*
X286095057Y-84796642D02*
X285661723Y-84796642D01*
D10*
D11*
X286404580Y-135353785D02*
X286342676Y-135415690D01*
X286342676Y-135415690D02*
X286156961Y-135477595D01*
X286156961Y-135477595D02*
X286033152Y-135477595D01*
X286033152Y-135477595D02*
X285847438Y-135415690D01*
X285847438Y-135415690D02*
X285723628Y-135291880D01*
X285723628Y-135291880D02*
X285661723Y-135168071D01*
X285661723Y-135168071D02*
X285599819Y-134920452D01*
X285599819Y-134920452D02*
X285599819Y-134734738D01*
X285599819Y-134734738D02*
X285661723Y-134487119D01*
X285661723Y-134487119D02*
X285723628Y-134363309D01*
X285723628Y-134363309D02*
X285847438Y-134239500D01*
X285847438Y-134239500D02*
X286033152Y-134177595D01*
X286033152Y-134177595D02*
X286156961Y-134177595D01*
X286156961Y-134177595D02*
X286342676Y-134239500D01*
X286342676Y-134239500D02*
X286404580Y-134301404D01*
D10*
D11*
X285661723Y-185477595D02*
X285661723Y-184177595D01*
X285661723Y-184177595D02*
X285971247Y-184177595D01*
X285971247Y-184177595D02*
X286156961Y-184239500D01*
X286156961Y-184239500D02*
X286280771Y-184363309D01*
X286280771Y-184363309D02*
X286342676Y-184487119D01*
X286342676Y-184487119D02*
X286404580Y-184734738D01*
X286404580Y-184734738D02*
X286404580Y-184920452D01*
X286404580Y-184920452D02*
X286342676Y-185168071D01*
X286342676Y-185168071D02*
X286280771Y-185291880D01*
X286280771Y-185291880D02*
X286156961Y-185415690D01*
X286156961Y-185415690D02*
X285971247Y-185477595D01*
X285971247Y-185477595D02*
X285661723Y-185477595D01*
D10*
D11*
X200359342Y-193658271D02*
X200359342Y-192158271D01*
X200359342Y-192158271D02*
X200716485Y-192158271D01*
X200716485Y-192158271D02*
X200930771Y-192229700D01*
X200930771Y-192229700D02*
X201073628Y-192372557D01*
X201073628Y-192372557D02*
X201145057Y-192515414D01*
X201145057Y-192515414D02*
X201216485Y-192801128D01*
X201216485Y-192801128D02*
X201216485Y-193015414D01*
X201216485Y-193015414D02*
X201145057Y-193301128D01*
X201145057Y-193301128D02*
X201073628Y-193443985D01*
X201073628Y-193443985D02*
X200930771Y-193586842D01*
X200930771Y-193586842D02*
X200716485Y-193658271D01*
X200716485Y-193658271D02*
X200359342Y-193658271D01*
X202502200Y-193658271D02*
X202502200Y-192872557D01*
X202502200Y-192872557D02*
X202430771Y-192729700D01*
X202430771Y-192729700D02*
X202287914Y-192658271D01*
X202287914Y-192658271D02*
X202002200Y-192658271D01*
X202002200Y-192658271D02*
X201859342Y-192729700D01*
X202502200Y-193586842D02*
X202359342Y-193658271D01*
X202359342Y-193658271D02*
X202002200Y-193658271D01*
X202002200Y-193658271D02*
X201859342Y-193586842D01*
X201859342Y-193586842D02*
X201787914Y-193443985D01*
X201787914Y-193443985D02*
X201787914Y-193301128D01*
X201787914Y-193301128D02*
X201859342Y-193158271D01*
X201859342Y-193158271D02*
X202002200Y-193086842D01*
X202002200Y-193086842D02*
X202359342Y-193086842D01*
X202359342Y-193086842D02*
X202502200Y-193015414D01*
X203002200Y-192658271D02*
X203573628Y-192658271D01*
X203216485Y-192158271D02*
X203216485Y-193443985D01*
X203216485Y-193443985D02*
X203287914Y-193586842D01*
X203287914Y-193586842D02*
X203430771Y-193658271D01*
X203430771Y-193658271D02*
X203573628Y-193658271D01*
X204645057Y-193586842D02*
X204502200Y-193658271D01*
X204502200Y-193658271D02*
X204216486Y-193658271D01*
X204216486Y-193658271D02*
X204073628Y-193586842D01*
X204073628Y-193586842D02*
X204002200Y-193443985D01*
X204002200Y-193443985D02*
X204002200Y-192872557D01*
X204002200Y-192872557D02*
X204073628Y-192729700D01*
X204073628Y-192729700D02*
X204216486Y-192658271D01*
X204216486Y-192658271D02*
X204502200Y-192658271D01*
X204502200Y-192658271D02*
X204645057Y-192729700D01*
X204645057Y-192729700D02*
X204716486Y-192872557D01*
X204716486Y-192872557D02*
X204716486Y-193015414D01*
X204716486Y-193015414D02*
X204002200Y-193158271D01*
X205359342Y-193515414D02*
X205430771Y-193586842D01*
X205430771Y-193586842D02*
X205359342Y-193658271D01*
X205359342Y-193658271D02*
X205287914Y-193586842D01*
X205287914Y-193586842D02*
X205359342Y-193515414D01*
X205359342Y-193515414D02*
X205359342Y-193658271D01*
X205359342Y-192729700D02*
X205430771Y-192801128D01*
X205430771Y-192801128D02*
X205359342Y-192872557D01*
X205359342Y-192872557D02*
X205287914Y-192801128D01*
X205287914Y-192801128D02*
X205359342Y-192729700D01*
X205359342Y-192729700D02*
X205359342Y-192872557D01*
D10*
D11*
X177002200Y-194507200D02*
X285002200Y-194507200D01*
D10*
D11*
X178359342Y-196458271D02*
X178359342Y-194958271D01*
X179216485Y-196458271D02*
X178573628Y-195601128D01*
X179216485Y-194958271D02*
X178359342Y-195815414D01*
X179859342Y-196458271D02*
X179859342Y-195458271D01*
X179859342Y-194958271D02*
X179787914Y-195029700D01*
X179787914Y-195029700D02*
X179859342Y-195101128D01*
X179859342Y-195101128D02*
X179930771Y-195029700D01*
X179930771Y-195029700D02*
X179859342Y-194958271D01*
X179859342Y-194958271D02*
X179859342Y-195101128D01*
X181430771Y-196315414D02*
X181359343Y-196386842D01*
X181359343Y-196386842D02*
X181145057Y-196458271D01*
X181145057Y-196458271D02*
X181002200Y-196458271D01*
X181002200Y-196458271D02*
X180787914Y-196386842D01*
X180787914Y-196386842D02*
X180645057Y-196243985D01*
X180645057Y-196243985D02*
X180573628Y-196101128D01*
X180573628Y-196101128D02*
X180502200Y-195815414D01*
X180502200Y-195815414D02*
X180502200Y-195601128D01*
X180502200Y-195601128D02*
X180573628Y-195315414D01*
X180573628Y-195315414D02*
X180645057Y-195172557D01*
X180645057Y-195172557D02*
X180787914Y-195029700D01*
X180787914Y-195029700D02*
X181002200Y-194958271D01*
X181002200Y-194958271D02*
X181145057Y-194958271D01*
X181145057Y-194958271D02*
X181359343Y-195029700D01*
X181359343Y-195029700D02*
X181430771Y-195101128D01*
X182716486Y-196458271D02*
X182716486Y-195672557D01*
X182716486Y-195672557D02*
X182645057Y-195529700D01*
X182645057Y-195529700D02*
X182502200Y-195458271D01*
X182502200Y-195458271D02*
X182216486Y-195458271D01*
X182216486Y-195458271D02*
X182073628Y-195529700D01*
X182716486Y-196386842D02*
X182573628Y-196458271D01*
X182573628Y-196458271D02*
X182216486Y-196458271D01*
X182216486Y-196458271D02*
X182073628Y-196386842D01*
X182073628Y-196386842D02*
X182002200Y-196243985D01*
X182002200Y-196243985D02*
X182002200Y-196101128D01*
X182002200Y-196101128D02*
X182073628Y-195958271D01*
X182073628Y-195958271D02*
X182216486Y-195886842D01*
X182216486Y-195886842D02*
X182573628Y-195886842D01*
X182573628Y-195886842D02*
X182716486Y-195815414D01*
X184073629Y-196458271D02*
X184073629Y-194958271D01*
X184073629Y-196386842D02*
X183930771Y-196458271D01*
X183930771Y-196458271D02*
X183645057Y-196458271D01*
X183645057Y-196458271D02*
X183502200Y-196386842D01*
X183502200Y-196386842D02*
X183430771Y-196315414D01*
X183430771Y-196315414D02*
X183359343Y-196172557D01*
X183359343Y-196172557D02*
X183359343Y-195743985D01*
X183359343Y-195743985D02*
X183430771Y-195601128D01*
X183430771Y-195601128D02*
X183502200Y-195529700D01*
X183502200Y-195529700D02*
X183645057Y-195458271D01*
X183645057Y-195458271D02*
X183930771Y-195458271D01*
X183930771Y-195458271D02*
X184073629Y-195529700D01*
X185687914Y-195672557D02*
X186187914Y-195672557D01*
X186402200Y-196458271D02*
X185687914Y-196458271D01*
X185687914Y-196458271D02*
X185687914Y-194958271D01*
X185687914Y-194958271D02*
X186402200Y-194958271D01*
X187045057Y-196315414D02*
X187116486Y-196386842D01*
X187116486Y-196386842D02*
X187045057Y-196458271D01*
X187045057Y-196458271D02*
X186973629Y-196386842D01*
X186973629Y-196386842D02*
X187045057Y-196315414D01*
X187045057Y-196315414D02*
X187045057Y-196458271D01*
X187759343Y-196458271D02*
X187759343Y-194958271D01*
X187759343Y-194958271D02*
X188116486Y-194958271D01*
X188116486Y-194958271D02*
X188330772Y-195029700D01*
X188330772Y-195029700D02*
X188473629Y-195172557D01*
X188473629Y-195172557D02*
X188545058Y-195315414D01*
X188545058Y-195315414D02*
X188616486Y-195601128D01*
X188616486Y-195601128D02*
X188616486Y-195815414D01*
X188616486Y-195815414D02*
X188545058Y-196101128D01*
X188545058Y-196101128D02*
X188473629Y-196243985D01*
X188473629Y-196243985D02*
X188330772Y-196386842D01*
X188330772Y-196386842D02*
X188116486Y-196458271D01*
X188116486Y-196458271D02*
X187759343Y-196458271D01*
X189259343Y-196315414D02*
X189330772Y-196386842D01*
X189330772Y-196386842D02*
X189259343Y-196458271D01*
X189259343Y-196458271D02*
X189187915Y-196386842D01*
X189187915Y-196386842D02*
X189259343Y-196315414D01*
X189259343Y-196315414D02*
X189259343Y-196458271D01*
X189902201Y-196029700D02*
X190616487Y-196029700D01*
X189759344Y-196458271D02*
X190259344Y-194958271D01*
X190259344Y-194958271D02*
X190759344Y-196458271D01*
X191259343Y-196315414D02*
X191330772Y-196386842D01*
X191330772Y-196386842D02*
X191259343Y-196458271D01*
X191259343Y-196458271D02*
X191187915Y-196386842D01*
X191187915Y-196386842D02*
X191259343Y-196315414D01*
X191259343Y-196315414D02*
X191259343Y-196458271D01*
X193773629Y-196458271D02*
X193773629Y-194958271D01*
X193916487Y-195886842D02*
X194345058Y-196458271D01*
X194345058Y-195458271D02*
X193773629Y-196029700D01*
X194987915Y-196458271D02*
X194987915Y-195458271D01*
X194987915Y-194958271D02*
X194916487Y-195029700D01*
X194916487Y-195029700D02*
X194987915Y-195101128D01*
X194987915Y-195101128D02*
X195059344Y-195029700D01*
X195059344Y-195029700D02*
X194987915Y-194958271D01*
X194987915Y-194958271D02*
X194987915Y-195101128D01*
X196345059Y-196386842D02*
X196202201Y-196458271D01*
X196202201Y-196458271D02*
X195916487Y-196458271D01*
X195916487Y-196458271D02*
X195773630Y-196386842D01*
X195773630Y-196386842D02*
X195702201Y-196315414D01*
X195702201Y-196315414D02*
X195630773Y-196172557D01*
X195630773Y-196172557D02*
X195630773Y-195743985D01*
X195630773Y-195743985D02*
X195702201Y-195601128D01*
X195702201Y-195601128D02*
X195773630Y-195529700D01*
X195773630Y-195529700D02*
X195916487Y-195458271D01*
X195916487Y-195458271D02*
X196202201Y-195458271D01*
X196202201Y-195458271D02*
X196345059Y-195529700D01*
X197630773Y-196458271D02*
X197630773Y-195672557D01*
X197630773Y-195672557D02*
X197559344Y-195529700D01*
X197559344Y-195529700D02*
X197416487Y-195458271D01*
X197416487Y-195458271D02*
X197130773Y-195458271D01*
X197130773Y-195458271D02*
X196987915Y-195529700D01*
X197630773Y-196386842D02*
X197487915Y-196458271D01*
X197487915Y-196458271D02*
X197130773Y-196458271D01*
X197130773Y-196458271D02*
X196987915Y-196386842D01*
X196987915Y-196386842D02*
X196916487Y-196243985D01*
X196916487Y-196243985D02*
X196916487Y-196101128D01*
X196916487Y-196101128D02*
X196987915Y-195958271D01*
X196987915Y-195958271D02*
X197130773Y-195886842D01*
X197130773Y-195886842D02*
X197487915Y-195886842D01*
X197487915Y-195886842D02*
X197630773Y-195815414D01*
X198987916Y-196458271D02*
X198987916Y-194958271D01*
X198987916Y-196386842D02*
X198845058Y-196458271D01*
X198845058Y-196458271D02*
X198559344Y-196458271D01*
X198559344Y-196458271D02*
X198416487Y-196386842D01*
X198416487Y-196386842D02*
X198345058Y-196315414D01*
X198345058Y-196315414D02*
X198273630Y-196172557D01*
X198273630Y-196172557D02*
X198273630Y-195743985D01*
X198273630Y-195743985D02*
X198345058Y-195601128D01*
X198345058Y-195601128D02*
X198416487Y-195529700D01*
X198416487Y-195529700D02*
X198559344Y-195458271D01*
X198559344Y-195458271D02*
X198845058Y-195458271D01*
X198845058Y-195458271D02*
X198987916Y-195529700D01*
X201030773Y-197029700D02*
X200959344Y-196958271D01*
X200959344Y-196958271D02*
X200816487Y-196743985D01*
X200816487Y-196743985D02*
X200745059Y-196601128D01*
X200745059Y-196601128D02*
X200673630Y-196386842D01*
X200673630Y-196386842D02*
X200602201Y-196029700D01*
X200602201Y-196029700D02*
X200602201Y-195743985D01*
X200602201Y-195743985D02*
X200673630Y-195386842D01*
X200673630Y-195386842D02*
X200745059Y-195172557D01*
X200745059Y-195172557D02*
X200816487Y-195029700D01*
X200816487Y-195029700D02*
X200959344Y-194815414D01*
X200959344Y-194815414D02*
X201030773Y-194743985D01*
X201459344Y-194958271D02*
X202459344Y-194958271D01*
X202459344Y-194958271D02*
X201816487Y-196458271D01*
X203030772Y-196315414D02*
X203102201Y-196386842D01*
X203102201Y-196386842D02*
X203030772Y-196458271D01*
X203030772Y-196458271D02*
X202959344Y-196386842D01*
X202959344Y-196386842D02*
X203030772Y-196315414D01*
X203030772Y-196315414D02*
X203030772Y-196458271D01*
X204030773Y-194958271D02*
X204173630Y-194958271D01*
X204173630Y-194958271D02*
X204316487Y-195029700D01*
X204316487Y-195029700D02*
X204387916Y-195101128D01*
X204387916Y-195101128D02*
X204459344Y-195243985D01*
X204459344Y-195243985D02*
X204530773Y-195529700D01*
X204530773Y-195529700D02*
X204530773Y-195886842D01*
X204530773Y-195886842D02*
X204459344Y-196172557D01*
X204459344Y-196172557D02*
X204387916Y-196315414D01*
X204387916Y-196315414D02*
X204316487Y-196386842D01*
X204316487Y-196386842D02*
X204173630Y-196458271D01*
X204173630Y-196458271D02*
X204030773Y-196458271D01*
X204030773Y-196458271D02*
X203887916Y-196386842D01*
X203887916Y-196386842D02*
X203816487Y-196315414D01*
X203816487Y-196315414D02*
X203745058Y-196172557D01*
X203745058Y-196172557D02*
X203673630Y-195886842D01*
X203673630Y-195886842D02*
X203673630Y-195529700D01*
X203673630Y-195529700D02*
X203745058Y-195243985D01*
X203745058Y-195243985D02*
X203816487Y-195101128D01*
X203816487Y-195101128D02*
X203887916Y-195029700D01*
X203887916Y-195029700D02*
X204030773Y-194958271D01*
X205173629Y-196315414D02*
X205245058Y-196386842D01*
X205245058Y-196386842D02*
X205173629Y-196458271D01*
X205173629Y-196458271D02*
X205102201Y-196386842D01*
X205102201Y-196386842D02*
X205173629Y-196315414D01*
X205173629Y-196315414D02*
X205173629Y-196458271D01*
X206173630Y-194958271D02*
X206316487Y-194958271D01*
X206316487Y-194958271D02*
X206459344Y-195029700D01*
X206459344Y-195029700D02*
X206530773Y-195101128D01*
X206530773Y-195101128D02*
X206602201Y-195243985D01*
X206602201Y-195243985D02*
X206673630Y-195529700D01*
X206673630Y-195529700D02*
X206673630Y-195886842D01*
X206673630Y-195886842D02*
X206602201Y-196172557D01*
X206602201Y-196172557D02*
X206530773Y-196315414D01*
X206530773Y-196315414D02*
X206459344Y-196386842D01*
X206459344Y-196386842D02*
X206316487Y-196458271D01*
X206316487Y-196458271D02*
X206173630Y-196458271D01*
X206173630Y-196458271D02*
X206030773Y-196386842D01*
X206030773Y-196386842D02*
X205959344Y-196315414D01*
X205959344Y-196315414D02*
X205887915Y-196172557D01*
X205887915Y-196172557D02*
X205816487Y-195886842D01*
X205816487Y-195886842D02*
X205816487Y-195529700D01*
X205816487Y-195529700D02*
X205887915Y-195243985D01*
X205887915Y-195243985D02*
X205959344Y-195101128D01*
X205959344Y-195101128D02*
X206030773Y-195029700D01*
X206030773Y-195029700D02*
X206173630Y-194958271D01*
X207173629Y-197029700D02*
X207245058Y-196958271D01*
X207245058Y-196958271D02*
X207387915Y-196743985D01*
X207387915Y-196743985D02*
X207459344Y-196601128D01*
X207459344Y-196601128D02*
X207530772Y-196386842D01*
X207530772Y-196386842D02*
X207602201Y-196029700D01*
X207602201Y-196029700D02*
X207602201Y-195743985D01*
X207602201Y-195743985D02*
X207530772Y-195386842D01*
X207530772Y-195386842D02*
X207459344Y-195172557D01*
X207459344Y-195172557D02*
X207387915Y-195029700D01*
X207387915Y-195029700D02*
X207245058Y-194815414D01*
X207245058Y-194815414D02*
X207173629Y-194743985D01*
D10*
D11*
X177002200Y-191507200D02*
X285002200Y-191507200D01*
D10*
D12*
X264216485Y-193658271D02*
X263716485Y-192943985D01*
X263359342Y-193658271D02*
X263359342Y-192158271D01*
X263359342Y-192158271D02*
X263930771Y-192158271D01*
X263930771Y-192158271D02*
X264073628Y-192229700D01*
X264073628Y-192229700D02*
X264145057Y-192301128D01*
X264145057Y-192301128D02*
X264216485Y-192443985D01*
X264216485Y-192443985D02*
X264216485Y-192658271D01*
X264216485Y-192658271D02*
X264145057Y-192801128D01*
X264145057Y-192801128D02*
X264073628Y-192872557D01*
X264073628Y-192872557D02*
X263930771Y-192943985D01*
X263930771Y-192943985D02*
X263359342Y-192943985D01*
X265430771Y-193586842D02*
X265287914Y-193658271D01*
X265287914Y-193658271D02*
X265002200Y-193658271D01*
X265002200Y-193658271D02*
X264859342Y-193586842D01*
X264859342Y-193586842D02*
X264787914Y-193443985D01*
X264787914Y-193443985D02*
X264787914Y-192872557D01*
X264787914Y-192872557D02*
X264859342Y-192729700D01*
X264859342Y-192729700D02*
X265002200Y-192658271D01*
X265002200Y-192658271D02*
X265287914Y-192658271D01*
X265287914Y-192658271D02*
X265430771Y-192729700D01*
X265430771Y-192729700D02*
X265502200Y-192872557D01*
X265502200Y-192872557D02*
X265502200Y-193015414D01*
X265502200Y-193015414D02*
X264787914Y-193158271D01*
X266002199Y-192658271D02*
X266359342Y-193658271D01*
X266359342Y-193658271D02*
X266716485Y-192658271D01*
X267287913Y-193515414D02*
X267359342Y-193586842D01*
X267359342Y-193586842D02*
X267287913Y-193658271D01*
X267287913Y-193658271D02*
X267216485Y-193586842D01*
X267216485Y-193586842D02*
X267287913Y-193515414D01*
X267287913Y-193515414D02*
X267287913Y-193658271D01*
X267287913Y-192729700D02*
X267359342Y-192801128D01*
X267359342Y-192801128D02*
X267287913Y-192872557D01*
X267287913Y-192872557D02*
X267216485Y-192801128D01*
X267216485Y-192801128D02*
X267287913Y-192729700D01*
X267287913Y-192729700D02*
X267287913Y-192872557D01*
D10*
D11*
X178287914Y-193586842D02*
X178502200Y-193658271D01*
X178502200Y-193658271D02*
X178859342Y-193658271D01*
X178859342Y-193658271D02*
X179002200Y-193586842D01*
X179002200Y-193586842D02*
X179073628Y-193515414D01*
X179073628Y-193515414D02*
X179145057Y-193372557D01*
X179145057Y-193372557D02*
X179145057Y-193229700D01*
X179145057Y-193229700D02*
X179073628Y-193086842D01*
X179073628Y-193086842D02*
X179002200Y-193015414D01*
X179002200Y-193015414D02*
X178859342Y-192943985D01*
X178859342Y-192943985D02*
X178573628Y-192872557D01*
X178573628Y-192872557D02*
X178430771Y-192801128D01*
X178430771Y-192801128D02*
X178359342Y-192729700D01*
X178359342Y-192729700D02*
X178287914Y-192586842D01*
X178287914Y-192586842D02*
X178287914Y-192443985D01*
X178287914Y-192443985D02*
X178359342Y-192301128D01*
X178359342Y-192301128D02*
X178430771Y-192229700D01*
X178430771Y-192229700D02*
X178573628Y-192158271D01*
X178573628Y-192158271D02*
X178930771Y-192158271D01*
X178930771Y-192158271D02*
X179145057Y-192229700D01*
X179787913Y-193658271D02*
X179787913Y-192658271D01*
X179787913Y-192158271D02*
X179716485Y-192229700D01*
X179716485Y-192229700D02*
X179787913Y-192301128D01*
X179787913Y-192301128D02*
X179859342Y-192229700D01*
X179859342Y-192229700D02*
X179787913Y-192158271D01*
X179787913Y-192158271D02*
X179787913Y-192301128D01*
X180359342Y-192658271D02*
X181145057Y-192658271D01*
X181145057Y-192658271D02*
X180359342Y-193658271D01*
X180359342Y-193658271D02*
X181145057Y-193658271D01*
X182287914Y-193586842D02*
X182145057Y-193658271D01*
X182145057Y-193658271D02*
X181859343Y-193658271D01*
X181859343Y-193658271D02*
X181716485Y-193586842D01*
X181716485Y-193586842D02*
X181645057Y-193443985D01*
X181645057Y-193443985D02*
X181645057Y-192872557D01*
X181645057Y-192872557D02*
X181716485Y-192729700D01*
X181716485Y-192729700D02*
X181859343Y-192658271D01*
X181859343Y-192658271D02*
X182145057Y-192658271D01*
X182145057Y-192658271D02*
X182287914Y-192729700D01*
X182287914Y-192729700D02*
X182359343Y-192872557D01*
X182359343Y-192872557D02*
X182359343Y-193015414D01*
X182359343Y-193015414D02*
X181645057Y-193158271D01*
X183002199Y-193515414D02*
X183073628Y-193586842D01*
X183073628Y-193586842D02*
X183002199Y-193658271D01*
X183002199Y-193658271D02*
X182930771Y-193586842D01*
X182930771Y-193586842D02*
X183002199Y-193515414D01*
X183002199Y-193515414D02*
X183002199Y-193658271D01*
X183002199Y-192729700D02*
X183073628Y-192801128D01*
X183073628Y-192801128D02*
X183002199Y-192872557D01*
X183002199Y-192872557D02*
X182930771Y-192801128D01*
X182930771Y-192801128D02*
X183002199Y-192729700D01*
X183002199Y-192729700D02*
X183002199Y-192872557D01*
X184545057Y-193229700D02*
X185259343Y-193229700D01*
X184402200Y-193658271D02*
X184902200Y-192158271D01*
X184902200Y-192158271D02*
X185402200Y-193658271D01*
X186545057Y-192658271D02*
X186545057Y-193658271D01*
X186187914Y-192086842D02*
X185830771Y-193158271D01*
X185830771Y-193158271D02*
X186759342Y-193158271D01*
D10*
D11*
X263359342Y-196458271D02*
X263359342Y-194958271D01*
X264716486Y-196458271D02*
X264716486Y-194958271D01*
X264716486Y-196386842D02*
X264573628Y-196458271D01*
X264573628Y-196458271D02*
X264287914Y-196458271D01*
X264287914Y-196458271D02*
X264145057Y-196386842D01*
X264145057Y-196386842D02*
X264073628Y-196315414D01*
X264073628Y-196315414D02*
X264002200Y-196172557D01*
X264002200Y-196172557D02*
X264002200Y-195743985D01*
X264002200Y-195743985D02*
X264073628Y-195601128D01*
X264073628Y-195601128D02*
X264145057Y-195529700D01*
X264145057Y-195529700D02*
X264287914Y-195458271D01*
X264287914Y-195458271D02*
X264573628Y-195458271D01*
X264573628Y-195458271D02*
X264716486Y-195529700D01*
X265430771Y-196315414D02*
X265502200Y-196386842D01*
X265502200Y-196386842D02*
X265430771Y-196458271D01*
X265430771Y-196458271D02*
X265359343Y-196386842D01*
X265359343Y-196386842D02*
X265430771Y-196315414D01*
X265430771Y-196315414D02*
X265430771Y-196458271D01*
X265430771Y-195529700D02*
X265502200Y-195601128D01*
X265502200Y-195601128D02*
X265430771Y-195672557D01*
X265430771Y-195672557D02*
X265359343Y-195601128D01*
X265359343Y-195601128D02*
X265430771Y-195529700D01*
X265430771Y-195529700D02*
X265430771Y-195672557D01*
X267830772Y-196458271D02*
X266973629Y-196458271D01*
X267402200Y-196458271D02*
X267402200Y-194958271D01*
X267402200Y-194958271D02*
X267259343Y-195172557D01*
X267259343Y-195172557D02*
X267116486Y-195315414D01*
X267116486Y-195315414D02*
X266973629Y-195386842D01*
X269545057Y-194886842D02*
X268259343Y-196815414D01*
X270830772Y-196458271D02*
X269973629Y-196458271D01*
X270402200Y-196458271D02*
X270402200Y-194958271D01*
X270402200Y-194958271D02*
X270259343Y-195172557D01*
X270259343Y-195172557D02*
X270116486Y-195315414D01*
X270116486Y-195315414D02*
X269973629Y-195386842D01*
D10*
D11*
X177002200Y-187507200D02*
X285002200Y-187507200D01*
D10*
D13*
X178454580Y-188041961D02*
X179597438Y-188041961D01*
X178776009Y-190041961D02*
X179026009Y-188041961D01*
X180014105Y-190041961D02*
X180180771Y-188708628D01*
X180264105Y-188041961D02*
X180156962Y-188137200D01*
X180156962Y-188137200D02*
X180240295Y-188232438D01*
X180240295Y-188232438D02*
X180347438Y-188137200D01*
X180347438Y-188137200D02*
X180264105Y-188041961D01*
X180264105Y-188041961D02*
X180240295Y-188232438D01*
X180847438Y-188708628D02*
X181609343Y-188708628D01*
X181216486Y-188041961D02*
X181002200Y-189756247D01*
X181002200Y-189756247D02*
X181073629Y-189946723D01*
X181073629Y-189946723D02*
X181252200Y-190041961D01*
X181252200Y-190041961D02*
X181442676Y-190041961D01*
X182395057Y-190041961D02*
X182216486Y-189946723D01*
X182216486Y-189946723D02*
X182145057Y-189756247D01*
X182145057Y-189756247D02*
X182359343Y-188041961D01*
X183930771Y-189946723D02*
X183728390Y-190041961D01*
X183728390Y-190041961D02*
X183347438Y-190041961D01*
X183347438Y-190041961D02*
X183168867Y-189946723D01*
X183168867Y-189946723D02*
X183097438Y-189756247D01*
X183097438Y-189756247D02*
X183192676Y-188994342D01*
X183192676Y-188994342D02*
X183311724Y-188803866D01*
X183311724Y-188803866D02*
X183514105Y-188708628D01*
X183514105Y-188708628D02*
X183895057Y-188708628D01*
X183895057Y-188708628D02*
X184073628Y-188803866D01*
X184073628Y-188803866D02*
X184145057Y-188994342D01*
X184145057Y-188994342D02*
X184121247Y-189184819D01*
X184121247Y-189184819D02*
X183145057Y-189375295D01*
X184895057Y-189851485D02*
X184978391Y-189946723D01*
X184978391Y-189946723D02*
X184871248Y-190041961D01*
X184871248Y-190041961D02*
X184787914Y-189946723D01*
X184787914Y-189946723D02*
X184895057Y-189851485D01*
X184895057Y-189851485D02*
X184871248Y-190041961D01*
X185026010Y-188803866D02*
X185109343Y-188899104D01*
X185109343Y-188899104D02*
X185002200Y-188994342D01*
X185002200Y-188994342D02*
X184918867Y-188899104D01*
X184918867Y-188899104D02*
X185026010Y-188803866D01*
X185026010Y-188803866D02*
X185002200Y-188994342D01*
X188309343Y-188137200D02*
X188130772Y-188041961D01*
X188130772Y-188041961D02*
X187845057Y-188041961D01*
X187845057Y-188041961D02*
X187547438Y-188137200D01*
X187547438Y-188137200D02*
X187333153Y-188327676D01*
X187333153Y-188327676D02*
X187214105Y-188518152D01*
X187214105Y-188518152D02*
X187071248Y-188899104D01*
X187071248Y-188899104D02*
X187035534Y-189184819D01*
X187035534Y-189184819D02*
X187083153Y-189565771D01*
X187083153Y-189565771D02*
X187154581Y-189756247D01*
X187154581Y-189756247D02*
X187321248Y-189946723D01*
X187321248Y-189946723D02*
X187595057Y-190041961D01*
X187595057Y-190041961D02*
X187785534Y-190041961D01*
X187785534Y-190041961D02*
X188083153Y-189946723D01*
X188083153Y-189946723D02*
X188190295Y-189851485D01*
X188190295Y-189851485D02*
X188273629Y-189184819D01*
X188273629Y-189184819D02*
X187892676Y-189184819D01*
X189023629Y-190041961D02*
X189190295Y-188708628D01*
X189273629Y-188041961D02*
X189166486Y-188137200D01*
X189166486Y-188137200D02*
X189249819Y-188232438D01*
X189249819Y-188232438D02*
X189356962Y-188137200D01*
X189356962Y-188137200D02*
X189273629Y-188041961D01*
X189273629Y-188041961D02*
X189249819Y-188232438D01*
X189976010Y-190041961D02*
X190142676Y-188708628D01*
X190118867Y-188899104D02*
X190226010Y-188803866D01*
X190226010Y-188803866D02*
X190428391Y-188708628D01*
X190428391Y-188708628D02*
X190714105Y-188708628D01*
X190714105Y-188708628D02*
X190892676Y-188803866D01*
X190892676Y-188803866D02*
X190964105Y-188994342D01*
X190964105Y-188994342D02*
X190833153Y-190041961D01*
X190964105Y-188994342D02*
X191083153Y-188803866D01*
X191083153Y-188803866D02*
X191285534Y-188708628D01*
X191285534Y-188708628D02*
X191571248Y-188708628D01*
X191571248Y-188708628D02*
X191749819Y-188803866D01*
X191749819Y-188803866D02*
X191821248Y-188994342D01*
X191821248Y-188994342D02*
X191690295Y-190041961D01*
X192642677Y-190041961D02*
X192892677Y-188041961D01*
X192797439Y-188803866D02*
X192999820Y-188708628D01*
X192999820Y-188708628D02*
X193380772Y-188708628D01*
X193380772Y-188708628D02*
X193559343Y-188803866D01*
X193559343Y-188803866D02*
X193642677Y-188899104D01*
X193642677Y-188899104D02*
X193714105Y-189089580D01*
X193714105Y-189089580D02*
X193642677Y-189661009D01*
X193642677Y-189661009D02*
X193523629Y-189851485D01*
X193523629Y-189851485D02*
X193416486Y-189946723D01*
X193416486Y-189946723D02*
X193214105Y-190041961D01*
X193214105Y-190041961D02*
X192833153Y-190041961D01*
X192833153Y-190041961D02*
X192654582Y-189946723D01*
X195309344Y-190041961D02*
X195440296Y-188994342D01*
X195440296Y-188994342D02*
X195368867Y-188803866D01*
X195368867Y-188803866D02*
X195190296Y-188708628D01*
X195190296Y-188708628D02*
X194809344Y-188708628D01*
X194809344Y-188708628D02*
X194606963Y-188803866D01*
X195321248Y-189946723D02*
X195118867Y-190041961D01*
X195118867Y-190041961D02*
X194642677Y-190041961D01*
X194642677Y-190041961D02*
X194464106Y-189946723D01*
X194464106Y-189946723D02*
X194392677Y-189756247D01*
X194392677Y-189756247D02*
X194416486Y-189565771D01*
X194416486Y-189565771D02*
X194535534Y-189375295D01*
X194535534Y-189375295D02*
X194737915Y-189280057D01*
X194737915Y-189280057D02*
X195214106Y-189280057D01*
X195214106Y-189280057D02*
X195416486Y-189184819D01*
X196547439Y-190041961D02*
X196368868Y-189946723D01*
X196368868Y-189946723D02*
X196297439Y-189756247D01*
X196297439Y-189756247D02*
X196511725Y-188041961D01*
X198509344Y-190041961D02*
X198759344Y-188041961D01*
X198759344Y-188041961D02*
X199247439Y-189470533D01*
X199247439Y-189470533D02*
X200092677Y-188041961D01*
X200092677Y-188041961D02*
X199842677Y-190041961D01*
X201080772Y-190041961D02*
X200902201Y-189946723D01*
X200902201Y-189946723D02*
X200818867Y-189851485D01*
X200818867Y-189851485D02*
X200747439Y-189661009D01*
X200747439Y-189661009D02*
X200818867Y-189089580D01*
X200818867Y-189089580D02*
X200937915Y-188899104D01*
X200937915Y-188899104D02*
X201045058Y-188803866D01*
X201045058Y-188803866D02*
X201247439Y-188708628D01*
X201247439Y-188708628D02*
X201533153Y-188708628D01*
X201533153Y-188708628D02*
X201711724Y-188803866D01*
X201711724Y-188803866D02*
X201795058Y-188899104D01*
X201795058Y-188899104D02*
X201866486Y-189089580D01*
X201866486Y-189089580D02*
X201795058Y-189661009D01*
X201795058Y-189661009D02*
X201676010Y-189851485D01*
X201676010Y-189851485D02*
X201568867Y-189946723D01*
X201568867Y-189946723D02*
X201366486Y-190041961D01*
X201366486Y-190041961D02*
X201080772Y-190041961D01*
X202485534Y-188708628D02*
X203247439Y-188708628D01*
X202854582Y-188041961D02*
X202640296Y-189756247D01*
X202640296Y-189756247D02*
X202711725Y-189946723D01*
X202711725Y-189946723D02*
X202890296Y-190041961D01*
X202890296Y-190041961D02*
X203080772Y-190041961D01*
X204033153Y-190041961D02*
X203854582Y-189946723D01*
X203854582Y-189946723D02*
X203771248Y-189851485D01*
X203771248Y-189851485D02*
X203699820Y-189661009D01*
X203699820Y-189661009D02*
X203771248Y-189089580D01*
X203771248Y-189089580D02*
X203890296Y-188899104D01*
X203890296Y-188899104D02*
X203997439Y-188803866D01*
X203997439Y-188803866D02*
X204199820Y-188708628D01*
X204199820Y-188708628D02*
X204485534Y-188708628D01*
X204485534Y-188708628D02*
X204664105Y-188803866D01*
X204664105Y-188803866D02*
X204747439Y-188899104D01*
X204747439Y-188899104D02*
X204818867Y-189089580D01*
X204818867Y-189089580D02*
X204747439Y-189661009D01*
X204747439Y-189661009D02*
X204628391Y-189851485D01*
X204628391Y-189851485D02*
X204521248Y-189946723D01*
X204521248Y-189946723D02*
X204318867Y-190041961D01*
X204318867Y-190041961D02*
X204033153Y-190041961D01*
X205556963Y-190041961D02*
X205723629Y-188708628D01*
X205676010Y-189089580D02*
X205795058Y-188899104D01*
X205795058Y-188899104D02*
X205902201Y-188803866D01*
X205902201Y-188803866D02*
X206104582Y-188708628D01*
X206104582Y-188708628D02*
X206295058Y-188708628D01*
X207995058Y-190041961D02*
X208245058Y-188041961D01*
X208245058Y-188041961D02*
X208721248Y-188041961D01*
X208721248Y-188041961D02*
X208995058Y-188137200D01*
X208995058Y-188137200D02*
X209161724Y-188327676D01*
X209161724Y-188327676D02*
X209233153Y-188518152D01*
X209233153Y-188518152D02*
X209280772Y-188899104D01*
X209280772Y-188899104D02*
X209245058Y-189184819D01*
X209245058Y-189184819D02*
X209102201Y-189565771D01*
X209102201Y-189565771D02*
X208983153Y-189756247D01*
X208983153Y-189756247D02*
X208768867Y-189946723D01*
X208768867Y-189946723D02*
X208471248Y-190041961D01*
X208471248Y-190041961D02*
X207995058Y-190041961D01*
X209995058Y-190041961D02*
X210161724Y-188708628D01*
X210114105Y-189089580D02*
X210233153Y-188899104D01*
X210233153Y-188899104D02*
X210340296Y-188803866D01*
X210340296Y-188803866D02*
X210542677Y-188708628D01*
X210542677Y-188708628D02*
X210733153Y-188708628D01*
X211233153Y-190041961D02*
X211399819Y-188708628D01*
X211483153Y-188041961D02*
X211376010Y-188137200D01*
X211376010Y-188137200D02*
X211459343Y-188232438D01*
X211459343Y-188232438D02*
X211566486Y-188137200D01*
X211566486Y-188137200D02*
X211483153Y-188041961D01*
X211483153Y-188041961D02*
X211459343Y-188232438D01*
X212161724Y-188708628D02*
X212471248Y-190041961D01*
X212471248Y-190041961D02*
X213114105Y-188708628D01*
X214483153Y-189946723D02*
X214280772Y-190041961D01*
X214280772Y-190041961D02*
X213899820Y-190041961D01*
X213899820Y-190041961D02*
X213721249Y-189946723D01*
X213721249Y-189946723D02*
X213649820Y-189756247D01*
X213649820Y-189756247D02*
X213745058Y-188994342D01*
X213745058Y-188994342D02*
X213864106Y-188803866D01*
X213864106Y-188803866D02*
X214066487Y-188708628D01*
X214066487Y-188708628D02*
X214447439Y-188708628D01*
X214447439Y-188708628D02*
X214626010Y-188803866D01*
X214626010Y-188803866D02*
X214697439Y-188994342D01*
X214697439Y-188994342D02*
X214673629Y-189184819D01*
X214673629Y-189184819D02*
X213697439Y-189375295D01*
X215423630Y-190041961D02*
X215590296Y-188708628D01*
X215542677Y-189089580D02*
X215661725Y-188899104D01*
X215661725Y-188899104D02*
X215768868Y-188803866D01*
X215768868Y-188803866D02*
X215971249Y-188708628D01*
X215971249Y-188708628D02*
X216161725Y-188708628D01*
D10*
D11*
X178859342Y-185472557D02*
X178359342Y-185472557D01*
X178359342Y-186258271D02*
X178359342Y-184758271D01*
X178359342Y-184758271D02*
X179073628Y-184758271D01*
X179645056Y-186258271D02*
X179645056Y-185258271D01*
X179645056Y-184758271D02*
X179573628Y-184829700D01*
X179573628Y-184829700D02*
X179645056Y-184901128D01*
X179645056Y-184901128D02*
X179716485Y-184829700D01*
X179716485Y-184829700D02*
X179645056Y-184758271D01*
X179645056Y-184758271D02*
X179645056Y-184901128D01*
X180573628Y-186258271D02*
X180430771Y-186186842D01*
X180430771Y-186186842D02*
X180359342Y-186043985D01*
X180359342Y-186043985D02*
X180359342Y-184758271D01*
X181716485Y-186186842D02*
X181573628Y-186258271D01*
X181573628Y-186258271D02*
X181287914Y-186258271D01*
X181287914Y-186258271D02*
X181145056Y-186186842D01*
X181145056Y-186186842D02*
X181073628Y-186043985D01*
X181073628Y-186043985D02*
X181073628Y-185472557D01*
X181073628Y-185472557D02*
X181145056Y-185329700D01*
X181145056Y-185329700D02*
X181287914Y-185258271D01*
X181287914Y-185258271D02*
X181573628Y-185258271D01*
X181573628Y-185258271D02*
X181716485Y-185329700D01*
X181716485Y-185329700D02*
X181787914Y-185472557D01*
X181787914Y-185472557D02*
X181787914Y-185615414D01*
X181787914Y-185615414D02*
X181073628Y-185758271D01*
X182430770Y-186115414D02*
X182502199Y-186186842D01*
X182502199Y-186186842D02*
X182430770Y-186258271D01*
X182430770Y-186258271D02*
X182359342Y-186186842D01*
X182359342Y-186186842D02*
X182430770Y-186115414D01*
X182430770Y-186115414D02*
X182430770Y-186258271D01*
X182430770Y-185329700D02*
X182502199Y-185401128D01*
X182502199Y-185401128D02*
X182430770Y-185472557D01*
X182430770Y-185472557D02*
X182359342Y-185401128D01*
X182359342Y-185401128D02*
X182430770Y-185329700D01*
X182430770Y-185329700D02*
X182430770Y-185472557D01*
X184545056Y-185472557D02*
X184045056Y-185472557D01*
X184045056Y-186258271D02*
X184045056Y-184758271D01*
X184045056Y-184758271D02*
X184759342Y-184758271D01*
X185187913Y-184758271D02*
X186116485Y-184758271D01*
X186116485Y-184758271D02*
X185616485Y-185329700D01*
X185616485Y-185329700D02*
X185830770Y-185329700D01*
X185830770Y-185329700D02*
X185973628Y-185401128D01*
X185973628Y-185401128D02*
X186045056Y-185472557D01*
X186045056Y-185472557D02*
X186116485Y-185615414D01*
X186116485Y-185615414D02*
X186116485Y-185972557D01*
X186116485Y-185972557D02*
X186045056Y-186115414D01*
X186045056Y-186115414D02*
X185973628Y-186186842D01*
X185973628Y-186186842D02*
X185830770Y-186258271D01*
X185830770Y-186258271D02*
X185402199Y-186258271D01*
X185402199Y-186258271D02*
X185259342Y-186186842D01*
X185259342Y-186186842D02*
X185187913Y-186115414D01*
X188445056Y-184829700D02*
X188302199Y-184758271D01*
X188302199Y-184758271D02*
X188087913Y-184758271D01*
X188087913Y-184758271D02*
X187873627Y-184829700D01*
X187873627Y-184829700D02*
X187730770Y-184972557D01*
X187730770Y-184972557D02*
X187659341Y-185115414D01*
X187659341Y-185115414D02*
X187587913Y-185401128D01*
X187587913Y-185401128D02*
X187587913Y-185615414D01*
X187587913Y-185615414D02*
X187659341Y-185901128D01*
X187659341Y-185901128D02*
X187730770Y-186043985D01*
X187730770Y-186043985D02*
X187873627Y-186186842D01*
X187873627Y-186186842D02*
X188087913Y-186258271D01*
X188087913Y-186258271D02*
X188230770Y-186258271D01*
X188230770Y-186258271D02*
X188445056Y-186186842D01*
X188445056Y-186186842D02*
X188516484Y-186115414D01*
X188516484Y-186115414D02*
X188516484Y-185615414D01*
X188516484Y-185615414D02*
X188230770Y-185615414D01*
X189159341Y-186258271D02*
X189159341Y-185258271D01*
X189159341Y-184758271D02*
X189087913Y-184829700D01*
X189087913Y-184829700D02*
X189159341Y-184901128D01*
X189159341Y-184901128D02*
X189230770Y-184829700D01*
X189230770Y-184829700D02*
X189159341Y-184758271D01*
X189159341Y-184758271D02*
X189159341Y-184901128D01*
X189873627Y-186258271D02*
X189873627Y-185258271D01*
X189873627Y-185401128D02*
X189945056Y-185329700D01*
X189945056Y-185329700D02*
X190087913Y-185258271D01*
X190087913Y-185258271D02*
X190302199Y-185258271D01*
X190302199Y-185258271D02*
X190445056Y-185329700D01*
X190445056Y-185329700D02*
X190516485Y-185472557D01*
X190516485Y-185472557D02*
X190516485Y-186258271D01*
X190516485Y-185472557D02*
X190587913Y-185329700D01*
X190587913Y-185329700D02*
X190730770Y-185258271D01*
X190730770Y-185258271D02*
X190945056Y-185258271D01*
X190945056Y-185258271D02*
X191087913Y-185329700D01*
X191087913Y-185329700D02*
X191159342Y-185472557D01*
X191159342Y-185472557D02*
X191159342Y-186258271D01*
X191873627Y-186258271D02*
X191873627Y-184758271D01*
X191873627Y-185329700D02*
X192016485Y-185258271D01*
X192016485Y-185258271D02*
X192302199Y-185258271D01*
X192302199Y-185258271D02*
X192445056Y-185329700D01*
X192445056Y-185329700D02*
X192516485Y-185401128D01*
X192516485Y-185401128D02*
X192587913Y-185543985D01*
X192587913Y-185543985D02*
X192587913Y-185972557D01*
X192587913Y-185972557D02*
X192516485Y-186115414D01*
X192516485Y-186115414D02*
X192445056Y-186186842D01*
X192445056Y-186186842D02*
X192302199Y-186258271D01*
X192302199Y-186258271D02*
X192016485Y-186258271D01*
X192016485Y-186258271D02*
X191873627Y-186186842D01*
X193873628Y-186258271D02*
X193873628Y-185472557D01*
X193873628Y-185472557D02*
X193802199Y-185329700D01*
X193802199Y-185329700D02*
X193659342Y-185258271D01*
X193659342Y-185258271D02*
X193373628Y-185258271D01*
X193373628Y-185258271D02*
X193230770Y-185329700D01*
X193873628Y-186186842D02*
X193730770Y-186258271D01*
X193730770Y-186258271D02*
X193373628Y-186258271D01*
X193373628Y-186258271D02*
X193230770Y-186186842D01*
X193230770Y-186186842D02*
X193159342Y-186043985D01*
X193159342Y-186043985D02*
X193159342Y-185901128D01*
X193159342Y-185901128D02*
X193230770Y-185758271D01*
X193230770Y-185758271D02*
X193373628Y-185686842D01*
X193373628Y-185686842D02*
X193730770Y-185686842D01*
X193730770Y-185686842D02*
X193873628Y-185615414D01*
X194802199Y-186258271D02*
X194659342Y-186186842D01*
X194659342Y-186186842D02*
X194587913Y-186043985D01*
X194587913Y-186043985D02*
X194587913Y-184758271D01*
X196202199Y-186186842D02*
X196416485Y-186258271D01*
X196416485Y-186258271D02*
X196773627Y-186258271D01*
X196773627Y-186258271D02*
X196916485Y-186186842D01*
X196916485Y-186186842D02*
X196987913Y-186115414D01*
X196987913Y-186115414D02*
X197059342Y-185972557D01*
X197059342Y-185972557D02*
X197059342Y-185829700D01*
X197059342Y-185829700D02*
X196987913Y-185686842D01*
X196987913Y-185686842D02*
X196916485Y-185615414D01*
X196916485Y-185615414D02*
X196773627Y-185543985D01*
X196773627Y-185543985D02*
X196487913Y-185472557D01*
X196487913Y-185472557D02*
X196345056Y-185401128D01*
X196345056Y-185401128D02*
X196273627Y-185329700D01*
X196273627Y-185329700D02*
X196202199Y-185186842D01*
X196202199Y-185186842D02*
X196202199Y-185043985D01*
X196202199Y-185043985D02*
X196273627Y-184901128D01*
X196273627Y-184901128D02*
X196345056Y-184829700D01*
X196345056Y-184829700D02*
X196487913Y-184758271D01*
X196487913Y-184758271D02*
X196845056Y-184758271D01*
X196845056Y-184758271D02*
X197059342Y-184829700D01*
X198345056Y-186186842D02*
X198202198Y-186258271D01*
X198202198Y-186258271D02*
X197916484Y-186258271D01*
X197916484Y-186258271D02*
X197773627Y-186186842D01*
X197773627Y-186186842D02*
X197702198Y-186115414D01*
X197702198Y-186115414D02*
X197630770Y-185972557D01*
X197630770Y-185972557D02*
X197630770Y-185543985D01*
X197630770Y-185543985D02*
X197702198Y-185401128D01*
X197702198Y-185401128D02*
X197773627Y-185329700D01*
X197773627Y-185329700D02*
X197916484Y-185258271D01*
X197916484Y-185258271D02*
X198202198Y-185258271D01*
X198202198Y-185258271D02*
X198345056Y-185329700D01*
X198987912Y-186258271D02*
X198987912Y-184758271D01*
X199630770Y-186258271D02*
X199630770Y-185472557D01*
X199630770Y-185472557D02*
X199559341Y-185329700D01*
X199559341Y-185329700D02*
X199416484Y-185258271D01*
X199416484Y-185258271D02*
X199202198Y-185258271D01*
X199202198Y-185258271D02*
X199059341Y-185329700D01*
X199059341Y-185329700D02*
X198987912Y-185401128D01*
X200916484Y-186186842D02*
X200773627Y-186258271D01*
X200773627Y-186258271D02*
X200487913Y-186258271D01*
X200487913Y-186258271D02*
X200345055Y-186186842D01*
X200345055Y-186186842D02*
X200273627Y-186043985D01*
X200273627Y-186043985D02*
X200273627Y-185472557D01*
X200273627Y-185472557D02*
X200345055Y-185329700D01*
X200345055Y-185329700D02*
X200487913Y-185258271D01*
X200487913Y-185258271D02*
X200773627Y-185258271D01*
X200773627Y-185258271D02*
X200916484Y-185329700D01*
X200916484Y-185329700D02*
X200987913Y-185472557D01*
X200987913Y-185472557D02*
X200987913Y-185615414D01*
X200987913Y-185615414D02*
X200273627Y-185758271D01*
X201630769Y-186258271D02*
X201630769Y-185258271D01*
X201630769Y-185401128D02*
X201702198Y-185329700D01*
X201702198Y-185329700D02*
X201845055Y-185258271D01*
X201845055Y-185258271D02*
X202059341Y-185258271D01*
X202059341Y-185258271D02*
X202202198Y-185329700D01*
X202202198Y-185329700D02*
X202273627Y-185472557D01*
X202273627Y-185472557D02*
X202273627Y-186258271D01*
X202273627Y-185472557D02*
X202345055Y-185329700D01*
X202345055Y-185329700D02*
X202487912Y-185258271D01*
X202487912Y-185258271D02*
X202702198Y-185258271D01*
X202702198Y-185258271D02*
X202845055Y-185329700D01*
X202845055Y-185329700D02*
X202916484Y-185472557D01*
X202916484Y-185472557D02*
X202916484Y-186258271D01*
X204273627Y-186258271D02*
X204273627Y-185472557D01*
X204273627Y-185472557D02*
X204202198Y-185329700D01*
X204202198Y-185329700D02*
X204059341Y-185258271D01*
X204059341Y-185258271D02*
X203773627Y-185258271D01*
X203773627Y-185258271D02*
X203630769Y-185329700D01*
X204273627Y-186186842D02*
X204130769Y-186258271D01*
X204130769Y-186258271D02*
X203773627Y-186258271D01*
X203773627Y-186258271D02*
X203630769Y-186186842D01*
X203630769Y-186186842D02*
X203559341Y-186043985D01*
X203559341Y-186043985D02*
X203559341Y-185901128D01*
X203559341Y-185901128D02*
X203630769Y-185758271D01*
X203630769Y-185758271D02*
X203773627Y-185686842D01*
X203773627Y-185686842D02*
X204130769Y-185686842D01*
X204130769Y-185686842D02*
X204273627Y-185615414D01*
X204773627Y-185258271D02*
X205345055Y-185258271D01*
X204987912Y-184758271D02*
X204987912Y-186043985D01*
X204987912Y-186043985D02*
X205059341Y-186186842D01*
X205059341Y-186186842D02*
X205202198Y-186258271D01*
X205202198Y-186258271D02*
X205345055Y-186258271D01*
X205845055Y-186258271D02*
X205845055Y-185258271D01*
X205845055Y-184758271D02*
X205773627Y-184829700D01*
X205773627Y-184829700D02*
X205845055Y-184901128D01*
X205845055Y-184901128D02*
X205916484Y-184829700D01*
X205916484Y-184829700D02*
X205845055Y-184758271D01*
X205845055Y-184758271D02*
X205845055Y-184901128D01*
X207202199Y-186186842D02*
X207059341Y-186258271D01*
X207059341Y-186258271D02*
X206773627Y-186258271D01*
X206773627Y-186258271D02*
X206630770Y-186186842D01*
X206630770Y-186186842D02*
X206559341Y-186115414D01*
X206559341Y-186115414D02*
X206487913Y-185972557D01*
X206487913Y-185972557D02*
X206487913Y-185543985D01*
X206487913Y-185543985D02*
X206559341Y-185401128D01*
X206559341Y-185401128D02*
X206630770Y-185329700D01*
X206630770Y-185329700D02*
X206773627Y-185258271D01*
X206773627Y-185258271D02*
X207059341Y-185258271D01*
X207059341Y-185258271D02*
X207202199Y-185329700D01*
X207845055Y-186115414D02*
X207916484Y-186186842D01*
X207916484Y-186186842D02*
X207845055Y-186258271D01*
X207845055Y-186258271D02*
X207773627Y-186186842D01*
X207773627Y-186186842D02*
X207845055Y-186115414D01*
X207845055Y-186115414D02*
X207845055Y-186258271D01*
X208559341Y-186258271D02*
X208559341Y-184758271D01*
X208702199Y-185686842D02*
X209130770Y-186258271D01*
X209130770Y-185258271D02*
X208559341Y-185829700D01*
X209773627Y-186258271D02*
X209773627Y-185258271D01*
X209773627Y-184758271D02*
X209702199Y-184829700D01*
X209702199Y-184829700D02*
X209773627Y-184901128D01*
X209773627Y-184901128D02*
X209845056Y-184829700D01*
X209845056Y-184829700D02*
X209773627Y-184758271D01*
X209773627Y-184758271D02*
X209773627Y-184901128D01*
X211130771Y-186186842D02*
X210987913Y-186258271D01*
X210987913Y-186258271D02*
X210702199Y-186258271D01*
X210702199Y-186258271D02*
X210559342Y-186186842D01*
X210559342Y-186186842D02*
X210487913Y-186115414D01*
X210487913Y-186115414D02*
X210416485Y-185972557D01*
X210416485Y-185972557D02*
X210416485Y-185543985D01*
X210416485Y-185543985D02*
X210487913Y-185401128D01*
X210487913Y-185401128D02*
X210559342Y-185329700D01*
X210559342Y-185329700D02*
X210702199Y-185258271D01*
X210702199Y-185258271D02*
X210987913Y-185258271D01*
X210987913Y-185258271D02*
X211130771Y-185329700D01*
X212416485Y-186258271D02*
X212416485Y-185472557D01*
X212416485Y-185472557D02*
X212345056Y-185329700D01*
X212345056Y-185329700D02*
X212202199Y-185258271D01*
X212202199Y-185258271D02*
X211916485Y-185258271D01*
X211916485Y-185258271D02*
X211773627Y-185329700D01*
X212416485Y-186186842D02*
X212273627Y-186258271D01*
X212273627Y-186258271D02*
X211916485Y-186258271D01*
X211916485Y-186258271D02*
X211773627Y-186186842D01*
X211773627Y-186186842D02*
X211702199Y-186043985D01*
X211702199Y-186043985D02*
X211702199Y-185901128D01*
X211702199Y-185901128D02*
X211773627Y-185758271D01*
X211773627Y-185758271D02*
X211916485Y-185686842D01*
X211916485Y-185686842D02*
X212273627Y-185686842D01*
X212273627Y-185686842D02*
X212416485Y-185615414D01*
X213773628Y-186258271D02*
X213773628Y-184758271D01*
X213773628Y-186186842D02*
X213630770Y-186258271D01*
X213630770Y-186258271D02*
X213345056Y-186258271D01*
X213345056Y-186258271D02*
X213202199Y-186186842D01*
X213202199Y-186186842D02*
X213130770Y-186115414D01*
X213130770Y-186115414D02*
X213059342Y-185972557D01*
X213059342Y-185972557D02*
X213059342Y-185543985D01*
X213059342Y-185543985D02*
X213130770Y-185401128D01*
X213130770Y-185401128D02*
X213202199Y-185329700D01*
X213202199Y-185329700D02*
X213345056Y-185258271D01*
X213345056Y-185258271D02*
X213630770Y-185258271D01*
X213630770Y-185258271D02*
X213773628Y-185329700D01*
X214130771Y-186401128D02*
X215273628Y-186401128D01*
X215630770Y-185258271D02*
X215630770Y-186758271D01*
X215630770Y-185329700D02*
X215773628Y-185258271D01*
X215773628Y-185258271D02*
X216059342Y-185258271D01*
X216059342Y-185258271D02*
X216202199Y-185329700D01*
X216202199Y-185329700D02*
X216273628Y-185401128D01*
X216273628Y-185401128D02*
X216345056Y-185543985D01*
X216345056Y-185543985D02*
X216345056Y-185972557D01*
X216345056Y-185972557D02*
X216273628Y-186115414D01*
X216273628Y-186115414D02*
X216202199Y-186186842D01*
X216202199Y-186186842D02*
X216059342Y-186258271D01*
X216059342Y-186258271D02*
X215773628Y-186258271D01*
X215773628Y-186258271D02*
X215630770Y-186186842D01*
X217630771Y-186186842D02*
X217487913Y-186258271D01*
X217487913Y-186258271D02*
X217202199Y-186258271D01*
X217202199Y-186258271D02*
X217059342Y-186186842D01*
X217059342Y-186186842D02*
X216987913Y-186115414D01*
X216987913Y-186115414D02*
X216916485Y-185972557D01*
X216916485Y-185972557D02*
X216916485Y-185543985D01*
X216916485Y-185543985D02*
X216987913Y-185401128D01*
X216987913Y-185401128D02*
X217059342Y-185329700D01*
X217059342Y-185329700D02*
X217202199Y-185258271D01*
X217202199Y-185258271D02*
X217487913Y-185258271D01*
X217487913Y-185258271D02*
X217630771Y-185329700D01*
X218273627Y-186258271D02*
X218273627Y-184758271D01*
X218273627Y-185329700D02*
X218416485Y-185258271D01*
X218416485Y-185258271D02*
X218702199Y-185258271D01*
X218702199Y-185258271D02*
X218845056Y-185329700D01*
X218845056Y-185329700D02*
X218916485Y-185401128D01*
X218916485Y-185401128D02*
X218987913Y-185543985D01*
X218987913Y-185543985D02*
X218987913Y-185972557D01*
X218987913Y-185972557D02*
X218916485Y-186115414D01*
X218916485Y-186115414D02*
X218845056Y-186186842D01*
X218845056Y-186186842D02*
X218702199Y-186258271D01*
X218702199Y-186258271D02*
X218416485Y-186258271D01*
X218416485Y-186258271D02*
X218273627Y-186186842D01*
D10*
D11*
X177002200Y-181507200D02*
X285002200Y-181507200D01*
D10*
D11*
X178287914Y-183486842D02*
X178502200Y-183558271D01*
X178502200Y-183558271D02*
X178859342Y-183558271D01*
X178859342Y-183558271D02*
X179002200Y-183486842D01*
X179002200Y-183486842D02*
X179073628Y-183415414D01*
X179073628Y-183415414D02*
X179145057Y-183272557D01*
X179145057Y-183272557D02*
X179145057Y-183129700D01*
X179145057Y-183129700D02*
X179073628Y-182986842D01*
X179073628Y-182986842D02*
X179002200Y-182915414D01*
X179002200Y-182915414D02*
X178859342Y-182843985D01*
X178859342Y-182843985D02*
X178573628Y-182772557D01*
X178573628Y-182772557D02*
X178430771Y-182701128D01*
X178430771Y-182701128D02*
X178359342Y-182629700D01*
X178359342Y-182629700D02*
X178287914Y-182486842D01*
X178287914Y-182486842D02*
X178287914Y-182343985D01*
X178287914Y-182343985D02*
X178359342Y-182201128D01*
X178359342Y-182201128D02*
X178430771Y-182129700D01*
X178430771Y-182129700D02*
X178573628Y-182058271D01*
X178573628Y-182058271D02*
X178930771Y-182058271D01*
X178930771Y-182058271D02*
X179145057Y-182129700D01*
X179787913Y-183558271D02*
X179787913Y-182058271D01*
X180430771Y-183558271D02*
X180430771Y-182772557D01*
X180430771Y-182772557D02*
X180359342Y-182629700D01*
X180359342Y-182629700D02*
X180216485Y-182558271D01*
X180216485Y-182558271D02*
X180002199Y-182558271D01*
X180002199Y-182558271D02*
X179859342Y-182629700D01*
X179859342Y-182629700D02*
X179787913Y-182701128D01*
X181716485Y-183486842D02*
X181573628Y-183558271D01*
X181573628Y-183558271D02*
X181287914Y-183558271D01*
X181287914Y-183558271D02*
X181145056Y-183486842D01*
X181145056Y-183486842D02*
X181073628Y-183343985D01*
X181073628Y-183343985D02*
X181073628Y-182772557D01*
X181073628Y-182772557D02*
X181145056Y-182629700D01*
X181145056Y-182629700D02*
X181287914Y-182558271D01*
X181287914Y-182558271D02*
X181573628Y-182558271D01*
X181573628Y-182558271D02*
X181716485Y-182629700D01*
X181716485Y-182629700D02*
X181787914Y-182772557D01*
X181787914Y-182772557D02*
X181787914Y-182915414D01*
X181787914Y-182915414D02*
X181073628Y-183058271D01*
X183002199Y-183486842D02*
X182859342Y-183558271D01*
X182859342Y-183558271D02*
X182573628Y-183558271D01*
X182573628Y-183558271D02*
X182430770Y-183486842D01*
X182430770Y-183486842D02*
X182359342Y-183343985D01*
X182359342Y-183343985D02*
X182359342Y-182772557D01*
X182359342Y-182772557D02*
X182430770Y-182629700D01*
X182430770Y-182629700D02*
X182573628Y-182558271D01*
X182573628Y-182558271D02*
X182859342Y-182558271D01*
X182859342Y-182558271D02*
X183002199Y-182629700D01*
X183002199Y-182629700D02*
X183073628Y-182772557D01*
X183073628Y-182772557D02*
X183073628Y-182915414D01*
X183073628Y-182915414D02*
X182359342Y-183058271D01*
X183502199Y-182558271D02*
X184073627Y-182558271D01*
X183716484Y-182058271D02*
X183716484Y-183343985D01*
X183716484Y-183343985D02*
X183787913Y-183486842D01*
X183787913Y-183486842D02*
X183930770Y-183558271D01*
X183930770Y-183558271D02*
X184073627Y-183558271D01*
X184573627Y-183415414D02*
X184645056Y-183486842D01*
X184645056Y-183486842D02*
X184573627Y-183558271D01*
X184573627Y-183558271D02*
X184502199Y-183486842D01*
X184502199Y-183486842D02*
X184573627Y-183415414D01*
X184573627Y-183415414D02*
X184573627Y-183558271D01*
X184573627Y-182629700D02*
X184645056Y-182701128D01*
X184645056Y-182701128D02*
X184573627Y-182772557D01*
X184573627Y-182772557D02*
X184502199Y-182701128D01*
X184502199Y-182701128D02*
X184573627Y-182629700D01*
X184573627Y-182629700D02*
X184573627Y-182772557D01*
D10*
D12*
X178287914Y-180129700D02*
X179002200Y-180129700D01*
X178145057Y-180558271D02*
X178645057Y-179058271D01*
X178645057Y-179058271D02*
X179145057Y-180558271D01*
X179645056Y-180558271D02*
X179645056Y-179558271D01*
X179645056Y-179701128D02*
X179716485Y-179629700D01*
X179716485Y-179629700D02*
X179859342Y-179558271D01*
X179859342Y-179558271D02*
X180073628Y-179558271D01*
X180073628Y-179558271D02*
X180216485Y-179629700D01*
X180216485Y-179629700D02*
X180287914Y-179772557D01*
X180287914Y-179772557D02*
X180287914Y-180558271D01*
X180287914Y-179772557D02*
X180359342Y-179629700D01*
X180359342Y-179629700D02*
X180502199Y-179558271D01*
X180502199Y-179558271D02*
X180716485Y-179558271D01*
X180716485Y-179558271D02*
X180859342Y-179629700D01*
X180859342Y-179629700D02*
X180930771Y-179772557D01*
X180930771Y-179772557D02*
X180930771Y-180558271D01*
X182287914Y-180558271D02*
X182287914Y-179772557D01*
X182287914Y-179772557D02*
X182216485Y-179629700D01*
X182216485Y-179629700D02*
X182073628Y-179558271D01*
X182073628Y-179558271D02*
X181787914Y-179558271D01*
X181787914Y-179558271D02*
X181645056Y-179629700D01*
X182287914Y-180486842D02*
X182145056Y-180558271D01*
X182145056Y-180558271D02*
X181787914Y-180558271D01*
X181787914Y-180558271D02*
X181645056Y-180486842D01*
X181645056Y-180486842D02*
X181573628Y-180343985D01*
X181573628Y-180343985D02*
X181573628Y-180201128D01*
X181573628Y-180201128D02*
X181645056Y-180058271D01*
X181645056Y-180058271D02*
X181787914Y-179986842D01*
X181787914Y-179986842D02*
X182145056Y-179986842D01*
X182145056Y-179986842D02*
X182287914Y-179915414D01*
X183645057Y-180558271D02*
X183645057Y-179058271D01*
X183645057Y-180486842D02*
X183502199Y-180558271D01*
X183502199Y-180558271D02*
X183216485Y-180558271D01*
X183216485Y-180558271D02*
X183073628Y-180486842D01*
X183073628Y-180486842D02*
X183002199Y-180415414D01*
X183002199Y-180415414D02*
X182930771Y-180272557D01*
X182930771Y-180272557D02*
X182930771Y-179843985D01*
X182930771Y-179843985D02*
X183002199Y-179701128D01*
X183002199Y-179701128D02*
X183073628Y-179629700D01*
X183073628Y-179629700D02*
X183216485Y-179558271D01*
X183216485Y-179558271D02*
X183502199Y-179558271D01*
X183502199Y-179558271D02*
X183645057Y-179629700D01*
X184573628Y-180558271D02*
X184430771Y-180486842D01*
X184430771Y-180486842D02*
X184359342Y-180415414D01*
X184359342Y-180415414D02*
X184287914Y-180272557D01*
X184287914Y-180272557D02*
X184287914Y-179843985D01*
X184287914Y-179843985D02*
X184359342Y-179701128D01*
X184359342Y-179701128D02*
X184430771Y-179629700D01*
X184430771Y-179629700D02*
X184573628Y-179558271D01*
X184573628Y-179558271D02*
X184787914Y-179558271D01*
X184787914Y-179558271D02*
X184930771Y-179629700D01*
X184930771Y-179629700D02*
X185002200Y-179701128D01*
X185002200Y-179701128D02*
X185073628Y-179843985D01*
X185073628Y-179843985D02*
X185073628Y-180272557D01*
X185073628Y-180272557D02*
X185002200Y-180415414D01*
X185002200Y-180415414D02*
X184930771Y-180486842D01*
X184930771Y-180486842D02*
X184787914Y-180558271D01*
X184787914Y-180558271D02*
X184573628Y-180558271D01*
X185716485Y-180558271D02*
X185716485Y-179558271D01*
X185716485Y-179843985D02*
X185787914Y-179701128D01*
X185787914Y-179701128D02*
X185859343Y-179629700D01*
X185859343Y-179629700D02*
X186002200Y-179558271D01*
X186002200Y-179558271D02*
X186145057Y-179558271D01*
X187545056Y-179058271D02*
X187545056Y-180272557D01*
X187545056Y-180272557D02*
X187616485Y-180415414D01*
X187616485Y-180415414D02*
X187687914Y-180486842D01*
X187687914Y-180486842D02*
X187830771Y-180558271D01*
X187830771Y-180558271D02*
X188116485Y-180558271D01*
X188116485Y-180558271D02*
X188259342Y-180486842D01*
X188259342Y-180486842D02*
X188330771Y-180415414D01*
X188330771Y-180415414D02*
X188402199Y-180272557D01*
X188402199Y-180272557D02*
X188402199Y-179058271D01*
X189045057Y-180129700D02*
X189759343Y-180129700D01*
X188902200Y-180558271D02*
X189402200Y-179058271D01*
X189402200Y-179058271D02*
X189902200Y-180558271D01*
X190187914Y-179058271D02*
X190687914Y-180558271D01*
X190687914Y-180558271D02*
X191187914Y-179058271D01*
X191616485Y-180486842D02*
X191759342Y-180558271D01*
X191759342Y-180558271D02*
X192045056Y-180558271D01*
X192045056Y-180558271D02*
X192187913Y-180486842D01*
X192187913Y-180486842D02*
X192259342Y-180343985D01*
X192259342Y-180343985D02*
X192259342Y-180272557D01*
X192259342Y-180272557D02*
X192187913Y-180129700D01*
X192187913Y-180129700D02*
X192045056Y-180058271D01*
X192045056Y-180058271D02*
X191830771Y-180058271D01*
X191830771Y-180058271D02*
X191687913Y-179986842D01*
X191687913Y-179986842D02*
X191616485Y-179843985D01*
X191616485Y-179843985D02*
X191616485Y-179772557D01*
X191616485Y-179772557D02*
X191687913Y-179629700D01*
X191687913Y-179629700D02*
X191830771Y-179558271D01*
X191830771Y-179558271D02*
X192045056Y-179558271D01*
X192045056Y-179558271D02*
X192187913Y-179629700D01*
D10*
D11*
X179073628Y-177558271D02*
X178359342Y-177558271D01*
X178359342Y-177558271D02*
X178359342Y-176058271D01*
X180216486Y-176558271D02*
X180216486Y-177558271D01*
X179573628Y-176558271D02*
X179573628Y-177343985D01*
X179573628Y-177343985D02*
X179645057Y-177486842D01*
X179645057Y-177486842D02*
X179787914Y-177558271D01*
X179787914Y-177558271D02*
X180002200Y-177558271D01*
X180002200Y-177558271D02*
X180145057Y-177486842D01*
X180145057Y-177486842D02*
X180216486Y-177415414D01*
X180930771Y-177558271D02*
X180930771Y-176058271D01*
X181073629Y-176986842D02*
X181502200Y-177558271D01*
X181502200Y-176558271D02*
X180930771Y-177129700D01*
X182716486Y-177486842D02*
X182573629Y-177558271D01*
X182573629Y-177558271D02*
X182287915Y-177558271D01*
X182287915Y-177558271D02*
X182145057Y-177486842D01*
X182145057Y-177486842D02*
X182073629Y-177343985D01*
X182073629Y-177343985D02*
X182073629Y-176772557D01*
X182073629Y-176772557D02*
X182145057Y-176629700D01*
X182145057Y-176629700D02*
X182287915Y-176558271D01*
X182287915Y-176558271D02*
X182573629Y-176558271D01*
X182573629Y-176558271D02*
X182716486Y-176629700D01*
X182716486Y-176629700D02*
X182787915Y-176772557D01*
X182787915Y-176772557D02*
X182787915Y-176915414D01*
X182787915Y-176915414D02*
X182073629Y-177058271D01*
X184259343Y-177486842D02*
X184473629Y-177558271D01*
X184473629Y-177558271D02*
X184830771Y-177558271D01*
X184830771Y-177558271D02*
X184973629Y-177486842D01*
X184973629Y-177486842D02*
X185045057Y-177415414D01*
X185045057Y-177415414D02*
X185116486Y-177272557D01*
X185116486Y-177272557D02*
X185116486Y-177129700D01*
X185116486Y-177129700D02*
X185045057Y-176986842D01*
X185045057Y-176986842D02*
X184973629Y-176915414D01*
X184973629Y-176915414D02*
X184830771Y-176843985D01*
X184830771Y-176843985D02*
X184545057Y-176772557D01*
X184545057Y-176772557D02*
X184402200Y-176701128D01*
X184402200Y-176701128D02*
X184330771Y-176629700D01*
X184330771Y-176629700D02*
X184259343Y-176486842D01*
X184259343Y-176486842D02*
X184259343Y-176343985D01*
X184259343Y-176343985D02*
X184330771Y-176201128D01*
X184330771Y-176201128D02*
X184402200Y-176129700D01*
X184402200Y-176129700D02*
X184545057Y-176058271D01*
X184545057Y-176058271D02*
X184902200Y-176058271D01*
X184902200Y-176058271D02*
X185116486Y-176129700D01*
X186402200Y-177486842D02*
X186259342Y-177558271D01*
X186259342Y-177558271D02*
X185973628Y-177558271D01*
X185973628Y-177558271D02*
X185830771Y-177486842D01*
X185830771Y-177486842D02*
X185759342Y-177415414D01*
X185759342Y-177415414D02*
X185687914Y-177272557D01*
X185687914Y-177272557D02*
X185687914Y-176843985D01*
X185687914Y-176843985D02*
X185759342Y-176701128D01*
X185759342Y-176701128D02*
X185830771Y-176629700D01*
X185830771Y-176629700D02*
X185973628Y-176558271D01*
X185973628Y-176558271D02*
X186259342Y-176558271D01*
X186259342Y-176558271D02*
X186402200Y-176629700D01*
X187045056Y-177558271D02*
X187045056Y-176058271D01*
X187687914Y-177558271D02*
X187687914Y-176772557D01*
X187687914Y-176772557D02*
X187616485Y-176629700D01*
X187616485Y-176629700D02*
X187473628Y-176558271D01*
X187473628Y-176558271D02*
X187259342Y-176558271D01*
X187259342Y-176558271D02*
X187116485Y-176629700D01*
X187116485Y-176629700D02*
X187045056Y-176701128D01*
X188973628Y-177486842D02*
X188830771Y-177558271D01*
X188830771Y-177558271D02*
X188545057Y-177558271D01*
X188545057Y-177558271D02*
X188402199Y-177486842D01*
X188402199Y-177486842D02*
X188330771Y-177343985D01*
X188330771Y-177343985D02*
X188330771Y-176772557D01*
X188330771Y-176772557D02*
X188402199Y-176629700D01*
X188402199Y-176629700D02*
X188545057Y-176558271D01*
X188545057Y-176558271D02*
X188830771Y-176558271D01*
X188830771Y-176558271D02*
X188973628Y-176629700D01*
X188973628Y-176629700D02*
X189045057Y-176772557D01*
X189045057Y-176772557D02*
X189045057Y-176915414D01*
X189045057Y-176915414D02*
X188330771Y-177058271D01*
X190330771Y-176558271D02*
X190330771Y-177558271D01*
X189687913Y-176558271D02*
X189687913Y-177343985D01*
X189687913Y-177343985D02*
X189759342Y-177486842D01*
X189759342Y-177486842D02*
X189902199Y-177558271D01*
X189902199Y-177558271D02*
X190116485Y-177558271D01*
X190116485Y-177558271D02*
X190259342Y-177486842D01*
X190259342Y-177486842D02*
X190330771Y-177415414D01*
X190830771Y-176558271D02*
X191402199Y-176558271D01*
X191045056Y-177558271D02*
X191045056Y-176272557D01*
X191045056Y-176272557D02*
X191116485Y-176129700D01*
X191116485Y-176129700D02*
X191259342Y-176058271D01*
X191259342Y-176058271D02*
X191402199Y-176058271D01*
X191687914Y-176558271D02*
X192259342Y-176558271D01*
X191902199Y-177558271D02*
X191902199Y-176272557D01*
X191902199Y-176272557D02*
X191973628Y-176129700D01*
X191973628Y-176129700D02*
X192116485Y-176058271D01*
X192116485Y-176058271D02*
X192259342Y-176058271D01*
X193330771Y-177486842D02*
X193187914Y-177558271D01*
X193187914Y-177558271D02*
X192902200Y-177558271D01*
X192902200Y-177558271D02*
X192759342Y-177486842D01*
X192759342Y-177486842D02*
X192687914Y-177343985D01*
X192687914Y-177343985D02*
X192687914Y-176772557D01*
X192687914Y-176772557D02*
X192759342Y-176629700D01*
X192759342Y-176629700D02*
X192902200Y-176558271D01*
X192902200Y-176558271D02*
X193187914Y-176558271D01*
X193187914Y-176558271D02*
X193330771Y-176629700D01*
X193330771Y-176629700D02*
X193402200Y-176772557D01*
X193402200Y-176772557D02*
X193402200Y-176915414D01*
X193402200Y-176915414D02*
X192687914Y-177058271D01*
X194259342Y-177558271D02*
X194116485Y-177486842D01*
X194116485Y-177486842D02*
X194045056Y-177343985D01*
X194045056Y-177343985D02*
X194045056Y-176058271D01*
X195402199Y-177486842D02*
X195259342Y-177558271D01*
X195259342Y-177558271D02*
X194973628Y-177558271D01*
X194973628Y-177558271D02*
X194830770Y-177486842D01*
X194830770Y-177486842D02*
X194759342Y-177343985D01*
X194759342Y-177343985D02*
X194759342Y-176772557D01*
X194759342Y-176772557D02*
X194830770Y-176629700D01*
X194830770Y-176629700D02*
X194973628Y-176558271D01*
X194973628Y-176558271D02*
X195259342Y-176558271D01*
X195259342Y-176558271D02*
X195402199Y-176629700D01*
X195402199Y-176629700D02*
X195473628Y-176772557D01*
X195473628Y-176772557D02*
X195473628Y-176915414D01*
X195473628Y-176915414D02*
X194759342Y-177058271D01*
D10*
D11*
D10*
D11*
D10*
D11*
D10*
D11*
X197002200Y-191507200D02*
X197002200Y-194507200D01*
D10*
D11*
X261002200Y-191507200D02*
X261002200Y-198007200D01*
D14*
%TO.N,GND*%
%TO.C,J7*%
X170128000Y-87450000D03*
%TO.N,VMOTOR*%
X170128000Y-92450000D03*
D15*
%TO.N,N/C*%
X180128000Y-95450000D03*
X180128000Y-84450000D03*
%TD*%
D16*
%TO.N,GND*%
X146070000Y-93390000D03*
X158570000Y-85280000D03*
X138000000Y-82890000D03*
X152550000Y-93680000D03*
X139880000Y-93970000D03*
X156287500Y-94470000D03*
X157995000Y-100210000D03*
D17*
X158370000Y-106540000D03*
D16*
X178170000Y-97830000D03*
X137630000Y-92390000D03*
D17*
X168165000Y-108500000D03*
D16*
X156267500Y-92780000D03*
D17*
X150710000Y-85220000D03*
X157280000Y-87960000D03*
D16*
X156280000Y-91100000D03*
X155805000Y-87645000D03*
X158700000Y-86180000D03*
D17*
X166810000Y-99940000D03*
D16*
X175460000Y-95960000D03*
X177410000Y-96930000D03*
X161635000Y-100220000D03*
D17*
X155150000Y-92280000D03*
X142485000Y-85255000D03*
D16*
X133590000Y-86577500D03*
X157992500Y-98470000D03*
D17*
X162330000Y-79440000D03*
D16*
X156287500Y-96630000D03*
X141750000Y-88984500D03*
X143710000Y-100220000D03*
X154240000Y-91917500D03*
D17*
X158330000Y-79440000D03*
D16*
X161625000Y-98490000D03*
%TO.N,+5V*%
X161930000Y-108540000D03*
D17*
X166810000Y-93950000D03*
X160330000Y-79440000D03*
D16*
X160209517Y-96558500D03*
X158012500Y-96630000D03*
X169260000Y-102280000D03*
X155200000Y-103914500D03*
X164930000Y-93050000D03*
%TO.N,+3V3*%
X166830000Y-101940000D03*
X159600000Y-95590000D03*
X144680000Y-94030000D03*
X136680000Y-89240000D03*
X147480000Y-88360000D03*
X135360000Y-86550000D03*
X152360000Y-89120000D03*
X142370000Y-90500000D03*
%TO.N,CAN_P*%
X162349973Y-88560027D03*
D18*
X158695000Y-87645000D03*
D16*
X154300000Y-87157500D03*
%TO.N,CAN_N*%
X154300000Y-88982500D03*
X162590000Y-89650000D03*
X164675000Y-97885000D03*
D18*
X158820000Y-89790000D03*
D16*
X162980000Y-98060000D03*
%TO.N,CAN_SILENT*%
X157570000Y-89751500D03*
X154240000Y-90722500D03*
D18*
X149190000Y-90010000D03*
D16*
%TO.N,VSENSE_MOTOR*%
X140020000Y-87510000D03*
X137670000Y-90400000D03*
%TO.N,VMOTOR*%
X164470000Y-86820000D03*
D17*
X152618247Y-81616500D03*
D16*
X164640000Y-96150000D03*
D17*
X160510000Y-84206500D03*
X142460000Y-81470000D03*
D16*
X164500000Y-88580000D03*
D17*
%TO.N,MOTOR_OUT1*%
X163710000Y-84030000D03*
D16*
X168807500Y-82500000D03*
D17*
%TO.N,MOTOR_OUT2*%
X180590000Y-102670000D03*
X155690000Y-84000000D03*
D16*
%TO.N,MOTOR_OUT3*%
X137590000Y-86600000D03*
X168707500Y-80340000D03*
D17*
X147490000Y-83990000D03*
D16*
X145940000Y-89580000D03*
%TO.N,CAN_TX*%
X144401500Y-89898500D03*
X154390000Y-85920000D03*
%TO.N,CAN_RX*%
X155805000Y-88945000D03*
X148800000Y-92500000D03*
D17*
%TO.N,P1-*%
X180500000Y-106270000D03*
D16*
X170632500Y-82500000D03*
%TO.N,P3-*%
X137188841Y-87621159D03*
X170532500Y-80340000D03*
D17*
X180670000Y-99230000D03*
D16*
X144784500Y-88380000D03*
%TO.N,USART2_TX*%
X152305000Y-103105000D03*
X137620000Y-98660000D03*
%TO.N,USART2_RX*%
X137600000Y-97380000D03*
X154220000Y-101210500D03*
%TO.N,SWCLK-JTCK*%
X145240000Y-92440000D03*
X137630000Y-93640000D03*
%TO.N,SWDIO-JTMS*%
X137630000Y-94890000D03*
X142240000Y-92640000D03*
%TO.N,USART2_CK*%
X154950000Y-98740000D03*
X137630000Y-96140000D03*
%TO.N,SPI2_NSS*%
X152500000Y-99520000D03*
X156020000Y-101870000D03*
%TD*%
D19*
%TO.N,MOTOR_OUT3*%
X137700000Y-86490000D02*
X137590000Y-86600000D01*
X145280000Y-86490000D02*
X137700000Y-86490000D01*
X146878000Y-88088000D02*
X145280000Y-86490000D01*
X146878000Y-89082000D02*
X146878000Y-88088000D01*
X146380000Y-89580000D02*
X146878000Y-89082000D01*
X145940000Y-89580000D02*
X146380000Y-89580000D01*
%TO.N,+5V*%
X161930000Y-108540000D02*
X160890000Y-107500000D01*
X160890000Y-97210000D02*
X160260000Y-96580000D01*
X155200000Y-103914500D02*
X155209739Y-103914500D01*
X155209739Y-103914500D02*
X160209517Y-98914722D01*
X160890000Y-107500000D02*
X160890000Y-97210000D01*
X160209517Y-98914722D02*
X160209517Y-96558500D01*
D20*
%TO.N,CAN_SILENT*%
X153527500Y-90010000D02*
X154240000Y-90722500D01*
X154240000Y-90722500D02*
X154972500Y-89990000D01*
X157331500Y-89990000D02*
X157570000Y-89751500D01*
X154972500Y-89990000D02*
X157331500Y-89990000D01*
X149190000Y-90010000D02*
X153527500Y-90010000D01*
D19*
%TO.N,VMOTOR*%
X161090000Y-86820000D02*
X160510000Y-87400000D01*
D21*
X140015000Y-85695000D02*
X140265000Y-85695000D01*
D22*
X164640000Y-96150000D02*
X164640000Y-96180000D01*
D23*
X160510000Y-87400000D02*
X160510000Y-83140000D01*
X142470000Y-81480000D02*
X142460000Y-81470000D01*
X168780000Y-96150000D02*
X170128000Y-94802000D01*
D19*
X140015000Y-85695000D02*
X140005000Y-85695000D01*
D23*
X160510000Y-92020000D02*
X160510000Y-87400000D01*
X160510000Y-83140000D02*
X158850000Y-81480000D01*
D19*
X164500000Y-88580000D02*
X163330000Y-87410000D01*
D23*
X163280000Y-96150000D02*
X160510000Y-93380000D01*
X150740000Y-81480000D02*
X150730000Y-81490000D01*
X164640000Y-96150000D02*
X166570000Y-96150000D01*
X170128000Y-94802000D02*
X170128000Y-92450000D01*
X160510000Y-93380000D02*
X160510000Y-92020000D01*
D19*
X163330000Y-87410000D02*
X160520000Y-87410000D01*
D23*
X151480000Y-81480000D02*
X142470000Y-81480000D01*
X158850000Y-81480000D02*
X151480000Y-81480000D01*
X166570000Y-96150000D02*
X168780000Y-96150000D01*
D19*
X164470000Y-86820000D02*
X161090000Y-86820000D01*
X160520000Y-87410000D02*
X160510000Y-87400000D01*
D23*
X164640000Y-96150000D02*
X163280000Y-96150000D01*
D19*
%TO.N,P3-*%
X144694500Y-88290000D02*
X137857682Y-88290000D01*
X144784500Y-88380000D02*
X144694500Y-88290000D01*
X137857682Y-88290000D02*
X137188841Y-87621159D01*
%TO.N,SWCLK-JTCK*%
X144650000Y-91850000D02*
X145240000Y-92440000D01*
X138850000Y-93640000D02*
X140640000Y-91850000D01*
X137630000Y-93640000D02*
X138850000Y-93640000D01*
X140640000Y-91850000D02*
X144650000Y-91850000D01*
%TO.N,SWDIO-JTMS*%
X142240000Y-92640000D02*
X142240000Y-92970000D01*
X140320000Y-94890000D02*
X137630000Y-94890000D01*
X142240000Y-92970000D02*
X140320000Y-94890000D01*
%TO.N,SPI2_NSS*%
X153830000Y-101870000D02*
X156020000Y-101870000D01*
X152500000Y-100540000D02*
X153830000Y-101870000D01*
X152500000Y-99520000D02*
X152500000Y-100540000D01*
%TD*%
M02*
