(module DBV0005A-IPC_A (layer F.Cu)
  (fp_text reference REF** (at 0 0) (layer F.SilkS)
    (effects (font (size 1 1) (thickness .15)))
  )
  (fp_text value DBV0005A-IPC_A (at 0 0) (layer F.SilkS)
    (effects (font (size 1 1) (thickness .15)))
  )
  (fp_text user "Copyright 2021 Accelerated Designs. All rights reserved." (at 0 0) (layer Cmts.User)
    (effects (font (size .127 .127) (thickness .002)))
  )
  (fp_text user "*" (at 0 0) (layer F.SilkS)
    (effects (font (size 1 1) (thickness .15)))
  )
  (fp_text user "*" (at 0 0) (layer F.Fab)
    (effects (font (size 1 1) (thickness .15)))
  )
  (fp_text user ".Designator" (at .049985 -.216596) (layer F.Fab)
    (effects (font (size 1 1) (thickness .15)))
  )
  (fp_text user ".Designator" (at .049985 -.216596) (layer Cmts.User)
    (effects (font (size 1 1) (thickness .15)))
  )
  (fp_text user "Designator13" (at -2.8956 -3.2258) (layer F.SilkS)
    (effects (font (size 1 1) (thickness .15)))
  )
  (fp_line (start -.800001 1.45) (end -.800001 -1.45) (layer F.Fab) (width .1))
  (fp_line (start -.800001 1.45) (end .800001 1.45) (layer F.Fab) (width .1))
  (fp_line (start .800001 1.45) (end .800001 -1.45) (layer F.Fab) (width .1))
  (fp_line (start -.800001 -1.45) (end .800001 -1.45) (layer F.Fab) (width .1))
  (fp_line (start -1.4 -1.699999) (end 1.4 -1.699999) (layer F.SilkS) (width .12))
  (fp_line (start -1.4 1.699999) (end 1.4 1.699999) (layer F.SilkS) (width .12))
  (fp_circle (center -2.903101 -.974999) (end -2.7781 -.974999) (layer F.SilkS) (width .12))
  (pad 1 smd rect (at -1.150483 -.950001) (size 1.805236 .612132) (layers F.Cu F.Paste F.Mask))
  (pad 2 smd rect (at -1.150483 0) (size 1.805236 .612132) (layers F.Cu F.Paste F.Mask))
  (pad 3 smd rect (at -1.150483 .950001) (size 1.805236 .612132) (layers F.Cu F.Paste F.Mask))
  (pad 4 smd rect (at 1.150483 .950001) (size 1.805236 .612132) (layers F.Cu F.Paste F.Mask))
  (pad 5 smd rect (at 1.150483 -.950001) (size 1.805236 .612132) (layers F.Cu F.Paste F.Mask))
)
