(module LOGO (layer F.Cu)
  (at 0 0)
(attr board_only exclude_from_pos_files exclude_from_bom)
 (fp_text reference "G***" (at 0 0) (layer F.SilkS)
  (effects (font (thickness 0.3)))
  )
  (fp_text value "LOGO" (at 0.75 0) (layer F.SilkS) hide
  (effects (font (thickness 0.3)))
  )
  (fp_poly (pts (xy -0.145123 2.347608) (xy -0.127000 2.370667) (xy -0.097200 2.446816) (xy -0.177303 2.418136) (xy -0.254000 2.370667) (xy -0.319090 2.302698) (xy -0.280164 2.287296) )(layer F.SilkS) (width  0.000000)
  )
  (fp_poly (pts (xy 0.462350 2.238597) (xy 0.362567 2.312467) (xy 0.221767 2.393065) (xy 0.095403 2.446355) (xy 0.063500 2.452333) (xy 0.000772 2.392138) (xy 0.000000 2.380541) (xy 0.071969 2.307489)
     (xy 0.239775 2.240270) (xy 0.431266 2.206009) (xy 0.465667 2.205489) )(layer F.SilkS) (width  0.000000)
  )
  (fp_poly (pts (xy 1.255121 1.726471) (xy 1.313589 1.840900) (xy 1.249407 2.003089) (xy 1.088468 2.179502) (xy 0.856663 2.336602) (xy 0.743539 2.389105) (xy 0.621918 2.412970) (xy 0.595845 2.389105)
     (xy 0.653198 2.268886) (xy 0.788451 2.099565) (xy 0.959182 1.923780) (xy 1.122970 1.784170) (xy 1.237390 1.723372) )(layer F.SilkS) (width  0.000000)
  )
  (fp_poly (pts (xy -1.524000 1.846985) (xy -1.593748 1.921686) (xy -1.768186 2.025024) (xy -1.841500 2.060196) (xy -2.159000 2.204421) (xy -1.905000 1.991631) (xy -1.679526 1.823716) (xy -1.555089 1.784337)
     )(layer F.SilkS) (width  0.000000)
  )
  (fp_poly (pts (xy 1.131350 0.354128) (xy 1.135755 0.518079) (xy 1.099117 0.639075) (xy 1.045678 0.874193) (xy 1.051188 1.060008) (xy 1.023182 1.261341) (xy 0.844385 1.512853) (xy 0.843163 1.514192)
     (xy 0.701943 1.700222) (xy 0.641322 1.845791) (xy 0.647028 1.882128) (xy 0.650941 1.934717) (xy 0.618221 1.920794) (xy 0.492422 1.925022) (xy 0.372306 1.989686) (xy 0.105124 2.096005)
     (xy -0.218119 2.087971) (xy -0.529167 1.967803) (xy -0.689221 1.856482) (xy -0.761636 1.782242) (xy -0.762000 1.779556) (xy -0.688819 1.740767) (xy -0.529167 1.713666) (xy -0.268534 1.689099)
     (xy 0.025354 1.661485) (xy 0.295041 1.636211) (xy 0.483073 1.618665) (xy 0.529167 1.614415) (xy 0.586748 1.542320) (xy 0.567827 1.389557) (xy 0.516220 1.280401) (xy 0.443152 1.221927)
     (xy 0.317496 1.245477) (xy 0.105677 1.353031) (xy -0.125209 1.466604) (xy -0.283202 1.490273) (xy -0.418406 1.441970) (xy -0.552788 1.317812) (xy -0.546012 1.200007) (xy -0.478083 0.998355)
     (xy -0.445403 0.870419) (xy -0.350179 0.647008) (xy -0.206760 0.545146) (xy -0.048312 0.587803) (xy -0.043262 0.591896) (xy 0.145245 0.653913) (xy 0.408160 0.633641) (xy 0.679616 0.543639)
     (xy 0.872722 0.417231) (xy 1.037365 0.314332) )(layer F.SilkS) (width  0.000000)
  )
  (fp_poly (pts (xy -1.383260 1.587500) (xy -1.271500 1.684671) (xy -1.220611 1.693333) (xy -1.112544 1.741374) (xy -1.100667 1.778000) (xy -1.171579 1.846790) (xy -1.270000 1.862667) (xy -1.404562 1.810784)
     (xy -1.432649 1.672167) (xy -1.413116 1.565330) )(layer F.SilkS) (width  0.000000)
  )
  (fp_poly (pts (xy 1.326444 1.552222) (xy 1.314822 1.602556) (xy 1.270000 1.608667) (xy 1.200310 1.577688) (xy 1.213555 1.552222) (xy 1.314035 1.542089) )(layer F.SilkS) (width  0.000000)
  )
  (fp_poly (pts (xy 1.862667 1.481667) (xy 1.820333 1.524000) (xy 1.778000 1.481667) (xy 1.820333 1.439333) )(layer F.SilkS) (width  0.000000)
  )
  (fp_poly (pts (xy 2.088444 1.467555) (xy 2.076822 1.517890) (xy 2.032000 1.524000) (xy 1.962310 1.493022) (xy 1.975555 1.467555) (xy 2.076035 1.457422) )(layer F.SilkS) (width  0.000000)
  )
  (fp_poly (pts (xy -0.988981 0.656808) (xy -0.711982 0.697502) (xy -0.575005 0.746457) (xy -0.549279 0.825456) (xy -0.602388 0.949497) (xy -0.734699 1.154912) (xy -0.865761 1.296086) (xy -0.966500 1.351270)
     (xy -1.007843 1.298712) (xy -1.002510 1.248833) (xy -1.025470 1.107029) (xy -1.109440 0.903495) (xy -1.119946 0.883356) (xy -1.258294 0.623712) )(layer F.SilkS) (width  0.000000)
  )
  (fp_poly (pts (xy 1.925555 -0.318688) (xy 1.880966 -0.267101) (xy 1.813478 -0.141139) (xy 1.825047 -0.060581) (xy 1.817955 0.094210) (xy 1.737290 0.311151) (xy 1.614382 0.532889) (xy 1.480563 0.702069)
     (xy 1.375704 0.762000) (xy 1.297173 0.706348) (xy 1.313210 0.571500) (xy 1.467827 0.111391) (xy 1.621499 -0.189956) (xy 1.771725 -0.328064) (xy 1.820333 -0.337053) )(layer F.SilkS) (width  0.000000)
  )
  (fp_poly (pts (xy -0.713988 0.275735) (xy -0.689012 0.377388) (xy -0.692101 0.395291) (xy -0.793621 0.527019) (xy -0.915319 0.560133) (xy -1.062964 0.529608) (xy -1.082654 0.433133) (xy -0.988043 0.315788)
     (xy -0.859436 0.268291) )(layer F.SilkS) (width  0.000000)
  )
  (fp_poly (pts (xy 0.558900 0.293989) (xy 0.573264 0.354542) (xy 0.462099 0.470336) (xy 0.274639 0.451380) (xy 0.203431 0.376389) (xy 0.260901 0.296811) (xy 0.412907 0.254569) (xy 0.435385 0.254000)
     )(layer F.SilkS) (width  0.000000)
  )
  (fp_poly (pts (xy 0.686939 -0.335253) (xy 0.761999 -0.206541) (xy 0.762000 -0.205961) (xy 0.832503 -0.107623) (xy 0.931333 -0.084667) (xy 1.068914 -0.049211) (xy 1.100667 0.000000) (xy 1.024306 0.047393)
     (xy 0.828164 0.078353) (xy 0.656167 0.085188) (xy 0.346984 0.110005) (xy 0.068119 0.172371) (xy -0.030845 0.212188) (xy -0.206117 0.303145) (xy -0.300004 0.325512) (xy -0.385776 0.279651)
     (xy -0.470651 0.214359) (xy -0.672942 0.124235) (xy -0.910167 0.087359) (xy -1.121729 0.057452) (xy -1.175203 -0.030789) (xy -1.073655 -0.183709) (xy -1.051952 -0.205953) (xy -0.846191 -0.304149)
     (xy -0.565118 -0.324520) (xy -0.235807 -0.328937) (xy 0.096607 -0.359462) (xy 0.127000 -0.364078) (xy 0.471126 -0.388798) )(layer F.SilkS) (width  0.000000)
  )
)
