
(footprint QFN40P700X700X90-57N (layer F.Cu) (tedit 63D117D4)
  (descr "")
  (attr smd)
  (fp_text reference REF** (at -0.93 -5.74 0) (layer F.SilkS)
    (effects (font (size 1.0 1.0) (thickness 0.15)))
  )
  (fp_text value QFN40P700X700X90-57N (at 8.595 5.74 0) (layer F.Fab)
    (effects (font (size 1.0 1.0) (thickness 0.15)))
  )
  (pad 15 smd roundrect (roundrect_rratio 0.1) (at -2.6 3.435) (size 0.2 0.84) (layers F.Cu F.Mask F.Paste))
  (pad 16 smd roundrect (roundrect_rratio 0.1) (at -2.2 3.435) (size 0.2 0.84) (layers F.Cu F.Mask F.Paste))
  (pad 17 smd roundrect (roundrect_rratio 0.1) (at -1.8 3.435) (size 0.2 0.84) (layers F.Cu F.Mask F.Paste))
  (pad 18 smd roundrect (roundrect_rratio 0.1) (at -1.4 3.435) (size 0.2 0.84) (layers F.Cu F.Mask F.Paste))
  (pad 19 smd roundrect (roundrect_rratio 0.1) (at -1.0 3.435) (size 0.2 0.84) (layers F.Cu F.Mask F.Paste))
  (pad 20 smd roundrect (roundrect_rratio 0.1) (at -0.6 3.435) (size 0.2 0.84) (layers F.Cu F.Mask F.Paste))
  (pad 21 smd roundrect (roundrect_rratio 0.1) (at -0.2 3.435) (size 0.2 0.84) (layers F.Cu F.Mask F.Paste))
  (pad 22 smd roundrect (roundrect_rratio 0.1) (at 0.2 3.435) (size 0.2 0.84) (layers F.Cu F.Mask F.Paste))
  (pad 23 smd roundrect (roundrect_rratio 0.1) (at 0.6 3.435) (size 0.2 0.84) (layers F.Cu F.Mask F.Paste))
  (pad 24 smd roundrect (roundrect_rratio 0.1) (at 1.0 3.435) (size 0.2 0.84) (layers F.Cu F.Mask F.Paste))
  (pad 25 smd roundrect (roundrect_rratio 0.1) (at 1.4 3.435) (size 0.2 0.84) (layers F.Cu F.Mask F.Paste))
  (pad 26 smd roundrect (roundrect_rratio 0.1) (at 1.8 3.435) (size 0.2 0.84) (layers F.Cu F.Mask F.Paste))
  (pad 27 smd roundrect (roundrect_rratio 0.1) (at 2.2 3.435) (size 0.2 0.84) (layers F.Cu F.Mask F.Paste))
  (pad 28 smd roundrect (roundrect_rratio 0.1) (at 2.6 3.435) (size 0.2 0.84) (layers F.Cu F.Mask F.Paste))
  (pad 43 smd roundrect (roundrect_rratio 0.1) (at 2.6 -3.435) (size 0.2 0.84) (layers F.Cu F.Mask F.Paste))
  (pad 44 smd roundrect (roundrect_rratio 0.1) (at 2.2 -3.435) (size 0.2 0.84) (layers F.Cu F.Mask F.Paste))
  (pad 45 smd roundrect (roundrect_rratio 0.1) (at 1.8 -3.435) (size 0.2 0.84) (layers F.Cu F.Mask F.Paste))
  (pad 46 smd roundrect (roundrect_rratio 0.1) (at 1.4 -3.435) (size 0.2 0.84) (layers F.Cu F.Mask F.Paste))
  (pad 47 smd roundrect (roundrect_rratio 0.1) (at 1.0 -3.435) (size 0.2 0.84) (layers F.Cu F.Mask F.Paste))
  (pad 48 smd roundrect (roundrect_rratio 0.1) (at 0.6 -3.435) (size 0.2 0.84) (layers F.Cu F.Mask F.Paste))
  (pad 49 smd roundrect (roundrect_rratio 0.1) (at 0.2 -3.435) (size 0.2 0.84) (layers F.Cu F.Mask F.Paste))
  (pad 50 smd roundrect (roundrect_rratio 0.1) (at -0.2 -3.435) (size 0.2 0.84) (layers F.Cu F.Mask F.Paste))
  (pad 51 smd roundrect (roundrect_rratio 0.1) (at -0.6 -3.435) (size 0.2 0.84) (layers F.Cu F.Mask F.Paste))
  (pad 52 smd roundrect (roundrect_rratio 0.1) (at -1.0 -3.435) (size 0.2 0.84) (layers F.Cu F.Mask F.Paste))
  (pad 53 smd roundrect (roundrect_rratio 0.1) (at -1.4 -3.435) (size 0.2 0.84) (layers F.Cu F.Mask F.Paste))
  (pad 54 smd roundrect (roundrect_rratio 0.1) (at -1.8 -3.435) (size 0.2 0.84) (layers F.Cu F.Mask F.Paste))
  (pad 55 smd roundrect (roundrect_rratio 0.1) (at -2.2 -3.435) (size 0.2 0.84) (layers F.Cu F.Mask F.Paste))
  (pad 56 smd roundrect (roundrect_rratio 0.1) (at -2.6 -3.435) (size 0.2 0.84) (layers F.Cu F.Mask F.Paste))
  (pad 1 smd roundrect (roundrect_rratio 0.03) (at -3.435 -2.6) (size 0.84 0.2) (layers F.Cu F.Mask F.Paste))
  (pad 2 smd roundrect (roundrect_rratio 0.03) (at -3.435 -2.2) (size 0.84 0.2) (layers F.Cu F.Mask F.Paste))
  (pad 3 smd roundrect (roundrect_rratio 0.03) (at -3.435 -1.8) (size 0.84 0.2) (layers F.Cu F.Mask F.Paste))
  (pad 4 smd roundrect (roundrect_rratio 0.03) (at -3.435 -1.4) (size 0.84 0.2) (layers F.Cu F.Mask F.Paste))
  (pad 5 smd roundrect (roundrect_rratio 0.03) (at -3.435 -1.0) (size 0.84 0.2) (layers F.Cu F.Mask F.Paste))
  (pad 6 smd roundrect (roundrect_rratio 0.03) (at -3.435 -0.6) (size 0.84 0.2) (layers F.Cu F.Mask F.Paste))
  (pad 7 smd roundrect (roundrect_rratio 0.03) (at -3.435 -0.2) (size 0.84 0.2) (layers F.Cu F.Mask F.Paste))
  (pad 8 smd roundrect (roundrect_rratio 0.03) (at -3.435 0.2) (size 0.84 0.2) (layers F.Cu F.Mask F.Paste))
  (pad 9 smd roundrect (roundrect_rratio 0.03) (at -3.435 0.6) (size 0.84 0.2) (layers F.Cu F.Mask F.Paste))
  (pad 10 smd roundrect (roundrect_rratio 0.03) (at -3.435 1.0) (size 0.84 0.2) (layers F.Cu F.Mask F.Paste))
  (pad 11 smd roundrect (roundrect_rratio 0.03) (at -3.435 1.4) (size 0.84 0.2) (layers F.Cu F.Mask F.Paste))
  (pad 12 smd roundrect (roundrect_rratio 0.03) (at -3.435 1.8) (size 0.84 0.2) (layers F.Cu F.Mask F.Paste))
  (pad 13 smd roundrect (roundrect_rratio 0.03) (at -3.435 2.2) (size 0.84 0.2) (layers F.Cu F.Mask F.Paste))
  (pad 14 smd roundrect (roundrect_rratio 0.03) (at -3.435 2.6) (size 0.84 0.2) (layers F.Cu F.Mask F.Paste))
  (pad 29 smd roundrect (roundrect_rratio 0.03) (at 3.435 2.6) (size 0.84 0.2) (layers F.Cu F.Mask F.Paste))
  (pad 30 smd roundrect (roundrect_rratio 0.03) (at 3.435 2.2) (size 0.84 0.2) (layers F.Cu F.Mask F.Paste))
  (pad 31 smd roundrect (roundrect_rratio 0.03) (at 3.435 1.8) (size 0.84 0.2) (layers F.Cu F.Mask F.Paste))
  (pad 32 smd roundrect (roundrect_rratio 0.03) (at 3.435 1.4) (size 0.84 0.2) (layers F.Cu F.Mask F.Paste))
  (pad 33 smd roundrect (roundrect_rratio 0.03) (at 3.435 1.0) (size 0.84 0.2) (layers F.Cu F.Mask F.Paste))
  (pad 34 smd roundrect (roundrect_rratio 0.03) (at 3.435 0.6) (size 0.84 0.2) (layers F.Cu F.Mask F.Paste))
  (pad 35 smd roundrect (roundrect_rratio 0.03) (at 3.435 0.2) (size 0.84 0.2) (layers F.Cu F.Mask F.Paste))
  (pad 36 smd roundrect (roundrect_rratio 0.03) (at 3.435 -0.2) (size 0.84 0.2) (layers F.Cu F.Mask F.Paste))
  (pad 37 smd roundrect (roundrect_rratio 0.03) (at 3.435 -0.6) (size 0.84 0.2) (layers F.Cu F.Mask F.Paste))
  (pad 38 smd roundrect (roundrect_rratio 0.03) (at 3.435 -1.0) (size 0.84 0.2) (layers F.Cu F.Mask F.Paste))
  (pad 39 smd roundrect (roundrect_rratio 0.03) (at 3.435 -1.4) (size 0.84 0.2) (layers F.Cu F.Mask F.Paste))
  (pad 40 smd roundrect (roundrect_rratio 0.03) (at 3.435 -1.8) (size 0.84 0.2) (layers F.Cu F.Mask F.Paste))
  (pad 41 smd roundrect (roundrect_rratio 0.03) (at 3.435 -2.2) (size 0.84 0.2) (layers F.Cu F.Mask F.Paste))
  (pad 42 smd roundrect (roundrect_rratio 0.03) (at 3.435 -2.6) (size 0.84 0.2) (layers F.Cu F.Mask F.Paste))
  (pad 57 smd rect (at 0.0 0.0) (size 3.1 3.1) (layers F.Cu F.Mask))
  (fp_poly
    (pts
      (xy -0.98 -0.98)
      (xy 0.98 -0.98)
      (xy 0.98 0.98)
      (xy -0.98 0.98)
    ) (layer F.Paste) (width 0.01)
  )
  (fp_circle (center -4.475 -2.6) (end -4.375 -2.6) (layer F.SilkS) (width 0.2))
  (fp_circle (center -4.475 -2.6) (end -4.375 -2.6) (layer F.Fab) (width 0.2))
  (fp_line (start 3.5 3.5) (end -3.5 3.5) (layer F.Fab) (width 0.127))
  (fp_line (start 3.5 -3.5) (end -3.5 -3.5) (layer F.Fab) (width 0.127))
  (fp_line (start 3.5 3.5) (end 3.5 -3.5) (layer F.Fab) (width 0.127))
  (fp_line (start -3.5 3.5) (end -3.5 -3.5) (layer F.Fab) (width 0.127))
  (fp_line (start 3.5 3.5) (end 3.02 3.5) (layer F.SilkS) (width 0.127))
  (fp_line (start 3.5 -3.5) (end 3.02 -3.5) (layer F.SilkS) (width 0.127))
  (fp_line (start -3.5 3.5) (end -3.02 3.5) (layer F.SilkS) (width 0.127))
  (fp_line (start -3.5 -3.5) (end -3.02 -3.5) (layer F.SilkS) (width 0.127))
  (fp_line (start 3.5 3.5) (end 3.5 3.02) (layer F.SilkS) (width 0.127))
  (fp_line (start 3.5 -3.5) (end 3.5 -3.02) (layer F.SilkS) (width 0.127))
  (fp_line (start -3.5 3.5) (end -3.5 3.02) (layer F.SilkS) (width 0.127))
  (fp_line (start -3.5 -3.5) (end -3.5 -3.02) (layer F.SilkS) (width 0.127))
  (fp_line (start -4.105 4.105) (end 4.105 4.105) (layer F.CrtYd) (width 0.05))
  (fp_line (start -4.105 -4.105) (end 4.105 -4.105) (layer F.CrtYd) (width 0.05))
  (fp_line (start -4.105 4.105) (end -4.105 -4.105) (layer F.CrtYd) (width 0.05))
  (fp_line (start 4.105 4.105) (end 4.105 -4.105) (layer F.CrtYd) (width 0.05))
)