(footprint "LOGO" (version 20210606) (generator bitmap2component) (layer "F.Cu")
  (at 0 0)
(attr board_only exclude_from_pos_files exclude_from_bom)
 (fp_text reference "G***" (at 0 0) (layer F.SilkS)
  (effects (font (thickness 0.3)))
  )
  (fp_text value "LOGO" (at 0.75 0) (layer F.SilkS) hide
  (effects (font (thickness 0.3)))
  )
  (fp_poly (pts (xy 4.324474 -0.748499) (xy 4.558135 -0.748461) (xy 4.777564 -0.748400) (xy 4.983207 -0.748314) (xy 5.175507 -0.748204) (xy 5.354907 -0.748067) (xy 5.521852 -0.747903) (xy 5.676785 -0.747711)
     (xy 5.820150 -0.747490) (xy 5.952391 -0.747239) (xy 6.073952 -0.746957) (xy 6.185277 -0.746642) (xy 6.286808 -0.746294) (xy 6.378991 -0.745913) (xy 6.462268 -0.745496) (xy 6.537085 -0.745043)
     (xy 6.603883 -0.744553) (xy 6.663108 -0.744025) (xy 6.715203 -0.743457) (xy 6.760612 -0.742850) (xy 6.799778 -0.742202) (xy 6.833146 -0.741511) (xy 6.861159 -0.740778) (xy 6.884261 -0.740000)
     (xy 6.902896 -0.739178) (xy 6.917508 -0.738309) (xy 6.928540 -0.737393) (xy 6.936436 -0.736430) (xy 6.941640 -0.735417) (xy 6.944596 -0.734354) (xy 6.945747 -0.733240) (xy 6.945744 -0.732508)
     (xy 6.941753 -0.720429) (xy 6.931933 -0.690872) (xy 6.916780 -0.645331) (xy 6.896793 -0.585300) (xy 6.872471 -0.512275) (xy 6.844309 -0.427749) (xy 6.812808 -0.333218) (xy 6.778463 -0.230174)
     (xy 6.741774 -0.120114) (xy 6.703238 -0.004530) (xy 6.696726 0.015000) (xy 6.453316 0.745000) (xy 1.905869 0.747510) (xy -2.641578 0.750021) (xy -2.605564 0.707947) (xy -2.590112 0.689171)
     (xy -2.577296 0.670880) (xy -2.566872 0.651068) (xy -2.558592 0.627727) (xy -2.552210 0.598850) (xy -2.547480 0.562429) (xy -2.544157 0.516457) (xy -2.541994 0.458926) (xy -2.540745 0.387829)
     (xy -2.540308 0.322697) (xy -2.414096 0.322697) (xy -2.400222 0.380308) (xy -2.370302 0.431418) (xy -2.325652 0.473640) (xy -2.267586 0.504589) (xy -2.210796 0.519896) (xy -2.182562 0.524725)
     (xy -2.163663 0.528051) (xy -2.160000 0.528748) (xy -2.148297 0.527829) (xy -2.122554 0.524354) (xy -2.090000 0.519337) (xy -2.047717 0.509768) (xy -2.006296 0.496013) (xy -1.982500 0.485117)
     (xy -1.940000 0.461407) (xy -1.940000 0.485703) (xy -1.939261 0.496960) (xy -1.934547 0.504059) (xy -1.922111 0.507959) (xy -1.898209 0.509618) (xy -1.859094 0.509994) (xy -1.845000 0.510000)
     (xy -1.750000 0.510000) (xy -1.750000 0.246257) (xy -1.750243 0.157858) (xy -1.751222 0.086844) (xy -1.753313 0.030606) (xy -1.756893 -0.013469) (xy -1.762339 -0.047991) (xy -1.765686 -0.060000)
     (xy -1.670000 -0.060000) (xy -1.520000 -0.060000) (xy -1.519945 0.142500) (xy -1.519401 0.207948) (xy -1.517914 0.268362) (xy -1.515649 0.320060) (xy -1.512770 0.359361) (xy -1.509441 0.382583)
     (xy -1.509214 0.383444) (xy -1.487558 0.428967) (xy -1.452052 0.469715) (xy -1.408775 0.499220) (xy -1.395000 0.504978) (xy -1.360735 0.512683) (xy -1.313549 0.517590) (xy -1.260359 0.519439)
     (xy -1.208086 0.517967) (xy -1.167500 0.513581) (xy -1.145834 0.510000) (xy -1.020000 0.510000) (xy -0.830000 0.510000) (xy -0.830000 0.165000) (xy -0.707952 0.165000) (xy -0.694101 0.250786)
     (xy -0.662883 0.328445) (xy -0.615933 0.396096) (xy -0.554884 0.451857) (xy -0.481370 0.493849) (xy -0.400000 0.519582) (xy -0.341134 0.525363) (xy -0.274217 0.521738) (xy -0.210841 0.510000)
     (xy 0.190000 0.510000) (xy 0.380000 0.510000) (xy 0.380000 0.256743) (xy 0.380045 0.179110) (xy 0.380318 0.118987) (xy 0.381025 0.073883) (xy 0.382370 0.041307) (xy 0.384558 0.018770)
     (xy 0.387796 0.003779) (xy 0.392289 -0.006154) (xy 0.398242 -0.013521) (xy 0.402636 -0.017780) (xy 0.443581 -0.045513) (xy 0.493781 -0.064177) (xy 0.537334 -0.070000) (xy 0.589785 -0.060698)
     (xy 0.633791 -0.033919) (xy 0.666607 0.008641) (xy 0.667500 0.010358) (xy 0.674760 0.025478) (xy 0.680266 0.040728) (xy 0.684260 0.059027) (xy 0.686983 0.083293) (xy 0.688677 0.116444)
     (xy 0.689583 0.161398) (xy 0.689942 0.221073) (xy 0.690000 0.282118) (xy 0.690000 0.510000) (xy 0.881451 0.510000) (xy 1.320000 0.510000) (xy 1.509750 0.510000) (xy 1.512375 0.148600)
     (xy 1.515000 -0.212799) (xy 1.853306 0.440395) (xy 1.899626 0.352697) (xy 1.917144 0.319393) (xy 1.942031 0.271894) (xy 1.972429 0.213749) (xy 2.006485 0.148511) (xy 2.042343 0.079729)
     (xy 2.070472 0.025708) (xy 2.195000 -0.213584) (xy 2.197624 0.148208) (xy 2.200249 0.510000) (xy 2.390000 0.510000) (xy 2.390000 0.136747) (xy 2.523884 0.136747) (xy 2.530848 0.219097)
     (xy 2.556354 0.301112) (xy 2.566873 0.323557) (xy 2.608197 0.385021) (xy 2.664467 0.439313) (xy 2.730970 0.482937) (xy 2.802993 0.512396) (xy 2.830453 0.519076) (xy 2.875662 0.526497)
     (xy 2.913493 0.528266) (xy 2.954068 0.524387) (xy 2.985261 0.519105) (xy 3.068697 0.493947) (xy 3.143847 0.451870) (xy 3.207926 0.394915) (xy 3.258148 0.325121) (xy 3.263433 0.315366)
     (xy 3.277756 0.286599) (xy 3.286941 0.262394) (xy 3.292121 0.236819) (xy 3.294428 0.203940) (xy 3.294952 0.161319) (xy 3.392642 0.161319) (xy 3.405221 0.242884) (xy 3.429002 0.306119)
     (xy 3.472035 0.379367) (xy 3.524970 0.436367) (xy 3.590393 0.479483) (xy 3.642998 0.501959) (xy 3.703071 0.515653) (xy 3.770898 0.518740) (xy 3.838866 0.511646) (xy 3.899363 0.494796)
     (xy 3.917500 0.486603) (xy 3.970000 0.459663) (xy 3.970000 0.484831) (xy 3.970641 0.496491) (xy 3.975064 0.503844) (xy 3.987014 0.507884) (xy 4.010237 0.509603) (xy 4.048480 0.509993)
     (xy 4.065000 0.510000) (xy 4.160000 0.510000) (xy 4.160000 0.019507) (xy 4.310000 0.019507) (xy 4.310442 0.089905) (xy 4.311685 0.156435) (xy 4.313596 0.215555) (xy 4.316046 0.263724)
     (xy 4.318904 0.297400) (xy 4.320617 0.308523) (xy 4.345124 0.377397) (xy 4.385723 0.435936) (xy 4.440161 0.481774) (xy 4.506187 0.512543) (xy 4.518032 0.516006) (xy 4.567311 0.526465)
     (xy 4.611192 0.528100) (xy 4.659206 0.520842) (xy 4.684125 0.514807) (xy 4.721245 0.503008) (xy 4.754559 0.488850) (xy 4.770270 0.479807) (xy 4.793739 0.464445) (xy 4.805581 0.462234)
     (xy 4.809662 0.473680) (xy 4.810000 0.485000) (xy 4.810659 0.496581) (xy 4.815136 0.503885) (xy 4.827176 0.507898) (xy 4.850525 0.509606) (xy 4.888930 0.509993) (xy 4.905000 0.510000)
     (xy 5.000000 0.510000) (xy 5.150000 0.510000) (xy 5.340000 0.510000) (xy 5.340000 0.157514) (xy 5.469032 0.157514) (xy 5.476864 0.229272) (xy 5.494316 0.293561) (xy 5.499448 0.306082)
     (xy 5.525432 0.349935) (xy 5.563588 0.396315) (xy 5.608044 0.439124) (xy 5.652929 0.472264) (xy 5.667072 0.480159) (xy 5.746970 0.509907) (xy 5.834174 0.524003) (xy 5.923082 0.522068)
     (xy 6.008089 0.503724) (xy 6.009520 0.503251) (xy 6.038642 0.491498) (xy 6.071667 0.475137) (xy 6.103808 0.456980) (xy 6.130277 0.439835) (xy 6.146287 0.426513) (xy 6.148870 0.421457)
     (xy 6.141463 0.412109) (xy 6.122824 0.393087) (xy 6.096603 0.368076) (xy 6.089413 0.361432) (xy 6.031085 0.307864) (xy 6.002951 0.327898) (xy 5.948885 0.355263) (xy 5.889688 0.366559)
     (xy 5.829575 0.362602) (xy 5.772758 0.344208) (xy 5.723451 0.312193) (xy 5.685867 0.267375) (xy 5.685265 0.266355) (xy 5.670685 0.240254) (xy 5.661557 0.221562) (xy 5.660000 0.216621)
     (xy 5.669571 0.214880) (xy 5.696572 0.213311) (xy 5.738431 0.211975) (xy 5.792578 0.210936) (xy 5.856443 0.210257) (xy 5.927455 0.210000) (xy 6.202508 0.210000) (xy 6.198154 0.127046)
     (xy 6.184651 0.040149) (xy 6.154544 -0.038608) (xy 6.109227 -0.107044) (xy 6.050092 -0.162976) (xy 5.990000 -0.199057) (xy 5.959867 -0.211875) (xy 5.931585 -0.219690) (xy 5.898440 -0.223665)
     (xy 5.853719 -0.224959) (xy 5.840000 -0.225000) (xy 5.791786 -0.224237) (xy 5.756539 -0.221101) (xy 5.727253 -0.214326) (xy 5.696924 -0.202645) (xy 5.683896 -0.196761) (xy 5.614794 -0.154546)
     (xy 5.556144 -0.098156) (xy 5.510605 -0.031150) (xy 5.480835 0.042912) (xy 5.471923 0.087058) (xy 5.469032 0.157514) (xy 5.340000 0.157514) (xy 5.340000 0.005000) (xy 5.339916 -0.111684)
     (xy 5.339640 -0.209811) (xy 5.339134 -0.290822) (xy 5.338360 -0.356161) (xy 5.337281 -0.407268) (xy 5.335859 -0.445587) (xy 5.334057 -0.472559) (xy 5.331837 -0.489627) (xy 5.329162 -0.498232)
     (xy 5.326836 -0.500001) (xy 5.310275 -0.498306) (xy 5.280491 -0.493931) (xy 5.243910 -0.487933) (xy 5.206955 -0.481372) (xy 5.176052 -0.475309) (xy 5.172500 -0.474544) (xy 5.150000 -0.469619)
     (xy 5.150000 0.510000) (xy 5.000000 0.510000) (xy 5.000000 -0.220000) (xy 4.810000 -0.220000) (xy 4.810000 0.033088) (xy 4.809709 0.118079) (xy 4.808785 0.184775) (xy 4.807149 0.234878)
     (xy 4.804722 0.270084) (xy 4.801424 0.292094) (xy 4.797500 0.302218) (xy 4.762718 0.332039) (xy 4.716391 0.351700) (xy 4.664788 0.360133) (xy 4.614176 0.356272) (xy 4.573043 0.340440)
     (xy 4.553064 0.327606) (xy 4.537426 0.314655) (xy 4.525557 0.299048) (xy 4.516890 0.278247) (xy 4.510855 0.249714) (xy 4.506884 0.210911) (xy 4.504406 0.159300) (xy 4.502854 0.092344)
     (xy 4.501856 0.022970) (xy 4.498712 -0.220001) (xy 4.404356 -0.220000) (xy 4.310000 -0.220000) (xy 4.310000 0.019507) (xy 4.160000 0.019507) (xy 4.160000 0.005000) (xy 4.159916 -0.111684)
     (xy 4.159640 -0.209811) (xy 4.159134 -0.290822) (xy 4.158360 -0.356161) (xy 4.157281 -0.407268) (xy 4.155859 -0.445587) (xy 4.154057 -0.472559) (xy 4.151837 -0.489627) (xy 4.149162 -0.498232)
     (xy 4.146836 -0.500001) (xy 4.130275 -0.498306) (xy 4.100491 -0.493931) (xy 4.063910 -0.487933) (xy 4.026955 -0.481372) (xy 3.996052 -0.475309) (xy 3.992500 -0.474544) (xy 3.983824 -0.471962)
     (xy 3.977725 -0.466581) (xy 3.973749 -0.455304) (xy 3.971442 -0.435035) (xy 3.970351 -0.402677) (xy 3.970021 -0.355133) (xy 3.970000 -0.321065) (xy 3.970000 -0.172510) (xy 3.931814 -0.191403)
     (xy 3.854881 -0.218754) (xy 3.774335 -0.228024) (xy 3.693598 -0.219856) (xy 3.616093 -0.194889) (xy 3.545243 -0.153766) (xy 3.495687 -0.109701) (xy 3.450451 -0.053551) (xy 3.420136 0.004657)
     (xy 3.400592 0.073011) (xy 3.399736 0.077283) (xy 3.392642 0.161319) (xy 3.294952 0.161319) (xy 3.294995 0.157826) (xy 3.295000 0.150000) (xy 3.294423 0.099995) (xy 3.292027 0.063920)
     (xy 3.286807 0.035718) (xy 3.277763 0.009337) (xy 3.268118 -0.012358) (xy 3.228725 -0.075979) (xy 3.174684 -0.134036) (xy 3.111346 -0.181179) (xy 3.084781 -0.195695) (xy 3.056450 -0.208803)
     (xy 3.031868 -0.217300) (xy 3.005312 -0.222174) (xy 2.971060 -0.224409) (xy 2.923389 -0.224994) (xy 2.914789 -0.225000) (xy 2.865149 -0.224634) (xy 2.829642 -0.222811) (xy 2.802407 -0.218446)
     (xy 2.777580 -0.210451) (xy 2.749299 -0.197741) (xy 2.738072 -0.192259) (xy 2.664808 -0.145850) (xy 2.605925 -0.087238) (xy 2.562255 -0.018928) (xy 2.534631 0.056569) (xy 2.523884 0.136747)
     (xy 2.390000 0.136747) (xy 2.390000 -0.470000) (xy 2.257500 -0.469881) (xy 2.125000 -0.469761) (xy 1.991141 -0.204125) (xy 1.857283 0.061512) (xy 1.721141 -0.204196) (xy 1.585000 -0.469904)
     (xy 1.320000 -0.470000) (xy 1.320000 0.510000) (xy 0.881451 0.510000) (xy 0.878167 0.242500) (xy 0.877104 0.161972) (xy 0.875980 0.098802) (xy 0.874575 0.050349) (xy 0.872669 0.013971)
     (xy 0.870041 -0.012973) (xy 0.866472 -0.033125) (xy 0.861741 -0.049126) (xy 0.855629 -0.063617) (xy 0.852039 -0.071014) (xy 0.811715 -0.134337) (xy 0.761404 -0.180817) (xy 0.699831 -0.211276)
     (xy 0.625717 -0.226537) (xy 0.608812 -0.227866) (xy 0.543072 -0.227836) (xy 0.488610 -0.217881) (xy 0.438526 -0.196412) (xy 0.417500 -0.183813) (xy 0.380000 -0.159717) (xy 0.380000 -0.220000)
     (xy 0.190000 -0.220000) (xy 0.190000 0.510000) (xy -0.210841 0.510000) (xy -0.208379 0.509544) (xy -0.174471 0.498943) (xy -0.099775 0.461518) (xy -0.038742 0.411878) (xy 0.008538 0.352490)
     (xy 0.041978 0.285825) (xy 0.061489 0.214351) (xy 0.066985 0.140540) (xy 0.058377 0.066860) (xy 0.035578 -0.004220) (xy -0.001502 -0.070229) (xy -0.052948 -0.128699) (xy -0.118851 -0.177159)
     (xy -0.149827 -0.193447) (xy -0.224984 -0.219244) (xy -0.306213 -0.230292) (xy -0.387121 -0.226244) (xy -0.452783 -0.209986) (xy -0.534443 -0.171058) (xy -0.601563 -0.119250) (xy -0.653212 -0.055929)
     (xy -0.688460 0.017537) (xy -0.706375 0.099781) (xy -0.707952 0.165000) (xy -0.830000 0.165000) (xy -0.830000 -0.220000) (xy -1.020000 -0.220000) (xy -1.020000 0.510000) (xy -1.145834 0.510000)
     (xy -1.130000 0.507383) (xy -1.130000 0.354611) (xy -1.204393 0.358367) (xy -1.243417 0.359760) (xy -1.268368 0.358235) (xy -1.285104 0.352513) (xy -1.299485 0.341313) (xy -1.304393 0.336516)
     (xy -1.330000 0.310909) (xy -1.330000 -0.060000) (xy -1.120000 -0.060000) (xy -1.120000 -0.220000) (xy -1.330000 -0.220000) (xy -1.330000 -0.335674) (xy -1.330247 -0.385254) (xy -1.331320 -0.418009)
     (xy -1.331973 -0.423204) (xy -1.035027 -0.423204) (xy -1.028346 -0.379552) (xy -1.006913 -0.345374) (xy -0.973800 -0.322938) (xy -0.934307 -0.313424) (xy -0.893737 -0.318013) (xy -0.857393 -0.337884)
     (xy -0.854171 -0.340780) (xy -0.830266 -0.375488) (xy -0.822320 -0.415584) (xy -0.829372 -0.455796) (xy -0.850461 -0.490850) (xy -0.884625 -0.515473) (xy -0.886138 -0.516120) (xy -0.929708 -0.525163)
     (xy -0.969601 -0.517302) (xy -1.002597 -0.495628) (xy -1.025478 -0.463232) (xy -1.035027 -0.423204) (xy -1.331973 -0.423204) (xy -1.333722 -0.437113) (xy -1.337954 -0.445737) (xy -1.344518 -0.447056)
     (xy -1.347500 -0.446367) (xy -1.365316 -0.441950) (xy -1.396536 -0.434796) (xy -1.434997 -0.426311) (xy -1.442500 -0.424689) (xy -1.520000 -0.407993) (xy -1.520000 -0.220000) (xy -1.670000 -0.220000)
     (xy -1.670000 -0.060000) (xy -1.765686 -0.060000) (xy -1.770026 -0.075570) (xy -1.780332 -0.098818) (xy -1.793632 -0.120346) (xy -1.805114 -0.136038) (xy -1.827841 -0.158199) (xy -1.860823 -0.181714)
     (xy -1.887292 -0.196560) (xy -1.949736 -0.218004) (xy -2.024327 -0.228828) (xy -2.106383 -0.229222) (xy -2.191221 -0.219372) (xy -2.274161 -0.199468) (xy -2.330677 -0.178756) (xy -2.358147 -0.165394)
     (xy -2.376054 -0.153721) (xy -2.380000 -0.148484) (xy -2.375775 -0.134734) (xy -2.365015 -0.110513) (xy -2.350600 -0.081386) (xy -2.335405 -0.052916) (xy -2.322308 -0.030669) (xy -2.314186 -0.020209)
     (xy -2.313566 -0.020000) (xy -2.301823 -0.023169) (xy -2.276435 -0.031541) (xy -2.242530 -0.043415) (xy -2.236776 -0.045483) (xy -2.161816 -0.065802) (xy -2.098914 -0.071179) (xy -2.036656 -0.066207)
     (xy -1.990660 -0.050321) (xy -1.959943 -0.022739) (xy -1.943524 0.017323) (xy -1.940000 0.055530) (xy -1.940000 0.106610) (xy -2.002500 0.093513) (xy -2.084519 0.082289) (xy -2.162870 0.082857)
     (xy -2.234726 0.094455) (xy -2.297261 0.116321) (xy -2.347650 0.147695) (xy -2.383064 0.187814) (xy -2.388451 0.197511) (xy -2.410611 0.260969) (xy -2.414096 0.322697) (xy -2.540308 0.322697)
     (xy -2.540163 0.301159) (xy -2.540003 0.196908) (xy -2.540001 0.173184) (xy -2.540000 -0.220000) (xy -2.635000 -0.220000) (xy -2.679090 -0.219731) (xy -2.706908 -0.218370) (xy -2.722181 -0.215092)
     (xy -2.728636 -0.209070) (xy -2.729999 -0.199477) (xy -2.730000 -0.198931) (xy -2.733532 -0.183995) (xy -2.746779 -0.185156) (xy -2.747500 -0.185464) (xy -2.806700 -0.208916) (xy -2.856493 -0.222643)
     (xy -2.904048 -0.228109) (xy -2.951437 -0.227137) (xy -3.037913 -0.212033) (xy -3.115455 -0.179503) (xy -3.182476 -0.130626) (xy -3.237389 -0.066480) (xy -3.268396 -0.011752) (xy -3.281115 0.017921)
     (xy -3.289041 0.045172) (xy -3.293257 0.076387) (xy -3.294850 0.117954) (xy -3.295000 0.145000) (xy -3.294379 0.193677) (xy -3.291788 0.228619) (xy -3.286133 0.256070) (xy -3.276324 0.282274)
     (xy -3.267839 0.300304) (xy -3.228705 0.366946) (xy -3.182492 0.418617) (xy -3.124354 0.460217) (xy -3.093491 0.476720) (xy -3.053247 0.495662) (xy -3.021905 0.506836) (xy -2.990921 0.512254)
     (xy -2.951749 0.513926) (xy -2.935153 0.514000) (xy -2.889928 0.512997) (xy -2.856425 0.508824) (xy -2.826414 0.499732) (xy -2.791667 0.483973) (xy -2.790032 0.483164) (xy -2.727819 0.452328)
     (xy -2.731873 0.515990) (xy -2.735826 0.554565) (xy -2.743364 0.580543) (xy -2.757042 0.601300) (xy -2.764152 0.609114) (xy -2.804393 0.637249) (xy -2.857889 0.653357) (xy -2.921802 0.657288)
     (xy -2.993294 0.648891) (xy -3.069529 0.628017) (xy -3.076186 0.625645) (xy -3.139718 0.602584) (xy -3.163913 0.655433) (xy -3.178470 0.688314) (xy -3.190141 0.716596) (xy -3.194728 0.729140)
     (xy -3.201348 0.750000) (xy -5.076348 0.750000) (xy -5.303968 0.749993) (xy -5.512425 0.749968) (xy -5.702556 0.749918) (xy -5.875197 0.749833) (xy -6.031185 0.749707) (xy -6.171357 0.749531)
     (xy -6.296550 0.749297) (xy -6.407600 0.748999) (xy -6.505344 0.748627) (xy -6.590619 0.748175) (xy -6.664263 0.747634) (xy -6.727111 0.746996) (xy -6.780000 0.746254) (xy -6.823767 0.745400)
     (xy -6.859250 0.744426) (xy -6.887284 0.743324) (xy -6.908706 0.742086) (xy -6.924354 0.740704) (xy -6.935064 0.739172) (xy -6.941673 0.737480) (xy -6.945017 0.735621) (xy -6.945934 0.733587)
     (xy -6.945743 0.732500) (xy -6.941752 0.720422) (xy -6.931932 0.690866) (xy -6.916780 0.645326) (xy -6.896793 0.585296) (xy -6.872471 0.512272) (xy -6.844310 0.427747) (xy -6.812809 0.333216)
     (xy -6.778465 0.230174) (xy -6.741776 0.120114) (xy -6.703240 0.004531) (xy -6.696727 -0.015000) (xy -6.544771 -0.470725) (xy -6.200000 -0.470725) (xy -6.200000 0.510000) (xy -6.010274 0.510000)
     (xy -6.005000 -0.139594) (xy -5.759307 0.182703) (xy -5.513613 0.505000) (xy -5.421807 0.507875) (xy -5.330000 0.510750) (xy -5.330000 0.284676) (xy -5.205017 0.284676) (xy -5.202712 0.345122)
     (xy -5.184711 0.400000) (xy -5.151817 0.443853) (xy -5.104126 0.480959) (xy -5.046519 0.508131) (xy -5.000971 0.519871) (xy -4.972681 0.524707) (xy -4.953718 0.528041) (xy -4.950000 0.528748)
     (xy -4.938297 0.527829) (xy -4.912554 0.524354) (xy -4.880000 0.519337) (xy -4.837717 0.509768) (xy -4.796296 0.496013) (xy -4.772500 0.485117) (xy -4.730000 0.461407) (xy -4.730000 0.485703)
     (xy -4.729261 0.496960) (xy -4.724547 0.504059) (xy -4.712111 0.507959) (xy -4.688209 0.509618) (xy -4.649094 0.509994) (xy -4.635000 0.510000) (xy -4.540000 0.510000) (xy -4.540000 0.251589)
     (xy -4.540315 0.161511) (xy -4.541496 0.088857) (xy -4.543906 0.031058) (xy -4.547902 -0.014454) (xy -4.553845 -0.050250) (xy -4.562095 -0.078898) (xy -4.573011 -0.102967) (xy -4.586953 -0.125027)
     (xy -4.594074 -0.134675) (xy -4.636287 -0.174204) (xy -4.693111 -0.203438) (xy -4.756472 -0.220659) (xy -4.508196 -0.220659) (xy -4.351672 0.144670) (xy -4.195149 0.510000) (xy -3.610000 0.510000)
     (xy -3.420000 0.510000) (xy -3.420000 -0.220000) (xy -3.610000 -0.220000) (xy -3.610000 0.510000) (xy -4.195149 0.510000) (xy -4.100075 0.509715) (xy -4.005000 0.509430) (xy -3.692318 -0.220000)
     (xy -3.895509 -0.220000) (xy -3.994194 0.020561) (xy -4.020914 0.084683) (xy -4.045500 0.141756) (xy -4.066878 0.189447) (xy -4.083979 0.225421) (xy -4.095729 0.247343) (xy -4.100929 0.253061)
     (xy -4.106812 0.241925) (xy -4.119105 0.214870) (xy -4.136686 0.174501) (xy -4.158428 0.123425) (xy -4.183210 0.064248) (xy -4.203574 0.015000) (xy -4.298170 -0.215000) (xy -4.403183 -0.217830)
     (xy -4.508196 -0.220659) (xy -4.756472 -0.220659) (xy -4.761862 -0.222124) (xy -4.839857 -0.230011) (xy -4.924410 -0.226848) (xy -5.012838 -0.212383) (xy -5.102458 -0.186365) (xy -5.111289 -0.183152)
     (xy -5.179229 -0.157969) (xy -5.144489 -0.088985) (xy -5.127794 -0.056404) (xy -5.114811 -0.032138) (xy -5.107867 -0.020505) (xy -5.107375 -0.020070) (xy -5.097499 -0.023100) (xy -5.073398 -0.031080)
     (xy -5.039758 -0.042452) (xy -5.030000 -0.045782) (xy -4.958461 -0.064852) (xy -4.892453 -0.072059) (xy -4.834555 -0.067729) (xy -4.787348 -0.052188) (xy -4.753414 -0.025764) (xy -4.742670 -0.009453)
     (xy -4.734919 0.015865) (xy -4.730516 0.049581) (xy -4.730148 0.060797) (xy -4.730000 0.106594) (xy -4.797500 0.092343) (xy -4.873991 0.082169) (xy -4.949624 0.083056) (xy -5.020694 0.094186)
     (xy -5.083494 0.114741) (xy -5.134317 0.143902) (xy -5.164162 0.173276) (xy -5.191978 0.225314) (xy -5.205017 0.284676) (xy -5.330000 0.284676) (xy -5.330000 -0.421471) (xy -3.625720 -0.421471)
     (xy -3.619573 -0.385744) (xy -3.602433 -0.353569) (xy -3.575837 -0.328403) (xy -3.541328 -0.313705) (xy -3.500444 -0.312933) (xy -3.475656 -0.319751) (xy -3.449744 -0.338127) (xy -3.426945 -0.368332)
     (xy -3.412526 -0.402316) (xy -3.410075 -0.420000) (xy -3.419261 -0.459110) (xy -3.443664 -0.493537) (xy -3.478551 -0.517179) (xy -3.488084 -0.520608) (xy -3.518444 -0.527023) (xy -3.543554 -0.523416)
     (xy -3.562789 -0.515380) (xy -3.598868 -0.489747) (xy -3.619331 -0.457291) (xy -3.625720 -0.421471) (xy -5.330000 -0.421471) (xy -5.330000 -0.470000) (xy -5.519720 -0.470000) (xy -5.522360 -0.155213)
     (xy -5.525000 0.159575) (xy -5.765207 -0.152713) (xy -6.005413 -0.465000) (xy -6.102707 -0.467863) (xy -6.200000 -0.470725) (xy -6.544771 -0.470725) (xy -6.453317 -0.745000) (xy 0.249018 -0.747508)
     (xy 0.688062 -0.747671) (xy 1.107550 -0.747822) (xy 1.507926 -0.747961) (xy 1.889633 -0.748087) (xy 2.253115 -0.748199) (xy 2.598816 -0.748295) (xy 2.927180 -0.748376) (xy 3.238651 -0.748439)
     (xy 3.533671 -0.748483) (xy 3.812687 -0.748509) (xy 4.076140 -0.748514) )(layer F.SilkS) (width  0.000000)
  )
  (fp_poly (pts (xy -2.860418 -0.064304) (xy -2.797166 -0.046437) (xy -2.762500 -0.028431) (xy -2.730000 -0.008369) (xy -2.730000 0.139265) (xy -2.730276 0.197782) (xy -2.731337 0.239565) (xy -2.733534 0.267878)
     (xy -2.737216 0.285984) (xy -2.742734 0.297143) (xy -2.747500 0.302244) (xy -2.794376 0.331766) (xy -2.851078 0.350051) (xy -2.910182 0.355547) (xy -2.962716 0.347216) (xy -3.016560 0.320274)
     (xy -3.062917 0.279080) (xy -3.091061 0.237921) (xy -3.106110 0.190846) (xy -3.109914 0.136312) (xy -3.102873 0.082019) (xy -3.085385 0.035670) (xy -3.080161 0.027284) (xy -3.037204 -0.018846)
     (xy -2.983931 -0.049896) (xy -2.923838 -0.065253) )(layer F.SilkS) (width  0.000000)
  )
  (fp_poly (pts (xy -4.803512 0.211059) (xy -4.767500 0.219157) (xy -4.730000 0.231551) (xy -4.730000 0.288923) (xy -4.730645 0.321596) (xy -4.734694 0.340666) (xy -4.745324 0.352528) (xy -4.765710 0.363576)
     (xy -4.767500 0.364444) (xy -4.811197 0.379173) (xy -4.862065 0.386711) (xy -4.912704 0.386743) (xy -4.955712 0.378949) (xy -4.969989 0.373128) (xy -5.004355 0.346716) (xy -5.022210 0.314313)
     (xy -5.023388 0.280009) (xy -5.007724 0.247889) (xy -4.976092 0.222587) (xy -4.944602 0.212705) (xy -4.900653 0.207413) (xy -4.851278 0.206826) )(layer F.SilkS) (width  0.000000)
  )
  (fp_poly (pts (xy -2.012990 0.211122) (xy -1.977500 0.219157) (xy -1.940000 0.231551) (xy -1.940000 0.288923) (xy -1.940645 0.321596) (xy -1.944694 0.340666) (xy -1.955324 0.352528) (xy -1.975710 0.363576)
     (xy -1.977500 0.364444) (xy -2.021197 0.379173) (xy -2.072065 0.386711) (xy -2.122704 0.386743) (xy -2.165712 0.378949) (xy -2.179989 0.373128) (xy -2.213623 0.346970) (xy -2.231173 0.314494)
     (xy -2.232456 0.280010) (xy -2.217288 0.247830) (xy -2.186416 0.222755) (xy -2.154656 0.212755) (xy -2.110464 0.207401) (xy -2.060892 0.206817) )(layer F.SilkS) (width  0.000000)
  )
  (fp_poly (pts (xy -0.287671 -0.064857) (xy -0.234622 -0.046100) (xy -0.186692 -0.013840) (xy -0.148794 0.028954) (xy -0.132858 0.058586) (xy -0.119709 0.112672) (xy -0.120511 0.172354) (xy -0.134144 0.230931)
     (xy -0.159490 0.281706) (xy -0.172978 0.298682) (xy -0.215813 0.331561) (xy -0.269076 0.351964) (xy -0.326665 0.358671) (xy -0.382475 0.350462) (xy -0.399929 0.344070) (xy -0.450897 0.312142)
     (xy -0.488681 0.268594) (xy -0.513015 0.217014) (xy -0.523633 0.160987) (xy -0.520267 0.104101) (xy -0.502652 0.049943) (xy -0.470521 0.002098) (xy -0.427960 -0.033228) (xy -0.392696 -0.051137)
     (xy -0.355839 -0.064057) (xy -0.340927 -0.067145) )(layer F.SilkS) (width  0.000000)
  )
  (fp_poly (pts (xy 2.965160 -0.060505) (xy 3.019340 -0.036115) (xy 3.029910 -0.028916) (xy 3.065407 0.006025) (xy 3.094829 0.051974) (xy 3.114215 0.101489) (xy 3.119846 0.140000) (xy 3.111400 0.203047)
     (xy 3.087772 0.257966) (xy 3.051767 0.302920) (xy 3.006191 0.336074) (xy 2.953849 0.355595) (xy 2.897547 0.359646) (xy 2.840089 0.346394) (xy 2.819072 0.336723) (xy 2.772892 0.301533)
     (xy 2.737801 0.252561) (xy 2.716521 0.194193) (xy 2.712026 0.164296) (xy 2.715282 0.101590) (xy 2.734124 0.046274) (xy 2.765782 0.000034) (xy 2.807484 -0.035448) (xy 2.856462 -0.058488)
     (xy 2.909944 -0.067402) )(layer F.SilkS) (width  0.000000)
  )
  (fp_poly (pts (xy 5.896201 -0.063121) (xy 5.946632 -0.037540) (xy 5.985491 0.004191) (xy 5.995950 0.022003) (xy 6.005951 0.042033) (xy 6.010630 0.056822) (xy 6.007763 0.067165) (xy 5.995129 0.073856)
     (xy 5.970509 0.077691) (xy 5.931679 0.079464) (xy 5.876419 0.079972) (xy 5.833915 0.080000) (xy 5.657831 0.080000) (xy 5.664580 0.053109) (xy 5.686694 0.003674) (xy 5.723660 -0.035445)
     (xy 5.771848 -0.061579) (xy 5.827631 -0.072061) (xy 5.834905 -0.072138) )(layer F.SilkS) (width  0.000000)
  )
  (fp_poly (pts (xy 3.857360 -0.060148) (xy 3.911607 -0.040222) (xy 3.936191 -0.024770) (xy 3.970000 0.001017) (xy 3.969931 0.148008) (xy 3.969863 0.295000) (xy 3.936414 0.317772) (xy 3.875828 0.347367)
     (xy 3.809492 0.359269) (xy 3.741999 0.352904) (xy 3.716247 0.345308) (xy 3.662853 0.316256) (xy 3.621303 0.273164) (xy 3.593655 0.219435) (xy 3.581964 0.158470) (xy 3.582905 0.124735)
     (xy 3.598615 0.060324) (xy 3.630578 0.007061) (xy 3.677566 -0.033623) (xy 3.738354 -0.060297) (xy 3.742660 -0.061487) (xy 3.798329 -0.067752) )(layer F.SilkS) (width  0.000000)
  )
)
