(kicad_symbol_lib (version 20211014) (generator kicad_symbol_editor)
  (symbol "RT8279GSP" (pin_names (offset 1.016)) (in_bom yes) (on_board yes)
    (property "Reference" "U?" (id 0) (at -1.27 8.89 0)
      (effects (font (size 1.27 1.27)) (justify left bottom))
    )
    (property "Value" "RT8279GSP" (id 1) (at -5.08 6.35 0)
      (effects (font (size 1.27 1.27)) (justify left bottom))
    )
    (property "Footprint" "SOIC127P600X175-9N" (id 2) (at 2.54 -10.16 0)
      (effects (font (size 1.27 1.27)) (justify left bottom) hide)
    )
    (property "Datasheet" "" (id 3) (at -50.8 17.78 0)
      (effects (font (size 1.27 1.27)) (justify left bottom) hide)
    )
    (property "MANUFACTURER" "Richtek" (id 4) (at 2.54 -12.7 0)
      (effects (font (size 1.27 1.27)) (justify left bottom) hide)
    )
    (property "ki_locked" "" (id 5) (at 0 0 0)
      (effects (font (size 1.27 1.27)))
    )
    (symbol "RT8279GSP_1_1"
      (rectangle (start -6.35 5.08) (end 6.35 -7.62)
        (stroke (width 0) (type default) (color 0 0 0 0))
        (fill (type background))
      )
      (pin input line (at 8.89 2.54 180) (length 2.54)
        (name "BOOT" (effects (font (size 1.27 1.27))))
        (number "1" (effects (font (size 1.27 1.27))))
      )
      (pin input line (at 8.89 -2.54 180) (length 2.54)
        (name "FB" (effects (font (size 1.27 1.27))))
        (number "4" (effects (font (size 1.27 1.27))))
      )
      (pin input line (at -8.89 -1.27 0) (length 2.54)
        (name "EN" (effects (font (size 1.27 1.27))))
        (number "5" (effects (font (size 1.27 1.27))))
      )
      (pin power_in line (at -1.27 -10.16 90) (length 2.54)
        (name "GND" (effects (font (size 1.27 1.27))))
        (number "6" (effects (font (size 1.27 1.27))))
      )
      (pin power_in line (at -8.89 1.27 0) (length 2.54)
        (name "VIN" (effects (font (size 1.27 1.27))))
        (number "7" (effects (font (size 1.27 1.27))))
      )
      (pin power_out line (at 8.89 0 180) (length 2.54)
        (name "SW" (effects (font (size 1.27 1.27))))
        (number "8" (effects (font (size 1.27 1.27))))
      )
      (pin power_in line (at 1.27 -10.16 90) (length 2.54)
        (name "GND" (effects (font (size 1.27 1.27))))
        (number "9" (effects (font (size 1.27 1.27))))
      )
    )
  )
)
