
(module HRS_DF17_2.0_-40DP-0.5V_57_ (layer F.Cu) (tedit 62C23C6B)
  (descr "")
  (fp_text reference REF** (at -3.093875 -4.251805 0) (layer F.SilkS)
    (effects (font (size 1.0024015748 1.0024015748) (thickness 0.15)))
  )
  (fp_text value HRS_DF17_2.0_-40DP-0.5V_57_ (at 10.920055 4.197755 0) (layer F.Fab)
    (effects (font (size 1.0041496063 1.0041496063) (thickness 0.15)))
  )
  (pad 1 smd rect (at -4.75 2.575) (size 0.25 1.15) (layers F.Cu F.Mask F.Paste))
  (pad 2 smd rect (at -4.75 -2.575) (size 0.25 1.15) (layers F.Cu F.Mask F.Paste))
  (pad 3 smd rect (at -4.25 2.575) (size 0.25 1.15) (layers F.Cu F.Mask F.Paste))
  (pad 4 smd rect (at -4.25 -2.575) (size 0.25 1.15) (layers F.Cu F.Mask F.Paste))
  (pad 5 smd rect (at -3.75 2.575) (size 0.25 1.15) (layers F.Cu F.Mask F.Paste))
  (pad 6 smd rect (at -3.75 -2.575) (size 0.25 1.15) (layers F.Cu F.Mask F.Paste))
  (pad 7 smd rect (at -3.25 2.575) (size 0.25 1.15) (layers F.Cu F.Mask F.Paste))
  (pad 8 smd rect (at -3.25 -2.575) (size 0.25 1.15) (layers F.Cu F.Mask F.Paste))
  (pad 9 smd rect (at -2.75 2.575) (size 0.25 1.15) (layers F.Cu F.Mask F.Paste))
  (pad 10 smd rect (at -2.75 -2.575) (size 0.25 1.15) (layers F.Cu F.Mask F.Paste))
  (pad 11 smd rect (at -2.25 2.575) (size 0.25 1.15) (layers F.Cu F.Mask F.Paste))
  (pad 12 smd rect (at -2.25 -2.575) (size 0.25 1.15) (layers F.Cu F.Mask F.Paste))
  (pad 13 smd rect (at -1.75 2.575) (size 0.25 1.15) (layers F.Cu F.Mask F.Paste))
  (pad 14 smd rect (at -1.75 -2.575) (size 0.25 1.15) (layers F.Cu F.Mask F.Paste))
  (pad 15 smd rect (at -1.25 2.575) (size 0.25 1.15) (layers F.Cu F.Mask F.Paste))
  (pad 16 smd rect (at -1.25 -2.575) (size 0.25 1.15) (layers F.Cu F.Mask F.Paste))
  (pad 17 smd rect (at -0.75 2.575) (size 0.25 1.15) (layers F.Cu F.Mask F.Paste))
  (pad 18 smd rect (at -0.75 -2.575) (size 0.25 1.15) (layers F.Cu F.Mask F.Paste))
  (pad 19 smd rect (at -0.25 2.575) (size 0.25 1.15) (layers F.Cu F.Mask F.Paste))
  (pad 20 smd rect (at -0.25 -2.575) (size 0.25 1.15) (layers F.Cu F.Mask F.Paste))
  (pad 21 smd rect (at 0.25 2.575) (size 0.25 1.15) (layers F.Cu F.Mask F.Paste))
  (pad 22 smd rect (at 0.25 -2.575) (size 0.25 1.15) (layers F.Cu F.Mask F.Paste))
  (pad 23 smd rect (at 0.75 2.575) (size 0.25 1.15) (layers F.Cu F.Mask F.Paste))
  (pad 24 smd rect (at 0.75 -2.575) (size 0.25 1.15) (layers F.Cu F.Mask F.Paste))
  (pad 25 smd rect (at 1.25 2.575) (size 0.25 1.15) (layers F.Cu F.Mask F.Paste))
  (pad 26 smd rect (at 1.25 -2.575) (size 0.25 1.15) (layers F.Cu F.Mask F.Paste))
  (pad 27 smd rect (at 1.75 2.575) (size 0.25 1.15) (layers F.Cu F.Mask F.Paste))
  (pad 28 smd rect (at 1.75 -2.575) (size 0.25 1.15) (layers F.Cu F.Mask F.Paste))
  (pad 29 smd rect (at 2.25 2.575) (size 0.25 1.15) (layers F.Cu F.Mask F.Paste))
  (pad 30 smd rect (at 2.25 -2.575) (size 0.25 1.15) (layers F.Cu F.Mask F.Paste))
  (pad S1 smd rect (at -7.0 0.0) (size 1.4 2.1) (layers F.Cu F.Mask F.Paste))
  (pad S2 smd rect (at 7.0 0.0) (size 1.4 2.1) (layers F.Cu F.Mask F.Paste))
  (pad None np_thru_hole circle (at -6.0 1.9) (size 0.6 0.6) (drill 0.6) (layers *.Cu *.Mask))
  (pad None np_thru_hole circle (at 6.0 1.9) (size 0.6 0.6) (drill 0.6) (layers *.Cu *.Mask))
  (pad 31 smd rect (at 2.75 2.575) (size 0.25 1.15) (layers F.Cu F.Mask F.Paste))
  (pad 32 smd rect (at 2.75 -2.575) (size 0.25 1.15) (layers F.Cu F.Mask F.Paste))
  (pad 33 smd rect (at 3.25 2.575) (size 0.25 1.15) (layers F.Cu F.Mask F.Paste))
  (pad 34 smd rect (at 3.25 -2.575) (size 0.25 1.15) (layers F.Cu F.Mask F.Paste))
  (pad 35 smd rect (at 3.75 2.575) (size 0.25 1.15) (layers F.Cu F.Mask F.Paste))
  (pad 36 smd rect (at 3.75 -2.575) (size 0.25 1.15) (layers F.Cu F.Mask F.Paste))
  (pad 37 smd rect (at 4.25 2.575) (size 0.25 1.15) (layers F.Cu F.Mask F.Paste))
  (pad 38 smd rect (at 4.25 -2.575) (size 0.25 1.15) (layers F.Cu F.Mask F.Paste))
  (pad 39 smd rect (at 4.75 2.575) (size 0.25 1.15) (layers F.Cu F.Mask F.Paste))
  (pad 40 smd rect (at 4.75 -2.575) (size 0.25 1.15) (layers F.Cu F.Mask F.Paste))
  (fp_line (start -7.5 -2.35) (end 7.5 -2.35) (layer F.Fab) (width 0.127))
  (fp_line (start 7.5 -2.35) (end 7.5 2.35) (layer F.Fab) (width 0.127))
  (fp_line (start 7.5 2.35) (end -7.5 2.35) (layer F.Fab) (width 0.127))
  (fp_line (start -7.5 2.35) (end -7.5 -2.35) (layer F.Fab) (width 0.127))
  (fp_line (start -7.5 -1.4) (end -7.5 -2.35) (layer F.SilkS) (width 0.127))
  (fp_line (start -7.5 -2.35) (end -5.5 -2.35) (layer F.SilkS) (width 0.127))
  (fp_line (start -7.5 1.4) (end -7.5 2.35) (layer F.SilkS) (width 0.127))
  (fp_line (start -7.5 2.35) (end -6.5 2.35) (layer F.SilkS) (width 0.127))
  (fp_line (start 5.5 -2.35) (end 7.5 -2.35) (layer F.SilkS) (width 0.127))
  (fp_line (start 7.5 -2.35) (end 7.5 -1.4) (layer F.SilkS) (width 0.127))
  (fp_line (start 7.5 1.4) (end 7.5 2.35) (layer F.SilkS) (width 0.127))
  (fp_line (start 7.5 2.35) (end 6.5 2.35) (layer F.SilkS) (width 0.127))
  (fp_circle (center -5.85 3.15) (end -5.75 3.15) (layer F.SilkS) (width 0.2))
  (fp_circle (center -5.85 3.15) (end -5.75 3.15) (layer F.Fab) (width 0.2))
  (fp_line (start -7.95 -3.4) (end 7.95 -3.4) (layer F.CrtYd) (width 0.05))
  (fp_line (start 7.95 -3.4) (end 7.95 3.4) (layer F.CrtYd) (width 0.05))
  (fp_line (start 7.95 3.4) (end -7.95 3.4) (layer F.CrtYd) (width 0.05))
  (fp_line (start -7.95 3.4) (end -7.95 -3.4) (layer F.CrtYd) (width 0.05))
  (zone (net 0) (net_name "") (layer F.Cu) (hatch full 0.508)
    (connect_pads (clearance 0))
    (min_thickness 0.01)
    (keepout (tracks not_allowed) (vias not_allowed) (pads not_allowed ) (copperpour not_allowed) (footprints allowed))
    (fill (thermal_gap 0.508) (thermal_bridge_width 0.508))
    (polygon
      (pts
        (xy -6.30581 -2.0)
        (xy 6.3 -2.0)
        (xy 6.3 2.00185)
        (xy -6.30581 2.00185)
      )
    )
  )
  (zone (net 0) (net_name "") (layers *.Cu) (hatch full 0.508)
    (connect_pads (clearance 0))
    (min_thickness 0.01)
    (keepout (tracks allowed) (vias not_allowed) (pads allowed ) (copperpour allowed) (footprints allowed))
    (fill (thermal_gap 0.508) (thermal_bridge_width 0.508))
    (polygon
      (pts
        (xy -6.30246 -2.0)
        (xy 6.3 -2.0)
        (xy 6.3 2.00078)
        (xy -6.30246 2.00078)
      )
    )
  )
)