EESchema Schematic File Version 4
EELAYER 30 0
EELAYER END
$Descr A4 11693 8268
encoding utf-8
Sheet 1 1
Title ""
Date ""
Rev ""
Comp ""
Comment1 ""
Comment2 ""
Comment3 ""
Comment4 ""
$EndDescr
$Comp
L Connector_Generic:Conn_01x20 J?
U 1 1 5F5866CC
P 3450 3000
F 0 "J?" H 3400 4100 50  0000 L CNN
F 1 "Conn_01x20" H 3200 4000 50  0000 L CNN
F 2 "" H 3450 3000 50  0001 C CNN
F 3 "~" H 3450 3000 50  0001 C CNN
	1    3450 3000
	1    0    0    -1  
$EndComp
$Comp
L Connector_Generic:Conn_01x20 J?
U 1 1 5F58AD58
P 4150 3000
F 0 "J?" H 4100 4100 50  0000 L CNN
F 1 "Conn_01x20" H 3900 4000 50  0000 L CNN
F 2 "" H 4150 3000 50  0001 C CNN
F 3 "~" H 4150 3000 50  0001 C CNN
	1    4150 3000
	-1   0    0    -1  
$EndComp
$Comp
L Connector_Generic:Conn_01x10 J?
U 1 1 5F58BC14
P 5300 2500
F 0 "J?" H 5380 2492 50  0000 L CNN
F 1 "Conn_01x10" H 5380 2401 50  0000 L CNN
F 2 "" H 5300 2500 50  0001 C CNN
F 3 "~" H 5300 2500 50  0001 C CNN
	1    5300 2500
	1    0    0    -1  
$EndComp
$Comp
L Connector_Generic:Conn_01x04 J?
U 1 1 5F58C81C
P 3750 4150
F 0 "J?" V 3950 4150 50  0000 R CNN
F 1 "Conn_01x04" V 3850 4350 50  0000 R CNN
F 2 "" H 3750 4150 50  0001 C CNN
F 3 "~" H 3750 4150 50  0001 C CNN
	1    3750 4150
	0    -1   -1   0   
$EndComp
Wire Wire Line
	4350 2100 4750 2100
Wire Wire Line
	4750 2100 4750 2700
Wire Wire Line
	4750 2700 5100 2700
Wire Wire Line
	4350 2200 4700 2200
Wire Wire Line
	4700 2200 4700 2800
Wire Wire Line
	4700 3000 4950 3000
Wire Wire Line
	5100 2800 4700 2800
Connection ~ 4700 2800
Wire Wire Line
	4700 2800 4700 3000
Text Label 4500 2600 2    50   ~ 0
PB1
Text Label 4500 3400 2    50   ~ 0
PA1
Wire Wire Line
	4350 2600 4500 2600
Wire Wire Line
	4350 3400 4500 3400
Text Label 4950 2300 0    50   ~ 0
PA5
Wire Wire Line
	5100 2300 4950 2300
Text Label 4950 2100 0    50   ~ 0
PB1
Wire Wire Line
	5100 2100 4950 2100
Text Label 4950 2600 0    50   ~ 0
PA1
Wire Wire Line
	5100 2600 4950 2600
Text Label 4500 3000 2    50   ~ 0
PA5
Wire Wire Line
	4350 3000 4500 3000
Text Label 4950 2200 0    50   ~ 0
PA6
Wire Wire Line
	5100 2200 4950 2200
Text Label 4500 2900 2    50   ~ 0
PA6
Wire Wire Line
	4500 2900 4350 2900
Text Label 4500 2800 2    50   ~ 0
PA7
Wire Wire Line
	4500 2800 4350 2800
Text Label 4950 2500 0    50   ~ 0
PA7
Wire Wire Line
	4950 2500 5100 2500
Text Label 4500 2700 2    50   ~ 0
PB0
Wire Wire Line
	4500 2700 4350 2700
Text Label 4950 2400 0    50   ~ 0
PB0
Wire Wire Line
	4950 2400 5100 2400
$Comp
L Connector_Generic:Conn_01x04 J?
U 1 1 5F5AFE73
P 6850 2250
F 0 "J?" H 6900 2600 50  0000 R CNN
F 1 "Conn_01x04" H 7100 2500 50  0000 R CNN
F 2 "" H 6850 2250 50  0001 C CNN
F 3 "~" H 6850 2250 50  0001 C CNN
	1    6850 2250
	1    0    0    -1  
$EndComp
$Comp
L Connector_Generic:Conn_01x06 J?
U 1 1 5F5B28F6
P 6850 3300
F 0 "J?" H 6930 3292 50  0000 L CNN
F 1 "Conn_01x06" H 6930 3201 50  0000 L CNN
F 2 "" H 6850 3300 50  0001 C CNN
F 3 "~" H 6850 3300 50  0001 C CNN
	1    6850 3300
	1    0    0    -1  
$EndComp
$Comp
L power:GND #PWR?
U 1 1 5F5B58AA
P 4700 3000
F 0 "#PWR?" H 4700 2750 50  0001 C CNN
F 1 "GND" H 4705 2827 50  0000 C CNN
F 2 "" H 4700 3000 50  0001 C CNN
F 3 "" H 4700 3000 50  0001 C CNN
	1    4700 3000
	1    0    0    -1  
$EndComp
Connection ~ 4700 3000
$Comp
L power:+5V #PWR?
U 1 1 5F5B64A6
P 4750 2100
F 0 "#PWR?" H 4750 1950 50  0001 C CNN
F 1 "+5V" H 4765 2273 50  0000 C CNN
F 2 "" H 4750 2100 50  0001 C CNN
F 3 "" H 4750 2100 50  0001 C CNN
	1    4750 2100
	1    0    0    -1  
$EndComp
Connection ~ 4750 2100
Wire Wire Line
	6650 2150 6450 2150
Wire Wire Line
	6450 2150 6450 3100
Wire Wire Line
	6450 3100 6650 3100
Wire Wire Line
	6650 2250 6500 2250
Wire Wire Line
	6500 2250 6500 3200
Wire Wire Line
	6500 3200 6650 3200
Wire Wire Line
	6650 3300 4950 3300
Wire Wire Line
	4950 3300 4950 3000
Connection ~ 4950 3000
Wire Wire Line
	4950 3000 5100 3000
$Comp
L power:+5V #PWR?
U 1 1 5F5B99ED
P 6550 3350
F 0 "#PWR?" H 6550 3200 50  0001 C CNN
F 1 "+5V" H 6565 3523 50  0000 C CNN
F 2 "" H 6550 3350 50  0001 C CNN
F 3 "" H 6550 3350 50  0001 C CNN
	1    6550 3350
	1    0    0    -1  
$EndComp
Wire Wire Line
	6550 3350 6550 3400
Wire Wire Line
	6550 3400 6650 3400
Text Label 3100 3200 0    50   ~ 0
PB3
Wire Wire Line
	3250 3200 3100 3200
Text Label 3100 3300 0    50   ~ 0
PB4
Wire Wire Line
	3250 3300 3100 3300
Text Label 6500 3500 0    50   ~ 0
PB3
Wire Wire Line
	6650 3500 6500 3500
Text Label 6500 3600 0    50   ~ 0
PB4
Wire Wire Line
	6650 3600 6500 3600
Text Label 4500 3200 2    50   ~ 0
PA3
Wire Wire Line
	4350 3200 4500 3200
Text Label 4500 3300 2    50   ~ 0
PA2
Wire Wire Line
	4350 3300 4500 3300
$EndSCHEMATC
