EESchema Schematic File Version 4
EELAYER 30 0
EELAYER END
$Descr A2 23386 16535
encoding utf-8
Sheet 1 1
Title "Open OSD"
Date ""
Rev "v01"
Comp "Kalyan Sriram"
Comment1 ""
Comment2 ""
Comment3 ""
Comment4 ""
$EndDescr
Wire Wire Line
	4250 10350 4250 10450
Wire Wire Line
	4250 10450 4350 10450
$Comp
L power:GND #PWR010
U 1 1 6F44B65C
P 4250 11450
F 0 "#PWR010" H 4250 11200 50  0001 C CNN
F 1 "GND" H 4255 11277 50  0000 C CNN
F 2 "" H 4250 11450 50  0001 C CNN
F 3 "" H 4250 11450 50  0001 C CNN
	1    4250 11450
	1    0    0    -1  
$EndComp
Wire Wire Line
	4250 11350 4350 11350
Wire Wire Line
	4250 11350 4250 11450
Text GLabel 2000 10900 3    50   Input ~ 0
USART1_RX_DEBUG
Text GLabel 2500 10500 0    50   Input ~ 0
SWDIO
Text GLabel 2500 10600 0    50   Input ~ 0
SWCLK
$Comp
L Device:D_Schottky D1
U 1 1 6016AA42
P 2000 10650
F 0 "D1" V 2100 10650 50  0000 L CNN
F 1 "D_Schottky" V 2045 10730 50  0001 L CNN
F 2 "Diode_SMD:D_0805_2012Metric" H 2000 10650 50  0001 C CNN
F 3 "~" H 2000 10650 50  0001 C CNN
	1    2000 10650
	0    -1   -1   0   
$EndComp
$Comp
L Connector_Generic:Conn_01x10 J1
U 1 1 6F53AE66
P 4550 10850
F 0 "J1" H 4630 10842 50  0000 L CNN
F 1 "Conn_01x10" H 4630 10751 50  0000 L CNN
F 2 "Connector_JST:JST_SH_SM10B-SRSS-TB_1x10-1MP_P1.00mm_Horizontal" H 4550 10850 50  0001 C CNN
F 3 "~" H 4550 10850 50  0001 C CNN
	1    4550 10850
	1    0    0    -1  
$EndComp
Text GLabel 2500 11150 0    50   Input ~ 0
SWO
Text GLabel 2500 11450 0    50   Input ~ 0
nRST
Wire Wire Line
	4150 10550 4150 10300
Wire Wire Line
	4150 10550 4350 10550
Wire Wire Line
	3400 10300 4150 10300
Wire Wire Line
	3400 10400 4100 10400
Wire Wire Line
	4100 10650 4350 10650
Wire Wire Line
	4050 10750 4350 10750
Wire Wire Line
	4000 10850 4350 10850
Wire Wire Line
	4000 10950 4350 10950
Wire Wire Line
	4100 10400 4100 10650
Wire Wire Line
	4150 11250 4350 11250
NoConn ~ 4350 11150
Text GLabel 2250 7400 0    50   Input ~ 0
OSC_IN
Text GLabel 2250 7900 0    50   Input ~ 0
OSC_OUT
$Comp
L Device:Crystal Y1
U 1 1 6F8BDA58
P 2350 7650
F 0 "Y1" V 2304 7781 50  0000 L CNN
F 1 "8MHz" V 2395 7781 50  0000 L CNN
F 2 "Crystal:Crystal_SMD_5032-2Pin_5.0x3.2mm" H 2350 7650 50  0001 C CNN
F 3 "~" H 2350 7650 50  0001 C CNN
	1    2350 7650
	0    1    1    0   
$EndComp
$Comp
L Device:C C3
U 1 1 6F8BF834
P 2600 7900
F 0 "C3" V 2850 7900 50  0000 C CNN
F 1 "8pF" V 2750 7900 50  0000 C CNN
F 2 "Capacitor_SMD:C_0603_1608Metric" H 2638 7750 50  0001 C CNN
F 3 "~" H 2600 7900 50  0001 C CNN
	1    2600 7900
	0    1    1    0   
$EndComp
$Comp
L Device:C C2
U 1 1 6F8BEB56
P 2600 7400
F 0 "C2" V 2348 7400 50  0000 C CNN
F 1 "8pF" V 2439 7400 50  0000 C CNN
F 2 "Capacitor_SMD:C_0603_1608Metric" H 2638 7250 50  0001 C CNN
F 3 "~" H 2600 7400 50  0001 C CNN
	1    2600 7400
	0    1    1    0   
$EndComp
Wire Wire Line
	2250 7400 2350 7400
Wire Wire Line
	2350 7500 2350 7400
Connection ~ 2350 7400
Wire Wire Line
	2350 7400 2450 7400
Wire Wire Line
	2450 7900 2350 7900
Wire Wire Line
	2350 7900 2350 7800
Connection ~ 2350 7900
Wire Wire Line
	2350 7900 2250 7900
$Comp
L power:GND #PWR05
U 1 1 6F8ECDFF
P 2950 7650
F 0 "#PWR05" H 2950 7400 50  0001 C CNN
F 1 "GND" V 2955 7522 50  0000 R CNN
F 2 "" H 2950 7650 50  0001 C CNN
F 3 "" H 2950 7650 50  0001 C CNN
	1    2950 7650
	0    -1   -1   0   
$EndComp
Wire Wire Line
	2750 7400 2850 7400
Wire Wire Line
	2850 7400 2850 7650
Wire Wire Line
	2850 7650 2950 7650
Wire Wire Line
	2750 7900 2850 7900
Wire Wire Line
	2850 7900 2850 7650
Connection ~ 2850 7650
$Comp
L Device:C C1
U 1 1 6F91956C
P 2400 2050
F 0 "C1" V 2148 2050 50  0000 C CNN
F 1 "0.1uF" V 2239 2050 50  0000 C CNN
F 2 "Capacitor_SMD:C_0603_1608Metric" H 2438 1900 50  0001 C CNN
F 3 "~" H 2400 2050 50  0001 C CNN
	1    2400 2050
	0    1    1    0   
$EndComp
$Comp
L power:+3V3 #PWR01
U 1 1 6F92986C
P 2050 2050
F 0 "#PWR01" H 2050 1900 50  0001 C CNN
F 1 "+3V3" V 2065 2178 50  0000 L CNN
F 2 "" H 2050 2050 50  0001 C CNN
F 3 "" H 2050 2050 50  0001 C CNN
	1    2050 2050
	0    -1   -1   0   
$EndComp
$Comp
L power:GND #PWR04
U 1 1 6F935648
P 2750 2050
F 0 "#PWR04" H 2750 1800 50  0001 C CNN
F 1 "GND" V 2755 1922 50  0000 R CNN
F 2 "" H 2750 2050 50  0001 C CNN
F 3 "" H 2750 2050 50  0001 C CNN
	1    2750 2050
	0    -1   -1   0   
$EndComp
Wire Wire Line
	2150 2150 2150 2050
Wire Wire Line
	2150 2050 2250 2050
Text GLabel 2600 2150 3    50   Input ~ 0
VSS
Wire Wire Line
	2600 2150 2600 2050
Wire Wire Line
	2600 2050 2550 2050
Text GLabel 7550 1750 0    50   Input ~ 0
USART2_TX_TELEM1
Text GLabel 7550 1850 0    50   Input ~ 0
USART2_RX_TELEM1
Text GLabel 7550 1950 0    50   Input ~ 0
USART2_CTS_TELEM1
Text GLabel 7550 2050 0    50   Input ~ 0
USART2_RTS_TELEM1
$Comp
L osd:ESD7104MUTAG D6
U 1 1 6FAC52A1
P 8050 1900
F 0 "D6" H 7800 1500 50  0000 C CNN
F 1 "ESD7104MUTAG" H 8050 2324 50  0000 C CNN
F 2 "osd:ESD7104MUTAG" H 8050 1900 50  0001 C CNN
F 3 "" H 8050 1900 50  0001 C CNN
	1    8050 1900
	1    0    0    -1  
$EndComp
Text GLabel 7550 2800 0    50   Input ~ 0
USART3_TX_TELEM2
Text GLabel 7550 2900 0    50   Input ~ 0
USART3_RX_TELEM2
Text GLabel 7550 3000 0    50   Input ~ 0
USART3_CTS_TELEM2
Text GLabel 7550 3100 0    50   Input ~ 0
USART3_RTS_TELEM2
$Comp
L osd:ESD7104MUTAG D7
U 1 1 6FB64EE0
P 8050 2950
F 0 "D7" H 7800 2550 50  0000 C CNN
F 1 "ESD7104MUTAG" H 8050 3374 50  0000 C CNN
F 2 "osd:ESD7104MUTAG" H 8050 2950 50  0001 C CNN
F 3 "" H 8050 2950 50  0001 C CNN
	1    8050 2950
	1    0    0    -1  
$EndComp
$Comp
L Interface_CAN_LIN:TJA1051TK-3 U3
U 1 1 6FBE8BDF
P 8150 8300
F 0 "U3" H 7950 8650 50  0000 C CNN
F 1 "TJA1051TK-3" H 8450 8650 50  0000 C CNN
F 2 "Package_DFN_QFN:DFN-8-1EP_3x3mm_P0.65mm_EP1.55x2.4mm" H 8150 7800 50  0001 C CIN
F 3 "http://www.nxp.com/documents/data_sheet/TJA1051.pdf" H 8150 8300 50  0001 C CNN
	1    8150 8300
	1    0    0    -1  
$EndComp
$Comp
L power:GND #PWR030
U 1 1 6FBE9ABE
P 8350 8800
F 0 "#PWR030" H 8350 8550 50  0001 C CNN
F 1 "GND" V 8355 8672 50  0000 R CNN
F 2 "" H 8350 8800 50  0001 C CNN
F 3 "" H 8350 8800 50  0001 C CNN
	1    8350 8800
	0    -1   -1   0   
$EndComp
Wire Wire Line
	8250 8800 8250 8700
Wire Wire Line
	8250 8800 8150 8800
Wire Wire Line
	8150 8800 8150 8700
Connection ~ 8250 8800
$Comp
L power:+5V #PWR028
U 1 1 6FC0FCF0
P 8250 7800
F 0 "#PWR028" H 8250 7650 50  0001 C CNN
F 1 "+5V" V 8265 7928 50  0000 L CNN
F 2 "" H 8250 7800 50  0001 C CNN
F 3 "" H 8250 7800 50  0001 C CNN
	1    8250 7800
	0    1    1    0   
$EndComp
Text GLabel 7550 8200 0    50   Input ~ 0
CAN1_RX
Text GLabel 7550 8100 0    50   Input ~ 0
CAN1_TX
Wire Wire Line
	7550 8100 7650 8100
Wire Wire Line
	7650 8200 7550 8200
Wire Wire Line
	7650 8500 7550 8500
$Comp
L Connector_Generic:Conn_01x04 J6
U 1 1 6FD3107F
P 14500 7950
F 0 "J6" H 14580 7942 50  0000 L CNN
F 1 "Conn_01x04" H 14580 7851 50  0000 L CNN
F 2 "Connector_JST:JST_GH_SM04B-GHS-TB_1x04-1MP_P1.25mm_Horizontal" H 14500 7950 50  0001 C CNN
F 3 "~" H 14500 7950 50  0001 C CNN
	1    14500 7950
	1    0    0    -1  
$EndComp
$Comp
L Video:LM1881 U6
U 1 1 6FF6DF54
P 15750 4500
F 0 "U6" H 15550 4850 50  0000 C CNN
F 1 "LM1881" H 15950 4850 50  0000 C CNN
F 2 "Package_SO:SOIC-8_3.9x4.9mm_P1.27mm" H 15750 4500 50  0001 C CNN
F 3 "" H 15750 4500 50  0001 C CNN
	1    15750 4500
	1    0    0    -1  
$EndComp
$Comp
L power:+5V #PWR049
U 1 1 6FF6F440
P 15850 4000
F 0 "#PWR049" H 15850 3850 50  0001 C CNN
F 1 "+5V" V 15865 4128 50  0000 L CNN
F 2 "" H 15850 4000 50  0001 C CNN
F 3 "" H 15850 4000 50  0001 C CNN
	1    15850 4000
	0    1    1    0   
$EndComp
Wire Wire Line
	15850 4000 15750 4000
Wire Wire Line
	15750 4000 15750 4100
$Comp
L power:GND #PWR050
U 1 1 6FF80CFE
P 15850 4900
F 0 "#PWR050" H 15850 4650 50  0001 C CNN
F 1 "GND" V 15855 4772 50  0000 R CNN
F 2 "" H 15850 4900 50  0001 C CNN
F 3 "" H 15850 4900 50  0001 C CNN
	1    15850 4900
	0    -1   -1   0   
$EndComp
$Comp
L Device:C C17
U 1 1 6FF92A9B
P 15150 4150
F 0 "C17" H 15035 4104 50  0000 R CNN
F 1 "0.1uF" H 15450 4100 50  0000 R CNN
F 2 "Capacitor_SMD:C_0603_1608Metric" H 15188 4000 50  0001 C CNN
F 3 "~" H 15150 4150 50  0001 C CNN
	1    15150 4150
	-1   0    0    1   
$EndComp
Wire Wire Line
	15150 4400 15250 4400
Text Label 15150 3900 1    50   ~ 0
VIDEO_INPUT
Wire Wire Line
	16350 4300 16250 4300
Wire Wire Line
	16350 4400 16250 4400
Wire Wire Line
	16350 4500 16250 4500
Wire Wire Line
	16350 4600 16250 4600
Wire Wire Line
	15150 4300 15150 4400
Wire Wire Line
	15150 3900 15150 4000
$Comp
L Device:R R12
U 1 1 7003A235
P 15150 4750
F 0 "R12" H 15220 4796 50  0000 L CNN
F 1 "680K" H 15220 4705 50  0000 L CNN
F 2 "Resistor_SMD:R_0603_1608Metric" V 15080 4750 50  0001 C CNN
F 3 "~" H 15150 4750 50  0001 C CNN
	1    15150 4750
	1    0    0    -1  
$EndComp
Wire Wire Line
	15250 4500 15150 4500
Wire Wire Line
	15150 4500 15150 4600
$Comp
L power:GND #PWR048
U 1 1 7004CFFE
P 15150 5000
F 0 "#PWR048" H 15150 4750 50  0001 C CNN
F 1 "GND" H 15155 4827 50  0000 C CNN
F 2 "" H 15150 5000 50  0001 C CNN
F 3 "" H 15150 5000 50  0001 C CNN
	1    15150 5000
	1    0    0    -1  
$EndComp
Wire Wire Line
	15150 5000 15150 4950
$Comp
L Device:C C16
U 1 1 70072A8F
P 14850 4750
F 0 "C16" H 14950 4750 50  0000 L CNN
F 1 "0.1uF" H 14550 4750 50  0000 L CNN
F 2 "Capacitor_SMD:C_0603_1608Metric" H 14888 4600 50  0001 C CNN
F 3 "~" H 14850 4750 50  0001 C CNN
	1    14850 4750
	1    0    0    -1  
$EndComp
Wire Wire Line
	14850 4600 14850 4500
Wire Wire Line
	14850 4500 15150 4500
Connection ~ 15150 4500
Wire Wire Line
	14850 4900 14850 4950
Wire Wire Line
	14850 4950 15150 4950
Connection ~ 15150 4950
Wire Wire Line
	15150 4950 15150 4900
$Comp
L Memory_EEPROM:24LC64 U5
U 1 1 7009A48A
P 12600 4300
F 0 "U5" H 12450 4550 50  0000 C CNN
F 1 "24LC64" H 12750 4550 50  0000 C CNN
F 2 "Package_SO:SOIC-8_3.9x4.9mm_P1.27mm" H 12600 4300 50  0001 C CNN
F 3 "http://ww1.microchip.com/downloads/en/DeviceDoc/21189f.pdf" H 12600 4300 50  0001 C CNN
	1    12600 4300
	1    0    0    -1  
$EndComp
Text GLabel 13100 4300 2    50   Input ~ 0
I2C2_SCL_EEPROM
Text GLabel 13100 4200 2    50   Input ~ 0
I2C2_SDA_EEPROM
$Comp
L power:GND #PWR042
U 1 1 700FE2E6
P 13200 4700
F 0 "#PWR042" H 13200 4450 50  0001 C CNN
F 1 "GND" V 13205 4572 50  0000 R CNN
F 2 "" H 13200 4700 50  0001 C CNN
F 3 "" H 13200 4700 50  0001 C CNN
	1    13200 4700
	0    -1   -1   0   
$EndComp
Wire Wire Line
	12600 4700 12600 4600
$Comp
L power:+5V #PWR040
U 1 1 70112C48
P 12700 3900
F 0 "#PWR040" H 12700 3750 50  0001 C CNN
F 1 "+5V" V 12715 4028 50  0000 L CNN
F 2 "" H 12700 3900 50  0001 C CNN
F 3 "" H 12700 3900 50  0001 C CNN
	1    12700 3900
	0    1    1    0   
$EndComp
Wire Wire Line
	13100 4200 13000 4200
Wire Wire Line
	13000 4300 13100 4300
Wire Wire Line
	13100 4400 13000 4400
Wire Wire Line
	13200 4700 13100 4700
Wire Wire Line
	13100 4400 13100 4700
Wire Wire Line
	12600 4700 13100 4700
Connection ~ 13100 4700
Wire Wire Line
	12200 4300 12100 4300
Wire Wire Line
	12100 4300 12100 4400
Wire Wire Line
	12100 4700 12600 4700
Connection ~ 12600 4700
Wire Wire Line
	12200 4400 12100 4400
Connection ~ 12100 4400
Wire Wire Line
	12100 4400 12100 4700
Wire Wire Line
	12200 4200 12100 4200
Wire Wire Line
	12100 4200 12100 3900
Wire Wire Line
	12100 3900 12600 3900
$Comp
L Analog_DAC:MCP4921 U7
U 1 1 701FBC29
P 16450 2450
F 0 "U7" H 16250 2800 50  0000 L CNN
F 1 "MCP4921" H 16500 2100 50  0000 L CNN
F 2 "Package_SO:SOIC-8_3.9x4.9mm_P1.27mm" H 17450 2350 50  0001 C CNN
F 3 "http://ww1.microchip.com/downloads/en/DeviceDoc/22248a.pdf" H 17450 2350 50  0001 C CNN
	1    16450 2450
	1    0    0    -1  
$EndComp
$Comp
L power:+5V #PWR051
U 1 1 702F66D1
P 16350 1950
F 0 "#PWR051" H 16350 1800 50  0001 C CNN
F 1 "+5V" V 16365 2078 50  0000 L CNN
F 2 "" H 16350 1950 50  0001 C CNN
F 3 "" H 16350 1950 50  0001 C CNN
	1    16350 1950
	0    -1   -1   0   
$EndComp
Wire Wire Line
	16350 1950 16450 1950
Wire Wire Line
	16450 1950 16450 2050
Text GLabel 15950 2450 0    50   Input ~ 0
SPI1_CS_DAC
Text GLabel 15950 2650 0    50   Input ~ 0
SPI1_MOSI_DAC
Text GLabel 15950 2550 0    50   Input ~ 0
SPI1_SCK_DAC
Wire Wire Line
	15950 2450 16050 2450
Wire Wire Line
	16050 2550 15950 2550
Wire Wire Line
	15950 2650 16050 2650
Wire Wire Line
	16650 2050 16650 1950
Wire Wire Line
	16650 1950 16450 1950
Connection ~ 16450 1950
$Comp
L power:GND #PWR052
U 1 1 7036E53C
P 16550 2950
F 0 "#PWR052" H 16550 2700 50  0001 C CNN
F 1 "GND" V 16555 2822 50  0000 R CNN
F 2 "" H 16550 2950 50  0001 C CNN
F 3 "" H 16550 2950 50  0001 C CNN
	1    16550 2950
	0    -1   -1   0   
$EndComp
Text Label 17250 2450 0    50   ~ 0
VOUT_DAC
Wire Wire Line
	17250 2450 17150 2450
Wire Wire Line
	15950 2350 16050 2350
Text GLabel 16350 4300 2    50   Input ~ 0
TIM3_CH4_CSYNC
Text GLabel 16350 4400 2    50   Input ~ 0
TIM1_CH1_VSYNC
Text GLabel 16350 4500 2    50   Input ~ 0
TIM12_CH2_BURST
Text GLabel 16350 4600 2    50   Input ~ 0
TIM2_CH1_OE
Text GLabel 15950 2250 1    50   Input ~ 0
~TIM1_CH2N_LDAC
Wire Wire Line
	15950 2250 15950 2350
Wire Wire Line
	4000 3500 3900 3500
Text GLabel 4000 5900 2    50   Input ~ 0
TIM4_CH2_OSD_SELECT
NoConn ~ 2700 5700
NoConn ~ 2700 5600
Wire Wire Line
	4000 5900 3900 5900
Text GLabel 4000 3500 2    50   Input ~ 0
VIDEO_IN_SELECT
Wire Wire Line
	4000 5000 3900 5000
Text GLabel 4000 5000 2    50   Input ~ 0
TIM2_CH1_OE
Wire Wire Line
	4000 4300 3900 4300
Wire Wire Line
	3900 4200 4000 4200
Wire Wire Line
	2600 5500 2700 5500
Text GLabel 2550 5550 0    50   Input ~ 0
~TIM1_CH2N_LDAC
NoConn ~ 2700 4400
NoConn ~ 2700 4300
Text GLabel 4000 3800 2    50   Input ~ 0
TIM12_CH2_BURST
Text GLabel 4000 4300 2    50   Input ~ 0
TIM1_CH1_VSYNC
Text GLabel 4000 4200 2    50   Input ~ 0
TIM3_CH4_CSYNC
Text GLabel 4000 3700 2    50   Input ~ 0
USART3_RTS_TELEM2
Text GLabel 4000 3600 2    50   Input ~ 0
USART3_CTS_TELEM2
Wire Wire Line
	3900 3800 4000 3800
Text GLabel 2600 5900 0    50   Input ~ 0
I2C2_SDA_EEPROM
Text GLabel 2600 5800 0    50   Input ~ 0
I2C2_SCL_EEPROM
Wire Wire Line
	3900 5100 4000 5100
Wire Wire Line
	4000 5200 3900 5200
Wire Wire Line
	4000 3700 3900 3700
Wire Wire Line
	3900 3600 4000 3600
Wire Wire Line
	2700 4900 2600 4900
$Comp
L dk_Embedded-Microcontrollers:STM32F405RGT6 U1
U 1 1 6F4F9BCB
P 3300 4900
F 0 "U1" H 3300 3203 60  0000 C CNN
F 1 "STM32F405RGT6" H 3300 3097 60  0000 C CNN
F 2 "digikey-footprints:LQFP-64_10x10mm" H 3500 5100 60  0001 L CNN
F 3 "http://www.st.com/content/ccc/resource/technical/document/datasheet/ef/92/76/6d/bb/c2/4f/f7/DM00037051.pdf/files/DM00037051.pdf/jcr:content/translations/en.DM00037051.pdf" H 3500 5200 60  0001 L CNN
F 4 "497-11767-ND" H 3500 5300 60  0001 L CNN "Digi-Key_PN"
F 5 "STM32F405RGT6" H 3500 5400 60  0001 L CNN "MPN"
F 6 "Integrated Circuits (ICs)" H 3500 5500 60  0001 L CNN "Category"
F 7 "Embedded - Microcontrollers" H 3500 5600 60  0001 L CNN "Family"
F 8 "http://www.st.com/content/ccc/resource/technical/document/datasheet/ef/92/76/6d/bb/c2/4f/f7/DM00037051.pdf/files/DM00037051.pdf/jcr:content/translations/en.DM00037051.pdf" H 3500 5700 60  0001 L CNN "DK_Datasheet_Link"
F 9 "/product-detail/en/stmicroelectronics/STM32F405RGT6/497-11767-ND/2754208" H 3500 5800 60  0001 L CNN "DK_Detail_Page"
F 10 "IC MCU 32BIT 1MB FLASH 64LQFP" H 3500 5900 60  0001 L CNN "Description"
F 11 "STMicroelectronics" H 3500 6000 60  0001 L CNN "Manufacturer"
F 12 "Active" H 3500 6100 60  0001 L CNN "Status"
	1    3300 4900
	1    0    0    -1  
$EndComp
Connection ~ 3400 6500
Wire Wire Line
	3400 6500 3300 6500
Wire Wire Line
	3500 6500 3400 6500
Connection ~ 3300 6500
Wire Wire Line
	3300 6500 3200 6500
NoConn ~ 3900 5400
NoConn ~ 3900 5600
NoConn ~ 2700 6100
NoConn ~ 2700 6000
NoConn ~ 2700 3700
NoConn ~ 2700 3600
NoConn ~ 2700 3500
Wire Wire Line
	3900 3900 4000 3900
Wire Wire Line
	4000 4000 3900 4000
Wire Wire Line
	3900 4100 4000 4100
Wire Wire Line
	4000 4400 3900 4400
Wire Wire Line
	3900 4500 4000 4500
Wire Wire Line
	4000 4600 3900 4600
Wire Wire Line
	3900 4700 4000 4700
Wire Wire Line
	4000 4800 3900 4800
Wire Wire Line
	3900 4900 4000 4900
Wire Wire Line
	4000 5500 3900 5500
Wire Wire Line
	3900 5700 4000 5700
Wire Wire Line
	4000 5800 3900 5800
Wire Wire Line
	3900 6100 4000 6100
Wire Wire Line
	4000 6200 3900 6200
Wire Wire Line
	2700 5900 2600 5900
Wire Wire Line
	2600 5800 2700 5800
Wire Wire Line
	2700 5200 2600 5200
Wire Wire Line
	2700 5000 2600 5000
Wire Wire Line
	2600 4800 2700 4800
Wire Wire Line
	2700 4700 2600 4700
Wire Wire Line
	2600 4600 2700 4600
Wire Wire Line
	2700 4500 2600 4500
Wire Wire Line
	2600 4000 2700 4000
Wire Wire Line
	2700 3900 2600 3900
Wire Wire Line
	2600 3800 2700 3800
Text GLabel 4000 4100 2    50   Input ~ 0
TIM3_CH3_BLUE
Text GLabel 4000 4000 2    50   Input ~ 0
TIM3_CH2_GREEN
Text GLabel 4000 3900 2    50   Input ~ 0
TIM3_CH1_RED
Text GLabel 4000 4700 2    50   Input ~ 0
USB_FS_DP
Text GLabel 4000 4600 2    50   Input ~ 0
USB_FS_DM
Text GLabel 2600 3900 0    50   Input ~ 0
OSC_OUT
Text GLabel 2600 3800 0    50   Input ~ 0
OSC_IN
Text GLabel 4000 5200 2    50   Input ~ 0
USART3_RX_TELEM2
Text GLabel 4000 5100 2    50   Input ~ 0
USART3_TX_TELEM2
Wire Wire Line
	3300 2900 3400 2900
Connection ~ 3300 2900
Wire Wire Line
	3300 3000 3300 2900
Connection ~ 3400 2900
Wire Wire Line
	3400 3000 3400 2900
Wire Wire Line
	3600 2900 3600 3000
Text GLabel 2600 4000 0    50   Input ~ 0
nRST
Text GLabel 4000 5500 2    50   Input ~ 0
SWO
Text GLabel 4000 4500 2    50   Input ~ 0
USART1_RX_DEBUG
Text GLabel 4000 4400 2    50   Input ~ 0
USART1_TX_DEBUG
Text GLabel 2600 4600 0    50   Input ~ 0
USART2_RTS_TELEM1
Text GLabel 2600 4500 0    50   Input ~ 0
USART2_CTS_TELEM1
Text GLabel 4000 6200 2    50   Input ~ 0
CAN1_TX
Text GLabel 4000 6100 2    50   Input ~ 0
CAN1_RX
Text GLabel 4000 5800 2    50   Input ~ 0
CAN2_TX
Text GLabel 4000 5700 2    50   Input ~ 0
CAN2_RX
Text GLabel 4000 4900 2    50   Input ~ 0
SWCLK
Text GLabel 4000 4800 2    50   Input ~ 0
SWDIO
Text GLabel 2600 5200 0    50   Input ~ 0
SPI1_MOSI_DAC
Text GLabel 2600 5000 0    50   Input ~ 0
SPI1_SCK_DAC
Text GLabel 2600 4900 0    50   Input ~ 0
SPI1_CS_DAC
Text GLabel 2600 4800 0    50   Input ~ 0
USART2_RX_TELEM1
Text GLabel 2600 4700 0    50   Input ~ 0
USART2_TX_TELEM1
Wire Notes Line
	5250 1450 5250 8550
Wire Notes Line
	5250 8550 1450 8550
Wire Notes Line
	1450 8550 1450 1450
Wire Notes Line
	1450 1450 5250 1450
Text Notes 1450 1400 0    50   ~ 0
MCU Crystal & Power
Wire Notes Line
	1450 9750 5250 9750
Wire Notes Line
	5250 9750 5250 12150
Wire Notes Line
	5250 12150 1450 12150
Wire Notes Line
	1450 12150 1450 9750
Wire Wire Line
	2000 10500 2000 10400
Wire Wire Line
	2000 10900 2000 10800
Text Notes 1450 9700 0    50   ~ 0
MCU Debug Connector\n
Text Notes 6450 1350 0    50   ~ 0
USART OUTPUT\n
Text Notes 6200 7000 0    50   ~ 0
CAN OUTPUT\n
Text Label 8550 1750 0    50   ~ 0
TELEM1_TX
Text Label 8550 1850 0    50   ~ 0
TELEM1_RX
Text Label 8550 1950 0    50   ~ 0
TELEM1_CTS
Text Label 8550 2050 0    50   ~ 0
TELEM1_RTS
Text Label 8550 2800 0    50   ~ 0
TELEM2_TX
Text Label 8550 2900 0    50   ~ 0
TELEM2_RX
Text Label 8550 3000 0    50   ~ 0
TELEM2_CTS
Text Label 8550 3100 0    50   ~ 0
TELEM2_RTS
Wire Wire Line
	11800 2400 11800 2300
Text GLabel 11800 2400 3    50   Input ~ 0
TIM4_CH2_OSD_SELECT
Wire Wire Line
	12200 2100 12100 2100
Wire Wire Line
	12100 1900 12200 1900
Wire Wire Line
	11400 2000 11500 2000
Text Label 11400 2000 2    50   ~ 0
VIDEO_OUT
Text Label 12200 2100 0    50   ~ 0
VOUT_DAC
Text Label 12200 1900 0    50   ~ 0
VIDEO_INPUT
$Comp
L Analog_Switch:ADG733BRU U4
U 1 1 70757E5C
P 11800 1900
F 0 "U4" H 11800 2142 50  0000 C CNN
F 1 "ADG733BRU" H 11800 2051 50  0000 C CNN
F 2 "Package_SO:TSSOP-20_4.4x6.5mm_P0.65mm" H 11800 1900 50  0001 C CNN
F 3 "https://www.analog.com/media/en/technical-documentation/data-sheets/ADG733_734.pdf" H 11800 1900 50  0001 C CNN
	1    11800 1900
	1    0    0    -1  
$EndComp
Wire Wire Line
	14300 2300 14300 2200
Text GLabel 14300 2300 3    50   Input ~ 0
VIDEO_IN_SELECT
Wire Wire Line
	13900 1900 14000 1900
Text Label 13900 1900 2    50   ~ 0
VIDEO_INPUT
Wire Wire Line
	14600 1800 14700 1800
Wire Wire Line
	14700 2000 14600 2000
Text Label 14700 2000 0    50   ~ 0
VIDEO_IN2
Text Label 14700 1800 0    50   ~ 0
VIDEO_IN1
$Comp
L Analog_Switch:ADG733BRU U4
U 3 1 70756617
P 14300 1800
F 0 "U4" H 14300 2042 50  0000 C CNN
F 1 "ADG733BRU" H 14300 1951 50  0000 C CNN
F 2 "Package_SO:TSSOP-20_4.4x6.5mm_P0.65mm" H 14300 1800 50  0001 C CNN
F 3 "https://www.analog.com/media/en/technical-documentation/data-sheets/ADG733_734.pdf" H 14300 1800 50  0001 C CNN
	3    14300 1800
	1    0    0    -1  
$EndComp
Wire Notes Line
	10850 1350 17700 1350
Wire Notes Line
	17700 1350 17700 5550
Wire Notes Line
	17700 5550 10850 5550
Wire Notes Line
	10850 5550 10850 1350
Text Notes 10900 1300 0    50   ~ 0
OSD Driver\n
$Comp
L osd:ESD7104MUTAG D10
U 1 1 718C9040
P 20050 2600
F 0 "D10" H 20050 3115 50  0000 C CNN
F 1 "ESD7104MUTAG" H 20050 3024 50  0000 C CNN
F 2 "osd:ESD7104MUTAG" H 20050 2600 50  0001 C CNN
F 3 "" H 20050 2600 50  0001 C CNN
	1    20050 2600
	1    0    0    -1  
$EndComp
$Comp
L power:GND #PWR058
U 1 1 718F43D7
P 19850 3050
F 0 "#PWR058" H 19850 2800 50  0001 C CNN
F 1 "GND" V 19855 2922 50  0000 R CNN
F 2 "" H 19850 3050 50  0001 C CNN
F 3 "" H 19850 3050 50  0001 C CNN
	1    19850 3050
	0    1    1    0   
$EndComp
Text Label 19550 2450 2    50   ~ 0
VIDEO_IN1
Text Label 19550 2550 2    50   ~ 0
VIDEO_IN2
$Comp
L Connector_Generic:Conn_01x03 J12
U 1 1 71978FDF
P 21050 2600
F 0 "J12" H 21130 2642 50  0000 L CNN
F 1 "Conn_01x03" H 21130 2551 50  0000 L CNN
F 2 "Connector_PinHeader_2.54mm:PinHeader_1x03_P2.54mm_Vertical" H 21050 2600 50  0001 C CNN
F 3 "~" H 21050 2600 50  0001 C CNN
	1    21050 2600
	1    0    0    -1  
$EndComp
$Comp
L Connector_Generic:Conn_01x03 J11
U 1 1 719791FD
P 21050 2200
F 0 "J11" H 21130 2242 50  0000 L CNN
F 1 "Conn_01x03" H 21130 2151 50  0000 L CNN
F 2 "Connector_PinHeader_2.54mm:PinHeader_1x03_P2.54mm_Vertical" H 21050 2200 50  0001 C CNN
F 3 "~" H 21050 2200 50  0001 C CNN
	1    21050 2200
	1    0    0    -1  
$EndComp
Text Label 19550 2650 2    50   ~ 0
VIDEO_OUT
$Comp
L Connector_Generic:Conn_01x03 J13
U 1 1 719BADB3
P 21050 3000
F 0 "J13" H 21130 3042 50  0000 L CNN
F 1 "Conn_01x03" H 21130 2951 50  0000 L CNN
F 2 "Connector_PinHeader_2.54mm:PinHeader_1x03_P2.54mm_Vertical" H 21050 3000 50  0001 C CNN
F 3 "~" H 21050 3000 50  0001 C CNN
	1    21050 3000
	1    0    0    -1  
$EndComp
$Comp
L power:GND #PWR062
U 1 1 71B8CE7A
P 20750 3200
F 0 "#PWR062" H 20750 2950 50  0001 C CNN
F 1 "GND" H 20755 3027 50  0000 C CNN
F 2 "" H 20750 3200 50  0001 C CNN
F 3 "" H 20750 3200 50  0001 C CNN
	1    20750 3200
	1    0    0    -1  
$EndComp
Text Notes 18700 1300 0    50   ~ 0
Video Output\n
Wire Notes Line
	18700 1350 21950 1350
Wire Notes Line
	18700 1350 18700 3800
$Comp
L Device:LED_RGB D2
U 1 1 603D6830
P 2950 13850
F 0 "D2" H 2950 13383 50  0000 C CNN
F 1 "LED_RGB" H 2950 13474 50  0000 C CNN
F 2 "osd:EAST1616" H 2950 13800 50  0001 C CNN
F 3 "~" H 2950 13800 50  0001 C CNN
	1    2950 13850
	-1   0    0    1   
$EndComp
$Comp
L power:+5V #PWR02
U 1 1 603DD3D5
P 2550 13850
F 0 "#PWR02" H 2550 13700 50  0001 C CNN
F 1 "+5V" V 2565 13978 50  0000 L CNN
F 2 "" H 2550 13850 50  0001 C CNN
F 3 "" H 2550 13850 50  0001 C CNN
	1    2550 13850
	0    -1   -1   0   
$EndComp
Wire Wire Line
	2750 13650 2650 13650
Wire Wire Line
	2650 13650 2650 13850
Connection ~ 2650 13850
Wire Wire Line
	2650 13850 2750 13850
Wire Wire Line
	2750 14050 2650 14050
Wire Wire Line
	2650 14050 2650 13850
$Comp
L Device:R R3
U 1 1 6045CEBF
P 3400 14050
F 0 "R3" V 3300 14050 50  0000 C CNN
F 1 "100" V 3400 14050 50  0000 C CNN
F 2 "Resistor_SMD:R_0603_1608Metric" V 3330 14050 50  0001 C CNN
F 3 "~" H 3400 14050 50  0001 C CNN
	1    3400 14050
	0    1    1    0   
$EndComp
$Comp
L Device:R R2
U 1 1 6045CB98
P 3400 13850
F 0 "R2" V 3300 13850 50  0000 C CNN
F 1 "100" V 3400 13850 50  0000 C CNN
F 2 "Resistor_SMD:R_0603_1608Metric" V 3330 13850 50  0001 C CNN
F 3 "~" H 3400 13850 50  0001 C CNN
	1    3400 13850
	0    1    1    0   
$EndComp
$Comp
L Device:R R1
U 1 1 6045C585
P 3400 13650
F 0 "R1" V 3300 13650 50  0000 C CNN
F 1 "300" V 3400 13650 50  0000 C CNN
F 2 "Resistor_SMD:R_0603_1608Metric" V 3330 13650 50  0001 C CNN
F 3 "~" H 3400 13650 50  0001 C CNN
	1    3400 13650
	0    1    1    0   
$EndComp
Wire Wire Line
	3250 13650 3150 13650
Wire Wire Line
	3150 13850 3250 13850
Wire Wire Line
	3250 14050 3150 14050
Text GLabel 3650 13650 2    50   Input ~ 0
TIM3_CH3_BLUE
Text GLabel 3650 13850 2    50   Input ~ 0
TIM3_CH2_GREEN
Text GLabel 3650 14050 2    50   Input ~ 0
TIM3_CH1_RED
Wire Wire Line
	3650 13650 3550 13650
Wire Wire Line
	3550 13850 3650 13850
Wire Wire Line
	3650 14050 3550 14050
Wire Notes Line
	1750 13200 5000 13200
Wire Notes Line
	5000 13200 5000 15350
Wire Notes Line
	1750 15350 1750 13200
Wire Notes Line
	1750 15350 5000 15350
Text Notes 1750 13150 0    50   ~ 0
Status LEDs\n
NoConn ~ 2700 5100
$Comp
L osd:ESD7104MUTAG D5
U 1 1 6F549FA0
P 3000 11300
F 0 "D5" H 2650 11700 50  0000 C CNN
F 1 "ESD7104MUTAG" H 3000 11550 50  0000 C CNN
F 2 "osd:ESD7104MUTAG" H 3000 11300 50  0001 C CNN
F 3 "" H 3000 11300 50  0001 C CNN
	1    3000 11300
	1    0    0    -1  
$EndComp
Wire Wire Line
	12700 3900 12600 3900
Connection ~ 12600 3900
Wire Wire Line
	12600 3900 12600 4000
Wire Wire Line
	15850 4900 15750 4900
Wire Wire Line
	15750 4900 15750 4800
Wire Wire Line
	3200 3000 3200 2900
Connection ~ 3200 2900
Wire Wire Line
	3200 2900 3300 2900
Wire Wire Line
	3400 2900 3500 2900
Wire Wire Line
	3500 3000 3500 2900
Connection ~ 3500 2900
Wire Wire Line
	3500 2900 3600 2900
Text GLabel 4000 6000 2    50   Input ~ 0
BOOT0
Wire Wire Line
	4000 6000 3900 6000
$Comp
L power:+5V #PWR045
U 1 1 60A50508
P 13650 2800
F 0 "#PWR045" H 13650 2650 50  0001 C CNN
F 1 "+5V" V 13665 2928 50  0000 L CNN
F 2 "" H 13650 2800 50  0001 C CNN
F 3 "" H 13650 2800 50  0001 C CNN
	1    13650 2800
	0    1    1    0   
$EndComp
$Comp
L power:GND #PWR039
U 1 1 60A7231A
P 12350 3000
F 0 "#PWR039" H 12350 2750 50  0001 C CNN
F 1 "GND" H 12355 2827 50  0000 C CNN
F 2 "" H 12350 3000 50  0001 C CNN
F 3 "" H 12350 3000 50  0001 C CNN
	1    12350 3000
	1    0    0    -1  
$EndComp
Wire Wire Line
	12350 3000 12350 2900
Wire Wire Line
	12350 2900 12450 2900
Wire Wire Line
	12350 2900 12350 2800
Wire Wire Line
	12350 2800 12450 2800
Connection ~ 12350 2900
Wire Wire Line
	12350 2800 12350 2400
Wire Wire Line
	12350 2400 12950 2400
Wire Wire Line
	12950 2400 12950 2500
Connection ~ 12350 2800
Text GLabel 2150 2150 3    50   Input ~ 0
VDD_3V3
Text GLabel 4250 10350 1    50   Input ~ 0
VDD_3V3
Text GLabel 3000 2900 0    50   Input ~ 0
VDD_3V3
Text GLabel 3800 2050 0    50   Input ~ 0
BOOT0
$Comp
L power:GND #PWR09
U 1 1 60B02538
P 3900 2550
F 0 "#PWR09" H 3900 2300 50  0001 C CNN
F 1 "GND" H 3905 2377 50  0000 C CNN
F 2 "" H 3900 2550 50  0001 C CNN
F 3 "" H 3900 2550 50  0001 C CNN
	1    3900 2550
	1    0    0    -1  
$EndComp
$Comp
L Device:R R5
U 1 1 60B030A5
P 3900 2300
F 0 "R5" H 3970 2346 50  0000 L CNN
F 1 "100K" H 3970 2255 50  0000 L CNN
F 2 "Resistor_SMD:R_0603_1608Metric" V 3830 2300 50  0001 C CNN
F 3 "~" H 3900 2300 50  0001 C CNN
	1    3900 2300
	1    0    0    -1  
$EndComp
Text GLabel 4500 2050 2    50   Input ~ 0
VDD_3V3
$Comp
L Switch:SW_Push SW1
U 1 1 60B0477B
P 4200 2050
F 0 "SW1" H 4200 2335 50  0000 C CNN
F 1 "SW_Push" H 4200 2244 50  0000 C CNN
F 2 "osd:PTS810-SJG-250-SMTR-LFS" H 4200 2250 50  0001 C CNN
F 3 "~" H 4200 2250 50  0001 C CNN
	1    4200 2050
	1    0    0    -1  
$EndComp
Wire Wire Line
	3800 2050 3900 2050
Wire Wire Line
	3900 2050 3900 2150
Wire Wire Line
	3900 2550 3900 2450
Wire Wire Line
	3900 2050 4000 2050
Connection ~ 3900 2050
Wire Wire Line
	4400 2050 4500 2050
Text GLabel 3500 6500 2    50   Input ~ 0
VSS
$Comp
L Analog_Switch:ADG733BRU U4
U 2 1 60C08220
P 14350 3650
F 0 "U4" V 14725 3650 50  0000 C CNN
F 1 "ADG733BRU" V 14816 3650 50  0000 C CNN
F 2 "Package_SO:TSSOP-20_4.4x6.5mm_P0.65mm" H 14350 3650 50  0001 C CNN
F 3 "https://www.analog.com/media/en/technical-documentation/data-sheets/ADG733_734.pdf" H 14350 3650 50  0001 C CNN
	2    14350 3650
	0    1    1    0   
$EndComp
$Comp
L Analog_Switch:ADG733BRU U4
U 4 1 60A4CEDE
P 12950 2800
F 0 "U4" V 12904 2904 50  0000 L CNN
F 1 "ADG733BRU" V 12995 2904 50  0000 L CNN
F 2 "Package_SO:TSSOP-20_4.4x6.5mm_P0.65mm" H 12950 2800 50  0001 C CNN
F 3 "https://www.analog.com/media/en/technical-documentation/data-sheets/ADG733_734.pdf" H 12950 2800 50  0001 C CNN
	4    12950 2800
	0    1    1    0   
$EndComp
NoConn ~ 14250 3350
NoConn ~ 14350 3950
NoConn ~ 14150 3950
NoConn ~ 13950 3650
Wire Wire Line
	8250 7800 8150 7800
Wire Wire Line
	8150 7800 8150 7900
Wire Wire Line
	2150 2050 2050 2050
Connection ~ 2150 2050
Wire Wire Line
	3000 2900 3100 2900
Wire Wire Line
	3100 3000 3100 2900
Connection ~ 3100 2900
Wire Wire Line
	3100 2900 3200 2900
Wire Wire Line
	16550 2950 16450 2950
Wire Wire Line
	16450 2950 16450 2850
Wire Wire Line
	2650 13850 2550 13850
$Comp
L power:PWR_FLAG #FLG01
U 1 1 6109EBF4
P 3100 2900
F 0 "#FLG01" H 3100 2975 50  0001 C CNN
F 1 "PWR_FLAG" H 3100 3073 50  0000 C CNN
F 2 "" H 3100 2900 50  0001 C CNN
F 3 "~" H 3100 2900 50  0001 C CNN
	1    3100 2900
	1    0    0    -1  
$EndComp
Wire Wire Line
	2750 2050 2600 2050
Connection ~ 2600 2050
$Comp
L power:+3V3 #PWR014
U 1 1 6153BA98
P 6700 8400
F 0 "#PWR014" H 6700 8250 50  0001 C CNN
F 1 "+3V3" V 6715 8528 50  0000 L CNN
F 2 "" H 6700 8400 50  0001 C CNN
F 3 "" H 6700 8400 50  0001 C CNN
	1    6700 8400
	0    -1   -1   0   
$EndComp
$Comp
L Device:C C5
U 1 1 6153C45F
P 6800 8150
F 0 "C5" H 6915 8196 50  0000 L CNN
F 1 "0.1uF" H 6915 8105 50  0000 L CNN
F 2 "Capacitor_SMD:C_0603_1608Metric" H 6838 8000 50  0001 C CNN
F 3 "~" H 6800 8150 50  0001 C CNN
	1    6800 8150
	1    0    0    -1  
$EndComp
$Comp
L power:GND #PWR016
U 1 1 61582A18
P 6800 7900
F 0 "#PWR016" H 6800 7650 50  0001 C CNN
F 1 "GND" H 6805 7727 50  0000 C CNN
F 2 "" H 6800 7900 50  0001 C CNN
F 3 "" H 6800 7900 50  0001 C CNN
	1    6800 7900
	-1   0    0    1   
$EndComp
$Comp
L Device:C C9
U 1 1 615A6C8F
P 7900 7800
F 0 "C9" V 7750 7800 50  0000 C CNN
F 1 "0.1uF" V 8000 7600 50  0000 C CNN
F 2 "Capacitor_SMD:C_0603_1608Metric" H 7938 7650 50  0001 C CNN
F 3 "~" H 7900 7800 50  0001 C CNN
	1    7900 7800
	0    1    1    0   
$EndComp
$Comp
L power:GND #PWR024
U 1 1 615A964C
P 7650 7800
F 0 "#PWR024" H 7650 7550 50  0001 C CNN
F 1 "GND" V 7655 7672 50  0000 R CNN
F 2 "" H 7650 7800 50  0001 C CNN
F 3 "" H 7650 7800 50  0001 C CNN
	1    7650 7800
	0    1    1    0   
$EndComp
Wire Wire Line
	7650 7800 7750 7800
Wire Wire Line
	8050 7800 8150 7800
Connection ~ 8150 7800
Text GLabel 2600 5300 0    50   Input ~ 0
CAN1_SILENT
Text GLabel 2600 5400 0    50   Input ~ 0
CAN2_SILENT
Wire Wire Line
	2700 5300 2600 5300
Wire Wire Line
	2600 5400 2700 5400
Wire Wire Line
	2550 5550 2600 5550
Wire Wire Line
	2600 5550 2600 5500
NoConn ~ 3900 5300
$Comp
L power:+3V3 #PWR018
U 1 1 616DBAE5
P 7050 8500
F 0 "#PWR018" H 7050 8350 50  0001 C CNN
F 1 "+3V3" V 7065 8628 50  0000 L CNN
F 2 "" H 7050 8500 50  0001 C CNN
F 3 "" H 7050 8500 50  0001 C CNN
	1    7050 8500
	0    -1   -1   0   
$EndComp
Wire Notes Line
	6200 1400 9700 1400
Wire Notes Line
	21950 3800 18700 3800
Wire Notes Line
	21950 1350 21950 3800
Wire Notes Line
	9700 6450 6200 6450
Wire Notes Line
	9700 1400 9700 6450
Wire Notes Line
	6200 1400 6200 6450
$Comp
L Connector_Generic:Conn_01x06 J2
U 1 1 6FAA0EA1
P 7500 4200
F 0 "J2" H 7580 4192 50  0000 L CNN
F 1 "Conn_01x06" H 7580 4101 50  0000 L CNN
F 2 "Connector_JST:JST_GH_SM06B-GHS-TB_1x06-1MP_P1.25mm_Horizontal" H 7500 4200 50  0001 C CNN
F 3 "~" H 7500 4200 50  0001 C CNN
	1    7500 4200
	1    0    0    -1  
$EndComp
$Comp
L power:GND #PWR020
U 1 1 6FAAC543
P 7200 4600
F 0 "#PWR020" H 7200 4350 50  0001 C CNN
F 1 "GND" H 7205 4427 50  0000 C CNN
F 2 "" H 7200 4600 50  0001 C CNN
F 3 "" H 7200 4600 50  0001 C CNN
	1    7200 4600
	1    0    0    -1  
$EndComp
$Comp
L power:+5V #PWR019
U 1 1 6FAB4E79
P 7200 3800
F 0 "#PWR019" H 7200 3650 50  0001 C CNN
F 1 "+5V" H 7215 3973 50  0000 C CNN
F 2 "" H 7200 3800 50  0001 C CNN
F 3 "" H 7200 3800 50  0001 C CNN
	1    7200 3800
	1    0    0    -1  
$EndComp
Wire Wire Line
	7200 4000 7300 4000
Text Label 7200 4100 2    50   ~ 0
TELEM1_TX
Text Label 7200 4200 2    50   ~ 0
TELEM1_RX
Text Label 7200 4300 2    50   ~ 0
TELEM1_CTS
Text Label 7200 4400 2    50   ~ 0
TELEM1_RTS
Wire Wire Line
	7200 4500 7300 4500
Wire Wire Line
	7300 4400 7200 4400
Wire Wire Line
	7300 4200 7200 4200
Wire Wire Line
	7200 4100 7300 4100
Wire Wire Line
	7200 4300 7300 4300
$Comp
L power:GND #PWR034
U 1 1 71512C72
P 8700 4400
F 0 "#PWR034" H 8700 4150 50  0001 C CNN
F 1 "GND" H 8705 4227 50  0000 C CNN
F 2 "" H 8700 4400 50  0001 C CNN
F 3 "" H 8700 4400 50  0001 C CNN
	1    8700 4400
	1    0    0    -1  
$EndComp
$Comp
L power:+5V #PWR033
U 1 1 71512C78
P 8700 3800
F 0 "#PWR033" H 8700 3650 50  0001 C CNN
F 1 "+5V" H 8715 3973 50  0000 C CNN
F 2 "" H 8700 3800 50  0001 C CNN
F 3 "" H 8700 3800 50  0001 C CNN
	1    8700 3800
	1    0    0    -1  
$EndComp
Wire Wire Line
	8700 4000 8800 4000
Text Label 8700 4100 2    50   ~ 0
TELEM1_TX
Text Label 8700 4200 2    50   ~ 0
TELEM1_RX
Wire Wire Line
	8700 4400 8700 4300
Wire Wire Line
	8700 4300 8800 4300
Wire Wire Line
	8800 4200 8700 4200
Wire Wire Line
	8700 4100 8800 4100
$Comp
L Connector_Generic:Conn_01x06 J3
U 1 1 71559003
P 7500 5600
F 0 "J3" H 7580 5592 50  0000 L CNN
F 1 "Conn_01x06" H 7580 5501 50  0000 L CNN
F 2 "Connector_JST:JST_GH_SM06B-GHS-TB_1x06-1MP_P1.25mm_Horizontal" H 7500 5600 50  0001 C CNN
F 3 "~" H 7500 5600 50  0001 C CNN
	1    7500 5600
	1    0    0    -1  
$EndComp
Wire Wire Line
	7200 5300 7200 5400
$Comp
L power:GND #PWR022
U 1 1 7155900A
P 7200 6000
F 0 "#PWR022" H 7200 5750 50  0001 C CNN
F 1 "GND" H 7205 5827 50  0000 C CNN
F 2 "" H 7200 6000 50  0001 C CNN
F 3 "" H 7200 6000 50  0001 C CNN
	1    7200 6000
	1    0    0    -1  
$EndComp
$Comp
L power:+5V #PWR021
U 1 1 71559010
P 7200 5250
F 0 "#PWR021" H 7200 5100 50  0001 C CNN
F 1 "+5V" H 7215 5423 50  0000 C CNN
F 2 "" H 7200 5250 50  0001 C CNN
F 3 "" H 7200 5250 50  0001 C CNN
	1    7200 5250
	1    0    0    -1  
$EndComp
Wire Wire Line
	7200 5400 7300 5400
Text Label 7200 5500 2    50   ~ 0
TELEM2_TX
Text Label 7200 5600 2    50   ~ 0
TELEM2_RX
Text Label 7200 5700 2    50   ~ 0
TELEM2_CTS
Text Label 7200 5800 2    50   ~ 0
TELEM2_RTS
Wire Wire Line
	7200 6000 7200 5900
Wire Wire Line
	7200 5900 7300 5900
Wire Wire Line
	7300 5800 7200 5800
Wire Wire Line
	7300 5600 7200 5600
Wire Wire Line
	7200 5500 7300 5500
Wire Wire Line
	7200 5700 7300 5700
Wire Wire Line
	8700 5300 8700 5400
$Comp
L power:GND #PWR036
U 1 1 71559028
P 8700 5800
F 0 "#PWR036" H 8700 5550 50  0001 C CNN
F 1 "GND" H 8705 5627 50  0000 C CNN
F 2 "" H 8700 5800 50  0001 C CNN
F 3 "" H 8700 5800 50  0001 C CNN
	1    8700 5800
	1    0    0    -1  
$EndComp
$Comp
L power:+5V #PWR035
U 1 1 7155902E
P 8700 5250
F 0 "#PWR035" H 8700 5100 50  0001 C CNN
F 1 "+5V" H 8715 5423 50  0000 C CNN
F 2 "" H 8700 5250 50  0001 C CNN
F 3 "" H 8700 5250 50  0001 C CNN
	1    8700 5250
	1    0    0    -1  
$EndComp
Wire Wire Line
	8700 5400 8800 5400
Text Label 8700 5500 2    50   ~ 0
TELEM2_TX
Wire Wire Line
	8700 5800 8700 5700
Wire Wire Line
	8700 5700 8800 5700
Wire Wire Line
	8800 5600 8700 5600
Wire Wire Line
	8700 5500 8800 5500
Text Notes 7100 3550 0    50   ~ 0
JST-GH\n
Text Notes 8650 3550 0    50   ~ 0
PAD\n
Wire Wire Line
	7200 4500 7200 4600
$Comp
L Device:C C6
U 1 1 619C08A3
P 6950 3900
F 0 "C6" V 6698 3900 50  0000 C CNN
F 1 "2.2uF" V 6789 3900 50  0000 C CNN
F 2 "Capacitor_SMD:C_0603_1608Metric" H 6988 3750 50  0001 C CNN
F 3 "~" H 6950 3900 50  0001 C CNN
	1    6950 3900
	0    1    1    0   
$EndComp
Wire Wire Line
	8700 3800 8700 3900
Wire Wire Line
	7200 3800 7200 3900
Wire Wire Line
	7200 3900 7100 3900
Connection ~ 7200 3900
Wire Wire Line
	7200 3900 7200 4000
$Comp
L power:GND #PWR012
U 1 1 61A42A4D
P 6700 3900
F 0 "#PWR012" H 6700 3650 50  0001 C CNN
F 1 "GND" V 6705 3772 50  0000 R CNN
F 2 "" H 6700 3900 50  0001 C CNN
F 3 "" H 6700 3900 50  0001 C CNN
	1    6700 3900
	0    1    1    0   
$EndComp
Wire Wire Line
	6800 3900 6700 3900
$Comp
L Device:C C10
U 1 1 61AC9176
P 8450 3900
F 0 "C10" V 8198 3900 50  0000 C CNN
F 1 "2.2uF" V 8289 3900 50  0000 C CNN
F 2 "Capacitor_SMD:C_0603_1608Metric" H 8488 3750 50  0001 C CNN
F 3 "~" H 8450 3900 50  0001 C CNN
	1    8450 3900
	0    1    1    0   
$EndComp
$Comp
L power:GND #PWR025
U 1 1 61AC917D
P 8200 3900
F 0 "#PWR025" H 8200 3650 50  0001 C CNN
F 1 "GND" V 8205 3772 50  0000 R CNN
F 2 "" H 8200 3900 50  0001 C CNN
F 3 "" H 8200 3900 50  0001 C CNN
	1    8200 3900
	0    1    1    0   
$EndComp
Wire Wire Line
	8300 3900 8200 3900
Wire Wire Line
	8700 3900 8600 3900
Connection ~ 8700 3900
Wire Wire Line
	8700 3900 8700 4000
$Comp
L Device:C C7
U 1 1 61B1EE34
P 6950 5300
F 0 "C7" V 6698 5300 50  0000 C CNN
F 1 "2.2uF" V 6789 5300 50  0000 C CNN
F 2 "Capacitor_SMD:C_0603_1608Metric" H 6988 5150 50  0001 C CNN
F 3 "~" H 6950 5300 50  0001 C CNN
	1    6950 5300
	0    1    1    0   
$EndComp
$Comp
L power:GND #PWR013
U 1 1 61B1EE3A
P 6700 5300
F 0 "#PWR013" H 6700 5050 50  0001 C CNN
F 1 "GND" V 6705 5172 50  0000 R CNN
F 2 "" H 6700 5300 50  0001 C CNN
F 3 "" H 6700 5300 50  0001 C CNN
	1    6700 5300
	0    1    1    0   
$EndComp
Wire Wire Line
	6800 5300 6700 5300
Wire Wire Line
	7100 5300 7200 5300
Wire Wire Line
	7200 5300 7200 5250
Connection ~ 7200 5300
$Comp
L Device:C C11
U 1 1 61B9FF9A
P 8450 5300
F 0 "C11" V 8198 5300 50  0000 C CNN
F 1 "2.2uF" V 8289 5300 50  0000 C CNN
F 2 "Capacitor_SMD:C_0603_1608Metric" H 8488 5150 50  0001 C CNN
F 3 "~" H 8450 5300 50  0001 C CNN
	1    8450 5300
	0    1    1    0   
$EndComp
$Comp
L power:GND #PWR026
U 1 1 61B9FFA0
P 8200 5300
F 0 "#PWR026" H 8200 5050 50  0001 C CNN
F 1 "GND" V 8205 5172 50  0000 R CNN
F 2 "" H 8200 5300 50  0001 C CNN
F 3 "" H 8200 5300 50  0001 C CNN
	1    8200 5300
	0    1    1    0   
$EndComp
Wire Wire Line
	8300 5300 8200 5300
Wire Wire Line
	8600 5300 8700 5300
Wire Wire Line
	8700 5300 8700 5250
Connection ~ 8700 5300
Wire Wire Line
	7650 8400 6800 8400
Wire Wire Line
	6800 8300 6800 8400
Wire Wire Line
	6700 8400 6800 8400
Connection ~ 6800 8400
Wire Wire Line
	6800 7900 6800 8000
Text GLabel 7450 8750 0    50   Input ~ 0
CAN1_SILENT
$Comp
L Device:R R7
U 1 1 621EFF78
P 7300 8500
F 0 "R7" V 7400 8500 50  0000 C CNN
F 1 "100K" V 7300 8500 50  0000 C CNN
F 2 "Resistor_SMD:R_0603_1608Metric" V 7230 8500 50  0001 C CNN
F 3 "~" H 7300 8500 50  0001 C CNN
	1    7300 8500
	0    1    1    0   
$EndComp
Wire Wire Line
	7550 8500 7550 8750
Wire Wire Line
	7450 8750 7550 8750
Wire Wire Line
	7050 8500 7150 8500
Wire Wire Line
	7450 8500 7550 8500
Connection ~ 7550 8500
Wire Wire Line
	8350 8800 8250 8800
Text Label 8750 8200 0    50   ~ 0
CAN1_H
Text Label 8750 8400 0    50   ~ 0
CAN1_L
Wire Wire Line
	8750 8200 8650 8200
Wire Wire Line
	8650 8400 8750 8400
$Comp
L Interface_CAN_LIN:TJA1051TK-3 U2
U 1 1 6245EC59
P 8100 10000
F 0 "U2" H 7900 10350 50  0000 C CNN
F 1 "TJA1051TK-3" H 8400 10350 50  0000 C CNN
F 2 "Package_DFN_QFN:DFN-8-1EP_3x3mm_P0.65mm_EP1.55x2.4mm" H 8100 9500 50  0001 C CIN
F 3 "http://www.nxp.com/documents/data_sheet/TJA1051.pdf" H 8100 10000 50  0001 C CNN
	1    8100 10000
	1    0    0    -1  
$EndComp
$Comp
L power:GND #PWR029
U 1 1 6245EC5F
P 8300 10500
F 0 "#PWR029" H 8300 10250 50  0001 C CNN
F 1 "GND" V 8305 10372 50  0000 R CNN
F 2 "" H 8300 10500 50  0001 C CNN
F 3 "" H 8300 10500 50  0001 C CNN
	1    8300 10500
	0    -1   -1   0   
$EndComp
Wire Wire Line
	8200 10500 8200 10400
Wire Wire Line
	8200 10500 8100 10500
Wire Wire Line
	8100 10500 8100 10400
Connection ~ 8200 10500
$Comp
L power:+5V #PWR027
U 1 1 6245EC69
P 8200 9500
F 0 "#PWR027" H 8200 9350 50  0001 C CNN
F 1 "+5V" V 8215 9628 50  0000 L CNN
F 2 "" H 8200 9500 50  0001 C CNN
F 3 "" H 8200 9500 50  0001 C CNN
	1    8200 9500
	0    1    1    0   
$EndComp
Text GLabel 7500 9900 0    50   Input ~ 0
CAN2_RX
Text GLabel 7500 9800 0    50   Input ~ 0
CAN2_TX
Wire Wire Line
	7500 9800 7600 9800
Wire Wire Line
	7600 9900 7500 9900
Wire Wire Line
	7600 10200 7500 10200
Wire Wire Line
	8200 9500 8100 9500
Wire Wire Line
	8100 9500 8100 9600
$Comp
L power:+3V3 #PWR011
U 1 1 6245EC76
P 6650 10100
F 0 "#PWR011" H 6650 9950 50  0001 C CNN
F 1 "+3V3" V 6665 10228 50  0000 L CNN
F 2 "" H 6650 10100 50  0001 C CNN
F 3 "" H 6650 10100 50  0001 C CNN
	1    6650 10100
	0    -1   -1   0   
$EndComp
$Comp
L Device:C C4
U 1 1 6245EC7C
P 6750 9850
F 0 "C4" H 6865 9896 50  0000 L CNN
F 1 "0.1uF" H 6865 9805 50  0000 L CNN
F 2 "Capacitor_SMD:C_0603_1608Metric" H 6788 9700 50  0001 C CNN
F 3 "~" H 6750 9850 50  0001 C CNN
	1    6750 9850
	1    0    0    -1  
$EndComp
$Comp
L power:GND #PWR015
U 1 1 6245EC82
P 6750 9600
F 0 "#PWR015" H 6750 9350 50  0001 C CNN
F 1 "GND" H 6755 9427 50  0000 C CNN
F 2 "" H 6750 9600 50  0001 C CNN
F 3 "" H 6750 9600 50  0001 C CNN
	1    6750 9600
	-1   0    0    1   
$EndComp
$Comp
L Device:C C8
U 1 1 6245EC88
P 7850 9500
F 0 "C8" V 7700 9500 50  0000 C CNN
F 1 "0.1uF" V 7950 9300 50  0000 C CNN
F 2 "Capacitor_SMD:C_0603_1608Metric" H 7888 9350 50  0001 C CNN
F 3 "~" H 7850 9500 50  0001 C CNN
	1    7850 9500
	0    1    1    0   
$EndComp
$Comp
L power:GND #PWR023
U 1 1 6245EC8E
P 7600 9500
F 0 "#PWR023" H 7600 9250 50  0001 C CNN
F 1 "GND" V 7605 9372 50  0000 R CNN
F 2 "" H 7600 9500 50  0001 C CNN
F 3 "" H 7600 9500 50  0001 C CNN
	1    7600 9500
	0    1    1    0   
$EndComp
Wire Wire Line
	7600 9500 7700 9500
Wire Wire Line
	8000 9500 8100 9500
Connection ~ 8100 9500
$Comp
L power:+3V3 #PWR017
U 1 1 6245EC97
P 7000 10200
F 0 "#PWR017" H 7000 10050 50  0001 C CNN
F 1 "+3V3" V 7015 10328 50  0000 L CNN
F 2 "" H 7000 10200 50  0001 C CNN
F 3 "" H 7000 10200 50  0001 C CNN
	1    7000 10200
	0    -1   -1   0   
$EndComp
Wire Wire Line
	7600 10100 6750 10100
Wire Wire Line
	6750 10000 6750 10100
Wire Wire Line
	6650 10100 6750 10100
Connection ~ 6750 10100
Wire Wire Line
	6750 9600 6750 9700
Text GLabel 7400 10450 0    50   Input ~ 0
CAN2_SILENT
$Comp
L Device:R R6
U 1 1 6245ECA3
P 7250 10200
F 0 "R6" V 7350 10200 50  0000 C CNN
F 1 "100K" V 7250 10200 50  0000 C CNN
F 2 "Resistor_SMD:R_0603_1608Metric" V 7180 10200 50  0001 C CNN
F 3 "~" H 7250 10200 50  0001 C CNN
	1    7250 10200
	0    1    1    0   
$EndComp
Wire Wire Line
	7500 10200 7500 10450
Wire Wire Line
	7400 10450 7500 10450
Wire Wire Line
	7000 10200 7100 10200
Wire Wire Line
	7400 10200 7500 10200
Connection ~ 7500 10200
Wire Wire Line
	8300 10500 8200 10500
Text Label 8700 9900 0    50   ~ 0
CAN2_H
Text Label 8700 10100 0    50   ~ 0
CAN2_L
Wire Wire Line
	8700 9900 8600 9900
Wire Wire Line
	8600 10100 8700 10100
Wire Wire Line
	19650 2450 19550 2450
Wire Wire Line
	19550 2550 19650 2550
Wire Wire Line
	19550 2650 19650 2650
Wire Wire Line
	19850 3050 20000 3050
Wire Wire Line
	20100 2950 20100 3050
Wire Wire Line
	20000 2950 20000 3050
Connection ~ 20000 3050
Wire Wire Line
	20000 3050 20100 3050
Wire Wire Line
	20850 2200 20700 2200
Wire Wire Line
	20700 2200 20700 2450
Wire Wire Line
	20700 2450 20450 2450
Wire Wire Line
	20450 2550 20700 2550
Wire Wire Line
	20700 2550 20700 2600
Wire Wire Line
	20700 2600 20850 2600
Wire Wire Line
	20850 3000 20650 3000
Wire Wire Line
	20650 3000 20650 2650
Wire Wire Line
	20650 2650 20450 2650
Wire Wire Line
	20750 3200 20750 3100
Wire Wire Line
	20750 3100 20850 3100
Wire Wire Line
	20750 3100 20750 2700
Wire Wire Line
	20750 2700 20850 2700
Connection ~ 20750 3100
Wire Wire Line
	20750 2700 20750 2300
Wire Wire Line
	20750 2300 20850 2300
Connection ~ 20750 2700
$Comp
L power:GND #PWR031
U 1 1 629315FA
P 8500 2350
F 0 "#PWR031" H 8500 2100 50  0001 C CNN
F 1 "GND" V 8505 2222 50  0000 R CNN
F 2 "" H 8500 2350 50  0001 C CNN
F 3 "" H 8500 2350 50  0001 C CNN
	1    8500 2350
	0    -1   -1   0   
$EndComp
Wire Wire Line
	8000 2350 8000 2250
Wire Wire Line
	8000 2350 8100 2350
Wire Wire Line
	8100 2350 8100 2250
Connection ~ 8100 2350
Wire Wire Line
	8100 2350 8500 2350
$Comp
L power:GND #PWR032
U 1 1 629874C4
P 8550 3400
F 0 "#PWR032" H 8550 3150 50  0001 C CNN
F 1 "GND" V 8555 3272 50  0000 R CNN
F 2 "" H 8550 3400 50  0001 C CNN
F 3 "" H 8550 3400 50  0001 C CNN
	1    8550 3400
	0    -1   -1   0   
$EndComp
Wire Wire Line
	8550 3400 8100 3400
Wire Wire Line
	8100 3400 8100 3300
Wire Wire Line
	8100 3400 8000 3400
Wire Wire Line
	8000 3400 8000 3300
Connection ~ 8100 3400
Wire Wire Line
	8550 1750 8450 1750
Wire Wire Line
	8450 1850 8550 1850
Wire Wire Line
	8550 1950 8450 1950
Wire Wire Line
	8450 2050 8550 2050
Wire Wire Line
	7650 2050 7550 2050
Wire Wire Line
	7550 1950 7650 1950
Wire Wire Line
	7650 1850 7550 1850
Wire Wire Line
	7550 1750 7650 1750
Wire Wire Line
	8550 2800 8450 2800
Wire Wire Line
	8450 2900 8550 2900
Wire Wire Line
	8550 3000 8450 3000
Wire Wire Line
	8450 3100 8550 3100
Wire Wire Line
	7650 3100 7550 3100
Wire Wire Line
	7550 3000 7650 3000
Wire Wire Line
	7650 2900 7550 2900
Wire Wire Line
	7550 2800 7650 2800
$Comp
L power:GND #PWR041
U 1 1 62ED1B21
P 12800 9500
F 0 "#PWR041" H 12800 9250 50  0001 C CNN
F 1 "GND" V 12805 9372 50  0000 R CNN
F 2 "" H 12800 9500 50  0001 C CNN
F 3 "" H 12800 9500 50  0001 C CNN
	1    12800 9500
	0    -1   -1   0   
$EndComp
Wire Wire Line
	12800 9500 12700 9500
Wire Wire Line
	12700 9500 12700 9400
Wire Wire Line
	12700 9500 12600 9500
Wire Wire Line
	12600 9500 12600 9400
Connection ~ 12700 9500
Text Label 10000 8000 2    50   ~ 0
CAN1_H
Text Label 10000 9000 2    50   ~ 0
CAN1_L
Text GLabel 10600 8800 0    50   Input ~ 0
CAN1_TERM
$Comp
L Device:R R8
U 1 1 63022FBB
P 10700 8500
F 0 "R8" H 10630 8454 50  0000 R CNN
F 1 "100K" H 10630 8545 50  0000 R CNN
F 2 "Resistor_SMD:R_0603_1608Metric" V 10630 8500 50  0001 C CNN
F 3 "~" H 10700 8500 50  0001 C CNN
	1    10700 8500
	-1   0    0    1   
$EndComp
$Comp
L power:GND #PWR037
U 1 1 63024DBA
P 10700 8250
F 0 "#PWR037" H 10700 8000 50  0001 C CNN
F 1 "GND" H 10705 8077 50  0000 C CNN
F 2 "" H 10700 8250 50  0001 C CNN
F 3 "" H 10700 8250 50  0001 C CNN
	1    10700 8250
	-1   0    0    1   
$EndComp
$Comp
L Device:R R10
U 1 1 63024FA6
P 11100 8250
F 0 "R10" H 11170 8296 50  0000 L CNN
F 1 "120" H 11170 8205 50  0000 L CNN
F 2 "Resistor_SMD:R_0603_1608Metric" V 11030 8250 50  0001 C CNN
F 3 "~" H 11100 8250 50  0001 C CNN
	1    11100 8250
	1    0    0    -1  
$EndComp
Wire Wire Line
	11100 8400 11100 8500
Wire Wire Line
	10000 8000 11100 8000
Wire Wire Line
	11100 8000 11100 8100
Wire Wire Line
	10600 8800 10700 8800
Wire Wire Line
	10700 8650 10700 8800
Connection ~ 10700 8800
Wire Wire Line
	10700 8800 10800 8800
Wire Wire Line
	10700 8250 10700 8350
Wire Wire Line
	10000 9000 11100 9000
Wire Wire Line
	11100 9000 11100 8900
$Comp
L osd:ESD7104MUTAG D8
U 1 1 6FC9C315
P 12650 9050
F 0 "D8" H 12650 9565 50  0000 C CNN
F 1 "ESD7104MUTAG" H 12650 9474 50  0000 C CNN
F 2 "osd:ESD7104MUTAG" H 12650 9050 50  0001 C CNN
F 3 "" H 12650 9050 50  0001 C CNN
	1    12650 9050
	1    0    0    -1  
$EndComp
Text Label 10000 9100 2    50   ~ 0
CAN2_H
Text Label 10000 10100 2    50   ~ 0
CAN2_L
Text GLabel 10600 9900 0    50   Input ~ 0
CAN2_TERM
$Comp
L Device:R R9
U 1 1 6342F609
P 10700 9600
F 0 "R9" H 10630 9554 50  0000 R CNN
F 1 "100K" H 10630 9645 50  0000 R CNN
F 2 "Resistor_SMD:R_0603_1608Metric" V 10630 9600 50  0001 C CNN
F 3 "~" H 10700 9600 50  0001 C CNN
	1    10700 9600
	-1   0    0    1   
$EndComp
$Comp
L power:GND #PWR038
U 1 1 6342F60F
P 10700 9350
F 0 "#PWR038" H 10700 9100 50  0001 C CNN
F 1 "GND" H 10705 9177 50  0000 C CNN
F 2 "" H 10700 9350 50  0001 C CNN
F 3 "" H 10700 9350 50  0001 C CNN
	1    10700 9350
	-1   0    0    1   
$EndComp
$Comp
L Device:R R11
U 1 1 6342F615
P 11100 9350
F 0 "R11" H 11170 9396 50  0000 L CNN
F 1 "120" H 11170 9305 50  0000 L CNN
F 2 "Resistor_SMD:R_0603_1608Metric" V 11030 9350 50  0001 C CNN
F 3 "~" H 11100 9350 50  0001 C CNN
	1    11100 9350
	1    0    0    -1  
$EndComp
Wire Wire Line
	11100 9500 11100 9600
Wire Wire Line
	10000 9100 11100 9100
Wire Wire Line
	11100 9100 11100 9200
Wire Wire Line
	10600 9900 10700 9900
Wire Wire Line
	10700 9750 10700 9900
Connection ~ 10700 9900
Wire Wire Line
	10700 9900 10800 9900
Wire Wire Line
	10700 9350 10700 9450
Wire Wire Line
	10000 10100 11100 10100
Wire Wire Line
	11100 10100 11100 10000
Wire Wire Line
	11100 9000 12250 9000
Connection ~ 11100 9000
Wire Wire Line
	11100 9100 12250 9100
Connection ~ 11100 9100
Wire Wire Line
	11100 10100 12100 10100
Wire Wire Line
	12100 10100 12100 9200
Wire Wire Line
	12100 9200 12250 9200
Connection ~ 11100 10100
Wire Wire Line
	12250 8900 12100 8900
Wire Wire Line
	12100 8900 12100 8000
Wire Wire Line
	12100 8000 11100 8000
Connection ~ 11100 8000
$Comp
L Connector_Generic:Conn_01x04 J7
U 1 1 6365B346
P 14500 8450
F 0 "J7" H 14580 8442 50  0000 L CNN
F 1 "Conn_01x04" H 14580 8351 50  0000 L CNN
F 2 "Connector_JST:JST_GH_SM04B-GHS-TB_1x04-1MP_P1.25mm_Horizontal" H 14500 8450 50  0001 C CNN
F 3 "~" H 14500 8450 50  0001 C CNN
	1    14500 8450
	1    0    0    -1  
$EndComp
$Comp
L power:GND #PWR046
U 1 1 63661751
P 14100 8650
F 0 "#PWR046" H 14100 8400 50  0001 C CNN
F 1 "GND" V 14105 8522 50  0000 R CNN
F 2 "" H 14100 8650 50  0001 C CNN
F 3 "" H 14100 8650 50  0001 C CNN
	1    14100 8650
	0    1    1    0   
$EndComp
Wire Wire Line
	14200 8650 14300 8650
Wire Wire Line
	14200 8650 14200 8150
Wire Wire Line
	14200 8150 14300 8150
Connection ~ 14200 8650
Wire Wire Line
	14100 8650 14200 8650
Wire Wire Line
	14300 8550 14100 8550
Wire Wire Line
	14100 8550 14100 8250
Wire Wire Line
	14100 8050 14300 8050
Wire Wire Line
	14300 8450 14000 8450
Wire Wire Line
	14000 8450 14000 8050
Wire Wire Line
	14000 7950 14300 7950
$Comp
L Device:C C13
U 1 1 6374B928
P 13750 8350
F 0 "C13" V 13498 8350 50  0000 C CNN
F 1 "2.2uF" V 13589 8350 50  0000 C CNN
F 2 "Capacitor_SMD:C_0603_1608Metric" H 13788 8200 50  0001 C CNN
F 3 "~" H 13750 8350 50  0001 C CNN
	1    13750 8350
	0    1    1    0   
$EndComp
$Comp
L Device:C C12
U 1 1 6374C1AC
P 13750 7850
F 0 "C12" V 13498 7850 50  0000 C CNN
F 1 "2.2uF" V 13589 7850 50  0000 C CNN
F 2 "Capacitor_SMD:C_0603_1608Metric" H 13788 7700 50  0001 C CNN
F 3 "~" H 13750 7850 50  0001 C CNN
	1    13750 7850
	0    1    1    0   
$EndComp
Wire Wire Line
	13900 7850 14250 7850
Wire Wire Line
	14300 8350 14250 8350
$Comp
L power:GND #PWR043
U 1 1 637AEE3C
P 13500 7750
F 0 "#PWR043" H 13500 7500 50  0001 C CNN
F 1 "GND" H 13505 7577 50  0000 C CNN
F 2 "" H 13500 7750 50  0001 C CNN
F 3 "" H 13500 7750 50  0001 C CNN
	1    13500 7750
	-1   0    0    1   
$EndComp
Wire Wire Line
	13500 7850 13600 7850
Wire Wire Line
	13500 8350 13600 8350
Wire Wire Line
	13500 7750 13500 7850
Connection ~ 13500 7850
Wire Wire Line
	13500 7850 13500 8350
$Comp
L Connector_Generic:Conn_01x04 J8
U 1 1 6384AFC1
P 14500 9550
F 0 "J8" H 14580 9542 50  0000 L CNN
F 1 "Conn_01x04" H 14580 9451 50  0000 L CNN
F 2 "Connector_JST:JST_GH_SM04B-GHS-TB_1x04-1MP_P1.25mm_Horizontal" H 14500 9550 50  0001 C CNN
F 3 "~" H 14500 9550 50  0001 C CNN
	1    14500 9550
	1    0    0    -1  
$EndComp
$Comp
L Connector_Generic:Conn_01x04 J9
U 1 1 6384AFC7
P 14500 10050
F 0 "J9" H 14580 10042 50  0000 L CNN
F 1 "Conn_01x04" H 14580 9951 50  0000 L CNN
F 2 "Connector_JST:JST_GH_SM04B-GHS-TB_1x04-1MP_P1.25mm_Horizontal" H 14500 10050 50  0001 C CNN
F 3 "~" H 14500 10050 50  0001 C CNN
	1    14500 10050
	1    0    0    -1  
$EndComp
$Comp
L power:GND #PWR047
U 1 1 6384AFCD
P 14100 10250
F 0 "#PWR047" H 14100 10000 50  0001 C CNN
F 1 "GND" V 14105 10122 50  0000 R CNN
F 2 "" H 14100 10250 50  0001 C CNN
F 3 "" H 14100 10250 50  0001 C CNN
	1    14100 10250
	0    1    1    0   
$EndComp
Wire Wire Line
	14200 10250 14300 10250
Wire Wire Line
	14200 10250 14200 9750
Wire Wire Line
	14200 9750 14300 9750
Connection ~ 14200 10250
Wire Wire Line
	14100 10250 14200 10250
Wire Wire Line
	14300 10150 14100 10150
Wire Wire Line
	14100 10150 14100 9850
Wire Wire Line
	14100 9650 14300 9650
Wire Wire Line
	14300 10050 14000 10050
Wire Wire Line
	14000 10050 14000 9650
Wire Wire Line
	14000 9550 14300 9550
$Comp
L Device:C C15
U 1 1 6384AFDE
P 13750 9950
F 0 "C15" V 13498 9950 50  0000 C CNN
F 1 "2.2uF" V 13589 9950 50  0000 C CNN
F 2 "Capacitor_SMD:C_0603_1608Metric" H 13788 9800 50  0001 C CNN
F 3 "~" H 13750 9950 50  0001 C CNN
	1    13750 9950
	0    1    1    0   
$EndComp
$Comp
L Device:C C14
U 1 1 6384AFE4
P 13750 9450
F 0 "C14" V 13498 9450 50  0000 C CNN
F 1 "2.2uF" V 13589 9450 50  0000 C CNN
F 2 "Capacitor_SMD:C_0603_1608Metric" H 13788 9300 50  0001 C CNN
F 3 "~" H 13750 9450 50  0001 C CNN
	1    13750 9450
	0    1    1    0   
$EndComp
Wire Wire Line
	13900 9450 14250 9450
Wire Wire Line
	14300 9950 14250 9950
$Comp
L power:GND #PWR044
U 1 1 6384AFEC
P 13500 10050
F 0 "#PWR044" H 13500 9800 50  0001 C CNN
F 1 "GND" H 13505 9877 50  0000 C CNN
F 2 "" H 13500 10050 50  0001 C CNN
F 3 "" H 13500 10050 50  0001 C CNN
	1    13500 10050
	1    0    0    -1  
$EndComp
Wire Wire Line
	13500 9450 13600 9450
Wire Wire Line
	13500 9950 13600 9950
Wire Wire Line
	13500 9450 13500 9950
Wire Wire Line
	13050 8900 13350 8900
Connection ~ 14000 8050
Wire Wire Line
	14000 8050 14000 7950
Wire Wire Line
	13050 9000 13450 9000
Wire Wire Line
	13450 9000 13450 8250
Wire Wire Line
	13450 8250 14100 8250
Connection ~ 14100 8250
Wire Wire Line
	14100 8250 14100 8050
Wire Wire Line
	13500 10050 13500 9950
Connection ~ 13500 9950
Wire Wire Line
	13050 9100 13450 9100
Wire Wire Line
	13450 9100 13450 9650
Wire Wire Line
	13450 9650 14000 9650
Connection ~ 14000 9650
Wire Wire Line
	14000 9650 14000 9550
Wire Wire Line
	13050 9200 13350 9200
Wire Wire Line
	13350 9200 13350 9850
Wire Wire Line
	13350 9850 14100 9850
Connection ~ 14100 9850
Wire Wire Line
	14100 9850 14100 9650
Wire Wire Line
	13350 8050 13350 8900
Wire Wire Line
	13350 8050 14000 8050
Wire Notes Line
	6200 7050 15500 7050
Wire Notes Line
	15500 7050 15500 10850
Wire Notes Line
	15500 10850 6200 10850
Wire Notes Line
	6200 7050 6200 10850
$Comp
L power:GND #PWR060
U 1 1 63D32D18
P 20350 5150
F 0 "#PWR060" H 20350 4900 50  0001 C CNN
F 1 "GND" H 20355 4977 50  0000 C CNN
F 2 "" H 20350 5150 50  0001 C CNN
F 3 "" H 20350 5150 50  0001 C CNN
	1    20350 5150
	1    0    0    -1  
$EndComp
Wire Wire Line
	20350 5150 20350 5050
$Comp
L power:+5V #PWR066
U 1 1 63DF2B6C
P 19850 4650
F 0 "#PWR066" H 19850 4500 50  0001 C CNN
F 1 "+5V" V 19865 4778 50  0000 L CNN
F 2 "" H 19850 4650 50  0001 C CNN
F 3 "" H 19850 4650 50  0001 C CNN
	1    19850 4650
	0    -1   1    0   
$EndComp
$Comp
L Device:C C22
U 1 1 63DF37FA
P 19950 5050
F 0 "C22" H 20065 5096 50  0000 L CNN
F 1 "1uF" H 20065 5005 50  0000 L CNN
F 2 "Capacitor_SMD:C_0603_1608Metric" H 19988 4900 50  0001 C CNN
F 3 "~" H 19950 5050 50  0001 C CNN
	1    19950 5050
	-1   0    0    -1  
$EndComp
$Comp
L power:GND #PWR063
U 1 1 63DF3800
P 19950 5300
F 0 "#PWR063" H 19950 5050 50  0001 C CNN
F 1 "GND" H 19955 5127 50  0000 C CNN
F 2 "" H 19950 5300 50  0001 C CNN
F 3 "" H 19950 5300 50  0001 C CNN
	1    19950 5300
	-1   0    0    -1  
$EndComp
Wire Wire Line
	19950 5300 19950 5200
Wire Wire Line
	19950 4900 19950 4750
Wire Wire Line
	19950 4650 19850 4650
Wire Wire Line
	19950 4650 20050 4650
Connection ~ 19950 4650
Wire Notes Line
	18700 4150 21950 4150
Text Notes 18700 4100 0    50   ~ 0
3V3 Regulator & Reverse Polarity Protection\n
Text GLabel 2500 10300 0    50   Input ~ 0
USART1_TX_DEBUG
$Comp
L osd:ESD7104MUTAG D4
U 1 1 6F452663
P 3000 10450
F 0 "D4" H 3000 10950 50  0000 C CNN
F 1 "ESD7104MUTAG" H 3000 10850 50  0000 C CNN
F 2 "osd:ESD7104MUTAG" H 3000 10450 50  0001 C CNN
F 3 "" H 3000 10450 50  0001 C CNN
	1    3000 10450
	1    0    0    -1  
$EndComp
Wire Wire Line
	2500 10300 2600 10300
Wire Wire Line
	2600 10500 2500 10500
Wire Wire Line
	2500 10600 2600 10600
Wire Wire Line
	2000 10400 2600 10400
Wire Wire Line
	2500 11150 2600 11150
Wire Wire Line
	2600 11450 2500 11450
$Comp
L power:GND #PWR07
U 1 1 643115CD
P 3500 10900
F 0 "#PWR07" H 3500 10650 50  0001 C CNN
F 1 "GND" V 3505 10772 50  0000 R CNN
F 2 "" H 3500 10900 50  0001 C CNN
F 3 "" H 3500 10900 50  0001 C CNN
	1    3500 10900
	0    -1   -1   0   
$EndComp
Wire Wire Line
	3500 10900 3050 10900
Wire Wire Line
	3050 10900 3050 10800
Wire Wire Line
	3050 10900 2950 10900
Wire Wire Line
	2950 10900 2950 10800
Connection ~ 3050 10900
$Comp
L power:GND #PWR06
U 1 1 64374C1B
P 3150 11750
F 0 "#PWR06" H 3150 11500 50  0001 C CNN
F 1 "GND" V 3155 11622 50  0000 R CNN
F 2 "" H 3150 11750 50  0001 C CNN
F 3 "" H 3150 11750 50  0001 C CNN
	1    3150 11750
	0    -1   -1   0   
$EndComp
Wire Wire Line
	3150 11750 3050 11750
Wire Wire Line
	3050 11750 3050 11650
Wire Wire Line
	3050 11750 2950 11750
Wire Wire Line
	2950 11750 2950 11650
Connection ~ 3050 11750
Wire Wire Line
	4000 11150 3400 11150
Wire Wire Line
	4000 10950 4000 11150
Wire Wire Line
	3400 11450 4150 11450
Wire Wire Line
	4150 11450 4150 11250
Text Label 2200 11150 1    50   ~ 0
VOUT_DAC
Wire Wire Line
	4050 11250 4050 11050
Wire Wire Line
	4050 11050 4350 11050
NoConn ~ 3400 11350
NoConn ~ 2600 11350
Wire Wire Line
	2200 11150 2200 11250
Wire Wire Line
	2200 11250 2600 11250
Wire Wire Line
	3400 11250 4050 11250
$Comp
L power:+5V #PWR03
U 1 1 64665CEA
P 2550 14650
F 0 "#PWR03" H 2550 14500 50  0001 C CNN
F 1 "+5V" V 2565 14778 50  0000 L CNN
F 2 "" H 2550 14650 50  0001 C CNN
F 3 "" H 2550 14650 50  0001 C CNN
	1    2550 14650
	0    -1   -1   0   
$EndComp
$Comp
L Device:LED D3
U 1 1 64666AA3
P 2950 14650
F 0 "D3" H 2943 14395 50  0000 C CNN
F 1 "YELLOW" H 2943 14486 50  0000 C CNN
F 2 "LED_SMD:LED_0805_2012Metric" H 2950 14650 50  0001 C CNN
F 3 "~" H 2950 14650 50  0001 C CNN
	1    2950 14650
	-1   0    0    1   
$EndComp
Wire Wire Line
	2800 14650 2550 14650
$Comp
L Device:R R4
U 1 1 6469EEB8
P 3400 14650
F 0 "R4" V 3193 14650 50  0000 C CNN
F 1 "100" V 3284 14650 50  0000 C CNN
F 2 "Resistor_SMD:R_0603_1608Metric" V 3330 14650 50  0001 C CNN
F 3 "~" H 3400 14650 50  0001 C CNN
	1    3400 14650
	0    1    1    0   
$EndComp
Wire Wire Line
	3250 14650 3100 14650
$Comp
L power:GND #PWR08
U 1 1 646D4767
P 3650 14650
F 0 "#PWR08" H 3650 14400 50  0001 C CNN
F 1 "GND" V 3655 14522 50  0000 R CNN
F 2 "" H 3650 14650 50  0001 C CNN
F 3 "" H 3650 14650 50  0001 C CNN
	1    3650 14650
	0    -1   -1   0   
$EndComp
Wire Wire Line
	3650 14650 3550 14650
Text Label 14250 7650 1    50   ~ 0
5V_CAN
Wire Wire Line
	14250 7750 14250 7850
Connection ~ 14250 7850
Wire Wire Line
	14250 7850 14300 7850
Wire Wire Line
	14250 7850 14250 8350
Connection ~ 14250 8350
Wire Wire Line
	14250 8350 13900 8350
Text Label 19900 6450 2    50   ~ 0
5V_CAN
$Comp
L osd:LM66100DCKR U9
U 1 1 647A5EEF
P 20350 6550
F 0 "U9" H 20350 6915 50  0000 C CNN
F 1 "LM66100DCKR" H 20350 6824 50  0000 C CNN
F 2 "Package_TO_SOT_SMD:Texas_R-PDSO-G6" H 20350 6550 50  0001 C CNN
F 3 "" H 20350 6550 50  0001 C CNN
	1    20350 6550
	1    0    0    -1  
$EndComp
Wire Wire Line
	19900 6450 20000 6450
$Comp
L power:GND #PWR056
U 1 1 647DF393
P 19500 6550
F 0 "#PWR056" H 19500 6300 50  0001 C CNN
F 1 "GND" V 19505 6422 50  0000 R CNN
F 2 "" H 19500 6550 50  0001 C CNN
F 3 "" H 19500 6550 50  0001 C CNN
	1    19500 6550
	0    1    1    0   
$EndComp
$Comp
L Device:R R14
U 1 1 647DFF8C
P 19750 6650
F 0 "R14" V 19850 6650 50  0000 C CNN
F 1 "5.1K" V 19750 6650 50  0000 C CNN
F 2 "Resistor_SMD:R_0603_1608Metric" V 19680 6650 50  0001 C CNN
F 3 "~" H 19750 6650 50  0001 C CNN
	1    19750 6650
	0    1    1    0   
$EndComp
Wire Wire Line
	19600 6650 19550 6650
Wire Wire Line
	19550 6650 19550 6550
Wire Wire Line
	19550 6550 19500 6550
Wire Wire Line
	19550 6550 20000 6550
Connection ~ 19550 6550
Wire Wire Line
	20000 6650 19900 6650
$Comp
L Device:C C23
U 1 1 6488749D
P 20900 6550
F 0 "C23" H 21015 6596 50  0000 L CNN
F 1 "10uF" H 21015 6505 50  0000 L CNN
F 2 "Capacitor_SMD:C_0603_1608Metric" H 20938 6400 50  0001 C CNN
F 3 "~" H 20900 6550 50  0001 C CNN
	1    20900 6550
	1    0    0    -1  
$EndComp
$Comp
L power:+5V #PWR064
U 1 1 64887D21
P 20900 6300
F 0 "#PWR064" H 20900 6150 50  0001 C CNN
F 1 "+5V" H 20915 6473 50  0000 C CNN
F 2 "" H 20900 6300 50  0001 C CNN
F 3 "" H 20900 6300 50  0001 C CNN
	1    20900 6300
	1    0    0    -1  
$EndComp
Wire Wire Line
	20900 6300 20900 6350
Wire Wire Line
	20700 6450 20800 6450
Wire Wire Line
	20800 6450 20800 6350
Wire Wire Line
	20800 6350 20900 6350
Connection ~ 20900 6350
Wire Wire Line
	20900 6350 20900 6400
$Comp
L power:GND #PWR065
U 1 1 648F83CE
P 20900 6800
F 0 "#PWR065" H 20900 6550 50  0001 C CNN
F 1 "GND" H 20905 6627 50  0000 C CNN
F 2 "" H 20900 6800 50  0001 C CNN
F 3 "" H 20900 6800 50  0001 C CNN
	1    20900 6800
	1    0    0    -1  
$EndComp
Wire Wire Line
	20900 6800 20900 6750
Wire Wire Line
	20700 6650 20800 6650
Wire Wire Line
	20800 6650 20800 6750
Wire Wire Line
	20800 6750 20900 6750
Connection ~ 20900 6750
Wire Wire Line
	20900 6750 20900 6700
Wire Notes Line
	21950 7300 18700 7300
Wire Notes Line
	21950 4150 21950 7300
Wire Notes Line
	18700 4150 18700 7300
Text GLabel 2600 4100 0    50   Input ~ 0
CAN1_TERM
Text GLabel 2600 4200 0    50   Input ~ 0
CAN2_TERM
Wire Wire Line
	2600 4200 2700 4200
Wire Wire Line
	2700 4100 2600 4100
Text Label 14250 9250 1    50   ~ 0
5V_CAN
Wire Wire Line
	14250 9350 14250 9450
Connection ~ 14250 9450
Wire Wire Line
	14250 9450 14300 9450
Wire Wire Line
	14250 9450 14250 9950
Connection ~ 14250 9950
Wire Wire Line
	14250 9950 13900 9950
Wire Wire Line
	16600 11650 16600 11550
$Comp
L Connector:USB_OTG J10
U 1 1 6F6A59B9
P 17900 9050
F 0 "J10" H 17957 9517 50  0000 C CNN
F 1 "USB_OTG" H 17957 9426 50  0000 C CNN
F 2 "Connector_USB:USB_Micro-B_Molex_47346-0001" H 18050 9000 50  0001 C CNN
F 3 " ~" H 18050 9000 50  0001 C CNN
	1    17900 9050
	1    0    0    -1  
$EndComp
Wire Wire Line
	17900 9550 17900 9450
Wire Wire Line
	17900 9550 17800 9550
Wire Wire Line
	17800 9550 17800 9450
Connection ~ 17900 9550
$Comp
L dk_TVS-Diodes:USBLC6-2SC6 D9
U 1 1 64F3B9BD
P 19850 9100
F 0 "D9" H 19850 9787 60  0000 C CNN
F 1 "USBLC6-2SC6" H 19850 9681 60  0000 C CNN
F 2 "digikey-footprints:SOT23-6L" H 20050 9300 60  0001 L CNN
F 3 "http://www.st.com/content/ccc/resource/technical/document/datasheet/06/1d/48/9c/6c/20/4a/b2/CD00050750.pdf/files/CD00050750.pdf/jcr:content/translations/en.CD00050750.pdf" H 20050 9400 60  0001 L CNN
F 4 "497-5235-1-ND" H 20050 9500 60  0001 L CNN "Digi-Key_PN"
F 5 "USBLC6-2SC6" H 20050 9600 60  0001 L CNN "MPN"
F 6 "Circuit Protection" H 20050 9700 60  0001 L CNN "Category"
F 7 "TVS - Diodes" H 20050 9800 60  0001 L CNN "Family"
F 8 "http://www.st.com/content/ccc/resource/technical/document/datasheet/06/1d/48/9c/6c/20/4a/b2/CD00050750.pdf/files/CD00050750.pdf/jcr:content/translations/en.CD00050750.pdf" H 20050 9900 60  0001 L CNN "DK_Datasheet_Link"
F 9 "/product-detail/en/stmicroelectronics/USBLC6-2SC6/497-5235-1-ND/1121688" H 20050 10000 60  0001 L CNN "DK_Detail_Page"
F 10 "TVS DIODE 5.25V 17V SOT23-6" H 20050 10100 60  0001 L CNN "Description"
F 11 "STMicroelectronics" H 20050 10200 60  0001 L CNN "Manufacturer"
F 12 "Active" H 20050 10300 60  0001 L CNN "Status"
	1    19850 9100
	1    0    0    -1  
$EndComp
$Comp
L power:GND #PWR055
U 1 1 64FBDE0E
P 19250 9100
F 0 "#PWR055" H 19250 8850 50  0001 C CNN
F 1 "GND" V 19255 8972 50  0000 R CNN
F 2 "" H 19250 9100 50  0001 C CNN
F 3 "" H 19250 9100 50  0001 C CNN
	1    19250 9100
	0    1    1    0   
$EndComp
Wire Wire Line
	19250 9100 19350 9100
Wire Wire Line
	18200 9050 18900 9050
Wire Wire Line
	18200 9150 18900 9150
Wire Wire Line
	18900 9050 18900 8800
Wire Wire Line
	18900 8800 19350 8800
Wire Wire Line
	18900 9400 19350 9400
Wire Wire Line
	18900 9150 18900 9400
Wire Wire Line
	18200 8850 18800 8850
Wire Wire Line
	18800 8850 18800 8150
Wire Wire Line
	18800 8150 18950 8150
Wire Wire Line
	20550 8150 20550 9100
Wire Wire Line
	20550 9100 20350 9100
Text GLabel 20700 8800 2    50   Input ~ 0
USB_FS_DP
Wire Wire Line
	20700 8800 20350 8800
Text GLabel 20700 9400 2    50   Input ~ 0
USB_FS_DM
Wire Wire Line
	20700 9400 20350 9400
$Comp
L power:GND #PWR053
U 1 1 6526C321
P 18500 9550
F 0 "#PWR053" H 18500 9300 50  0001 C CNN
F 1 "GND" V 18505 9422 50  0000 R CNN
F 2 "" H 18500 9550 50  0001 C CNN
F 3 "" H 18500 9550 50  0001 C CNN
	1    18500 9550
	0    -1   -1   0   
$EndComp
Wire Wire Line
	17900 9550 18400 9550
$Comp
L Device:R R13
U 1 1 652AB822
P 18400 9400
F 0 "R13" H 18470 9446 50  0000 L CNN
F 1 "100K" H 18470 9355 50  0000 L CNN
F 2 "Resistor_SMD:R_0603_1608Metric" V 18330 9400 50  0001 C CNN
F 3 "~" H 18400 9400 50  0001 C CNN
	1    18400 9400
	1    0    0    -1  
$EndComp
Connection ~ 18400 9550
Wire Wire Line
	18400 9550 18500 9550
Wire Wire Line
	18400 9250 18200 9250
$Comp
L Device:C C18
U 1 1 652ED122
P 19100 10150
F 0 "C18" H 19215 10196 50  0000 L CNN
F 1 "10nF" H 19215 10105 50  0000 L CNN
F 2 "Capacitor_SMD:C_0603_1608Metric" H 19138 10000 50  0001 C CNN
F 3 "~" H 19100 10150 50  0001 C CNN
	1    19100 10150
	1    0    0    -1  
$EndComp
$Comp
L Device:C C19
U 1 1 652ED590
P 19750 10150
F 0 "C19" H 19865 10196 50  0000 L CNN
F 1 "0.1uF" H 19865 10105 50  0000 L CNN
F 2 "Capacitor_SMD:C_0603_1608Metric" H 19788 10000 50  0001 C CNN
F 3 "~" H 19750 10150 50  0001 C CNN
	1    19750 10150
	1    0    0    -1  
$EndComp
$Comp
L Device:C C21
U 1 1 652EDB87
P 20250 10150
F 0 "C21" H 20365 10196 50  0000 L CNN
F 1 "4.7uF" H 20365 10105 50  0000 L CNN
F 2 "Capacitor_SMD:C_0603_1608Metric" H 20288 10000 50  0001 C CNN
F 3 "~" H 20250 10150 50  0001 C CNN
	1    20250 10150
	1    0    0    -1  
$EndComp
$Comp
L power:+5V #PWR061
U 1 1 652EFA13
P 20700 10000
F 0 "#PWR061" H 20700 9850 50  0001 C CNN
F 1 "+5V" V 20715 10128 50  0000 L CNN
F 2 "" H 20700 10000 50  0001 C CNN
F 3 "" H 20700 10000 50  0001 C CNN
	1    20700 10000
	0    1    1    0   
$EndComp
Wire Wire Line
	19750 10000 20250 10000
Connection ~ 20250 10000
Wire Wire Line
	20250 10000 20700 10000
Wire Wire Line
	19750 10300 20250 10300
$Comp
L dk_Ferrite-Beads-and-Chips:BLM18PG121SN1D FB1
U 1 1 65378DD0
P 19450 10000
F 0 "FB1" H 19450 10287 60  0000 C CNN
F 1 "BLM18PG121SN1D" H 19450 10181 60  0000 C CNN
F 2 "digikey-footprints:0603" H 19650 10200 60  0001 L CNN
F 3 "https://www.murata.com/en-us/products/productdata/8796738650142/ENFA0003.pdf" H 19650 10300 60  0001 L CNN
F 4 "490-1037-1-ND" H 19650 10400 60  0001 L CNN "Digi-Key_PN"
F 5 "BLM18PG121SN1D" H 19650 10500 60  0001 L CNN "MPN"
F 6 "Filters" H 19650 10600 60  0001 L CNN "Category"
F 7 "Ferrite Beads and Chips" H 19650 10700 60  0001 L CNN "Family"
F 8 "https://www.murata.com/en-us/products/productdata/8796738650142/ENFA0003.pdf" H 19650 10800 60  0001 L CNN "DK_Datasheet_Link"
F 9 "/product-detail/en/murata-electronics-north-america/BLM18PG121SN1D/490-1037-1-ND/584485" H 19650 10900 60  0001 L CNN "DK_Detail_Page"
F 10 "FERRITE BEAD 120 OHM 0603 1LN" H 19650 11000 60  0001 L CNN "Description"
F 11 "Murata Electronics North America" H 19650 11100 60  0001 L CNN "Manufacturer"
F 12 "Active" H 19650 11200 60  0001 L CNN "Status"
	1    19450 10000
	1    0    0    -1  
$EndComp
Wire Wire Line
	19650 10000 19750 10000
Connection ~ 19750 10000
Wire Wire Line
	19100 10000 19250 10000
Wire Wire Line
	19100 10300 19750 10300
Connection ~ 19750 10300
Wire Wire Line
	19100 10000 18950 10000
Wire Wire Line
	18950 10000 18950 8150
Connection ~ 19100 10000
Connection ~ 18950 8150
Wire Wire Line
	18950 8150 20550 8150
$Comp
L power:GND #PWR054
U 1 1 6555A6BC
P 19000 10300
F 0 "#PWR054" H 19000 10050 50  0001 C CNN
F 1 "GND" V 19005 10172 50  0000 R CNN
F 2 "" H 19000 10300 50  0001 C CNN
F 3 "" H 19000 10300 50  0001 C CNN
	1    19000 10300
	0    1    1    0   
$EndComp
Wire Wire Line
	19100 10300 19000 10300
Connection ~ 19100 10300
Wire Notes Line
	16200 7700 21950 7700
Wire Notes Line
	21950 7700 21950 10850
Wire Notes Line
	21950 10850 16200 10850
Wire Notes Line
	16200 10850 16200 7700
Text Notes 16200 7650 0    50   ~ 0
USB\n
NoConn ~ 19650 2750
NoConn ~ 20450 2750
$Comp
L power:PWR_FLAG #FLG0101
U 1 1 6582A2E5
P 14350 9350
F 0 "#FLG0101" H 14350 9425 50  0001 C CNN
F 1 "PWR_FLAG" V 14350 9478 50  0000 L CNN
F 2 "" H 14350 9350 50  0001 C CNN
F 3 "~" H 14350 9350 50  0001 C CNN
	1    14350 9350
	0    1    1    0   
$EndComp
Wire Wire Line
	14350 9350 14250 9350
Wire Wire Line
	14250 9250 14250 9350
Connection ~ 14250 9350
Wire Wire Line
	4050 10500 3400 10500
Wire Wire Line
	4050 10500 4050 10750
Wire Wire Line
	4000 10600 3400 10600
Wire Wire Line
	4000 10600 4000 10850
$Comp
L power:PWR_FLAG #FLG0102
U 1 1 6593A8E4
P 14350 7750
F 0 "#FLG0102" H 14350 7825 50  0001 C CNN
F 1 "PWR_FLAG" V 14350 7878 50  0000 L CNN
F 2 "" H 14350 7750 50  0001 C CNN
F 3 "~" H 14350 7750 50  0001 C CNN
	1    14350 7750
	0    1    1    0   
$EndComp
Wire Wire Line
	14350 7750 14250 7750
Wire Wire Line
	14250 7750 14250 7650
Connection ~ 14250 7750
$Comp
L dk_Transistors-FETs-MOSFETs-Arrays:2N7002DW Q1
U 1 1 602FE28C
P 12750 10150
F 0 "Q1" H 12750 10637 60  0000 C CNN
F 1 "2N7002DW" H 12750 10531 60  0000 C CNN
F 2 "digikey-footprints:SOT-363" H 12950 10350 60  0001 L CNN
F 3 "https://www.onsemi.com/pub/Collateral/2N7002DW-D.PDF" H 12950 10450 60  0001 L CNN
F 4 "2N7002DWCT-ND" H 12950 10550 60  0001 L CNN "Digi-Key_PN"
F 5 "2N7002DW" H 12950 10650 60  0001 L CNN "MPN"
F 6 "Discrete Semiconductor Products" H 12950 10750 60  0001 L CNN "Category"
F 7 "Transistors - FETs, MOSFETs - Arrays" H 12950 10850 60  0001 L CNN "Family"
F 8 "https://www.onsemi.com/pub/Collateral/2N7002DW-D.PDF" H 12950 10950 60  0001 L CNN "DK_Datasheet_Link"
F 9 "/product-detail/en/on-semiconductor/2N7002DW/2N7002DWCT-ND/1785790" H 12950 11050 60  0001 L CNN "DK_Detail_Page"
F 10 "MOSFET 2N-CH 60V 0.115A SC70-6" H 12950 11150 60  0001 L CNN "Description"
F 11 "ON Semiconductor" H 12950 11250 60  0001 L CNN "Manufacturer"
F 12 "Active" H 12950 11350 60  0001 L CNN "Status"
	1    12750 10150
	1    0    0    -1  
$EndComp
Text Label 12350 10250 2    50   ~ 0
G2
Wire Wire Line
	12350 10250 12450 10250
Text Label 13150 10250 0    50   ~ 0
G1
Text Label 13150 10550 0    50   ~ 0
S1
Text Label 12350 9950 2    50   ~ 0
S2
Text Label 13150 9950 0    50   ~ 0
D2
Text Label 12350 10550 2    50   ~ 0
D1
Wire Wire Line
	12350 10550 12450 10550
Wire Wire Line
	12350 9950 12450 9950
Wire Wire Line
	13050 9950 13150 9950
Wire Wire Line
	13050 10250 13150 10250
Wire Wire Line
	13150 10550 13050 10550
Text Label 11100 8500 3    50   ~ 0
D1
Text Label 10800 8800 0    50   ~ 0
G1
Text Label 11100 8900 1    50   ~ 0
S1
Text Label 11100 9600 3    50   ~ 0
D2
Text Label 11100 10000 1    50   ~ 0
S2
Text Label 10800 9900 0    50   ~ 0
G2
$Comp
L Regulator_Linear:TLV75533PDRV U10
U 1 1 606121D3
P 20350 4750
F 0 "U10" H 20350 5092 50  0000 C CNN
F 1 "TLV75533PDRV" H 20350 5001 50  0000 C CNN
F 2 "Package_SON:WSON-6-1EP_2x2mm_P0.65mm_EP1x1.6mm" H 20350 5075 50  0001 C CIN
F 3 "http://www.ti.com/lit/ds/symlink/tlv755p.pdf" H 20350 4800 50  0001 C CNN
	1    20350 4750
	1    0    0    -1  
$EndComp
Wire Wire Line
	20750 5300 20750 5200
$Comp
L power:GND #PWR059
U 1 1 63DC2842
P 20750 5300
F 0 "#PWR059" H 20750 5050 50  0001 C CNN
F 1 "GND" H 20755 5127 50  0000 C CNN
F 2 "" H 20750 5300 50  0001 C CNN
F 3 "" H 20750 5300 50  0001 C CNN
	1    20750 5300
	-1   0    0    -1  
$EndComp
Wire Wire Line
	20750 4650 20650 4650
Connection ~ 20750 4650
Wire Wire Line
	20750 4900 20750 4650
$Comp
L Device:C C20
U 1 1 63D92902
P 20750 5050
F 0 "C20" H 20865 5096 50  0000 L CNN
F 1 "2.2uF" H 20865 5005 50  0000 L CNN
F 2 "Capacitor_SMD:C_0603_1608Metric" H 20788 4900 50  0001 C CNN
F 3 "~" H 20750 5050 50  0001 C CNN
	1    20750 5050
	-1   0    0    -1  
$EndComp
Wire Wire Line
	20850 4650 20750 4650
$Comp
L power:+3V3 #PWR057
U 1 1 63D62A50
P 20850 4650
F 0 "#PWR057" H 20850 4500 50  0001 C CNN
F 1 "+3V3" V 20865 4778 50  0000 L CNN
F 2 "" H 20850 4650 50  0001 C CNN
F 3 "" H 20850 4650 50  0001 C CNN
	1    20850 4650
	0    1    -1   0   
$EndComp
Wire Wire Line
	20050 4750 19950 4750
Connection ~ 19950 4750
Wire Wire Line
	19950 4750 19950 4650
$Comp
L Device:C C26
U 1 1 607A878E
P 15750 3750
F 0 "C26" H 15865 3796 50  0000 L CNN
F 1 "0.1uF" H 15865 3705 50  0000 L CNN
F 2 "Capacitor_SMD:C_0603_1608Metric" H 15788 3600 50  0001 C CNN
F 3 "~" H 15750 3750 50  0001 C CNN
	1    15750 3750
	1    0    0    -1  
$EndComp
$Comp
L power:GND #PWR0101
U 1 1 607A929D
P 15750 3500
F 0 "#PWR0101" H 15750 3250 50  0001 C CNN
F 1 "GND" H 15755 3327 50  0000 C CNN
F 2 "" H 15750 3500 50  0001 C CNN
F 3 "" H 15750 3500 50  0001 C CNN
	1    15750 3500
	-1   0    0    1   
$EndComp
Wire Wire Line
	15750 3500 15750 3600
Wire Wire Line
	15750 3900 15750 4000
Connection ~ 15750 4000
$Comp
L Device:C C24
U 1 1 60832609
P 12600 3650
F 0 "C24" H 12715 3696 50  0000 L CNN
F 1 "0.1uF" H 12715 3605 50  0000 L CNN
F 2 "Capacitor_SMD:C_0603_1608Metric" H 12638 3500 50  0001 C CNN
F 3 "~" H 12600 3650 50  0001 C CNN
	1    12600 3650
	1    0    0    -1  
$EndComp
Wire Wire Line
	12600 3800 12600 3900
$Comp
L power:GND #PWR0102
U 1 1 6087724D
P 12600 3400
F 0 "#PWR0102" H 12600 3150 50  0001 C CNN
F 1 "GND" H 12605 3227 50  0000 C CNN
F 2 "" H 12600 3400 50  0001 C CNN
F 3 "" H 12600 3400 50  0001 C CNN
	1    12600 3400
	-1   0    0    1   
$EndComp
Wire Wire Line
	12600 3400 12600 3500
Wire Wire Line
	13450 2800 13550 2800
$Comp
L Device:C C25
U 1 1 60907DFA
P 13550 2550
F 0 "C25" H 13665 2596 50  0000 L CNN
F 1 "0.1uF" H 13665 2505 50  0000 L CNN
F 2 "Capacitor_SMD:C_0603_1608Metric" H 13588 2400 50  0001 C CNN
F 3 "~" H 13550 2550 50  0001 C CNN
	1    13550 2550
	1    0    0    -1  
$EndComp
Wire Wire Line
	13550 2700 13550 2800
Connection ~ 13550 2800
Wire Wire Line
	13550 2800 13650 2800
$Comp
L power:GND #PWR0103
U 1 1 6094DADA
P 13550 2300
F 0 "#PWR0103" H 13550 2050 50  0001 C CNN
F 1 "GND" H 13555 2127 50  0000 C CNN
F 2 "" H 13550 2300 50  0001 C CNN
F 3 "" H 13550 2300 50  0001 C CNN
	1    13550 2300
	-1   0    0    1   
$EndComp
Wire Wire Line
	13550 2300 13550 2400
$Comp
L Connector_Generic:Conn_01x04 J4
U 1 1 60A91AFB
P 9000 4100
F 0 "J4" H 9080 4092 50  0000 L CNN
F 1 "Conn_01x04" H 9080 4001 50  0000 L CNN
F 2 "Connector_PinHeader_2.54mm:PinHeader_1x04_P2.54mm_Vertical" H 9000 4100 50  0001 C CNN
F 3 "~" H 9000 4100 50  0001 C CNN
	1    9000 4100
	1    0    0    -1  
$EndComp
$Comp
L Connector_Generic:Conn_01x04 J5
U 1 1 60B6873F
P 9000 5500
F 0 "J5" H 9080 5492 50  0000 L CNN
F 1 "Conn_01x04" H 9080 5401 50  0000 L CNN
F 2 "Connector_PinHeader_2.54mm:PinHeader_1x04_P2.54mm_Vertical" H 9000 5500 50  0001 C CNN
F 3 "~" H 9000 5500 50  0001 C CNN
	1    9000 5500
	1    0    0    -1  
$EndComp
Text Label 8700 5600 2    50   ~ 0
TELEM2_RX
$EndSCHEMATC
