(footprint "LOGO" (version 20210606) (generator bitmap2component) (layer "F.Cu")
  (at 0 0)
(attr board_only exclude_from_pos_files exclude_from_bom)
 (fp_text reference "G***" (at 0 0) (layer F.SilkS)
  (effects (font (thickness 0.3)))
  )
  (fp_text value "LOGO" (at 0.75 0) (layer F.SilkS) hide
  (effects (font (thickness 0.3)))
  )
  (fp_poly (pts (xy -5.740952 -0.280856) (xy -5.690476 -0.280308) (xy -5.650472 -0.279755) (xy -5.619415 -0.279068) (xy -5.595778 -0.278119) (xy -5.578034 -0.276780) (xy -5.564656 -0.274922) (xy -5.554117 -0.272417)
     (xy -5.544891 -0.269137) (xy -5.535450 -0.264954) (xy -5.531917 -0.263302) (xy -5.493448 -0.239722) (xy -5.462111 -0.209184) (xy -5.440499 -0.174550) (xy -5.431101 -0.143160) (xy -5.427411 -0.106599)
     (xy -5.429441 -0.069681) (xy -5.437200 -0.037217) (xy -5.440203 -0.030003) (xy -5.456399 -0.003584) (xy -5.478801 0.022378) (xy -5.503470 0.043684) (xy -5.517435 0.052341) (xy -5.530268 0.059110)
     (xy -5.537408 0.063286) (xy -5.537630 0.063462) (xy -5.535716 0.069465) (xy -5.528220 0.085434) (xy -5.515407 0.110852) (xy -5.497543 0.145205) (xy -5.474894 0.187978) (xy -5.447725 0.238656)
     (xy -5.438086 0.256520) (xy -5.411338 0.306024) (xy -5.479387 0.305879) (xy -5.547437 0.305734) (xy -5.605214 0.193370) (xy -5.662990 0.081006) (xy -5.793457 0.081006) (xy -5.795089 0.193515)
     (xy -5.796722 0.306024) (xy -5.916466 0.306024) (xy -5.916466 -0.180014) (xy -5.796457 -0.180014) (xy -5.796457 -0.018002) (xy -5.707950 -0.018133) (xy -5.671355 -0.018430) (xy -5.644378 -0.019357)
     (xy -5.624645 -0.021153) (xy -5.609780 -0.024060) (xy -5.597406 -0.028320) (xy -5.594339 -0.029663) (xy -5.569872 -0.046600) (xy -5.555108 -0.070484) (xy -5.550437 -0.099008) (xy -5.555616 -0.128898)
     (xy -5.570881 -0.152446) (xy -5.594339 -0.168353) (xy -5.606456 -0.173000) (xy -5.620454 -0.176232) (xy -5.638709 -0.178291) (xy -5.663597 -0.179417) (xy -5.697493 -0.179853) (xy -5.707950 -0.179883)
     (xy -5.796457 -0.180014) (xy -5.916466 -0.180014) (xy -5.916466 -0.282689) )(layer F.SilkS) (width  0.000000)
  )
  (fp_poly (pts (xy -4.890385 -0.180014) (xy -5.220411 -0.180014) (xy -5.220411 -0.042004) (xy -5.004394 -0.042004) (xy -5.004394 0.060004) (xy -5.220411 0.060004) (xy -5.220411 0.204016) (xy -4.884385 0.204016)
     (xy -4.884385 0.306024) (xy -5.346421 0.306024) (xy -5.346421 -0.282022) (xy -4.890385 -0.282022) )(layer F.SilkS) (width  0.000000)
  )
  (fp_poly (pts (xy -4.629397 -0.050987) (xy -4.610123 -0.001528) (xy -4.592085 0.044093) (xy -4.575751 0.084737) (xy -4.561593 0.119264) (xy -4.550080 0.146537) (xy -4.541681 0.165415) (xy -4.536866 0.174760)
     (xy -4.535971 0.175531) (xy -4.532963 0.169136) (xy -4.526061 0.152773) (xy -4.515754 0.127651) (xy -4.502528 0.094973) (xy -4.486870 0.055947) (xy -4.469267 0.011777) (xy -4.450207 -0.036328)
     (xy -4.442646 -0.055485) (xy -4.353343 -0.281983) (xy -4.291838 -0.282003) (xy -4.266318 -0.281603) (xy -4.245982 -0.280506) (xy -4.233333 -0.278897) (xy -4.230394 -0.277522) (xy -4.232628 -0.271264)
     (xy -4.239023 -0.254969) (xy -4.249151 -0.229686) (xy -4.262586 -0.196469) (xy -4.278900 -0.156369) (xy -4.297665 -0.110437) (xy -4.318456 -0.059724) (xy -4.340844 -0.005283) (xy -4.349203 0.015001)
     (xy -4.467952 0.303024) (xy -4.611952 0.306374) (xy -4.726951 0.022677) (xy -4.749407 -0.032738) (xy -4.770562 -0.084982) (xy -4.789976 -0.132961) (xy -4.807206 -0.175580) (xy -4.821811 -0.211746)
     (xy -4.833347 -0.240364) (xy -4.841373 -0.260339) (xy -4.845447 -0.270578) (xy -4.845808 -0.271522) (xy -4.846540 -0.276135) (xy -4.843399 -0.279162) (xy -4.834458 -0.280933) (xy -4.817792 -0.281775)
     (xy -4.791475 -0.282017) (xy -4.784234 -0.282022) (xy -4.718802 -0.282022) )(layer F.SilkS) (width  0.000000)
  )
  (fp_poly (pts (xy -3.946425 -0.289324) (xy -3.901405 -0.279216) (xy -3.861349 -0.260830) (xy -3.831261 -0.237294) (xy -3.806385 -0.206226) (xy -3.791880 -0.172143) (xy -3.786892 -0.132686) (xy -3.787312 -0.115824)
     (xy -3.789145 -0.095108) (xy -3.792617 -0.076512) (xy -3.798619 -0.058716) (xy -3.808040 -0.040396) (xy -3.821768 -0.020232) (xy -3.840693 0.003099) (xy -3.865704 0.030919) (xy -3.897691 0.064549)
     (xy -3.932813 0.100508) (xy -4.046409 0.216017) (xy -3.774298 0.216017) (xy -3.774298 0.306024) (xy -4.188330 0.306024) (xy -4.188330 0.233056) (xy -4.052204 0.092972) (xy -4.018697 0.058218)
     (xy -3.987524 0.025367) (xy -3.959784 -0.004385) (xy -3.936574 -0.029839) (xy -3.918993 -0.049799) (xy -3.908140 -0.063065) (xy -3.905444 -0.067060) (xy -3.898555 -0.086729) (xy -3.894828 -0.111076)
     (xy -3.894559 -0.118048) (xy -3.895486 -0.138296) (xy -3.900005 -0.152083) (xy -3.910104 -0.164843) (xy -3.912624 -0.167405) (xy -3.939662 -0.186380) (xy -3.972044 -0.195877) (xy -4.007996 -0.196080)
     (xy -4.045747 -0.187175) (xy -4.083525 -0.169347) (xy -4.115673 -0.146178) (xy -4.130242 -0.135189) (xy -4.141361 -0.129500) (xy -4.145603 -0.129705) (xy -4.151457 -0.136783) (xy -4.162507 -0.150260)
     (xy -4.176373 -0.167230) (xy -4.176498 -0.167384) (xy -4.202906 -0.199756) (xy -4.180532 -0.219097) (xy -4.138745 -0.248920) (xy -4.092571 -0.270951) (xy -4.043879 -0.285094) (xy -3.994540 -0.291251)
     )(layer F.SilkS) (width  0.000000)
  )
)
