(kicad_symbol_lib (version 20211014) (generator kicad_symbol_editor)
  (symbol "ESP8285" (pin_names (offset 1.016)) (in_bom yes) (on_board yes)
    (property "Reference" "U" (id 0) (at -15.24 34.29 0)
      (effects (font (size 1.27 1.27)) (justify left bottom))
    )
    (property "Value" "ESP8285" (id 1) (at -15.24 -34.29 0)
      (effects (font (size 1.27 1.27)) (justify left bottom))
    )
    (property "Footprint" "QFN50P500X500X90-33N" (id 2) (at 0 0 0)
      (effects (font (size 1.27 1.27)) (justify left bottom) hide)
    )
    (property "Datasheet" "" (id 3) (at 0 0 0)
      (effects (font (size 1.27 1.27)) (justify left bottom) hide)
    )
    (property "PACKAGE_TYPE" "" (id 4) (at 0 0 0)
      (effects (font (size 1.27 1.27)) (justify left bottom) hide)
    )
    (property "DMIN" "" (id 5) (at 0 0 0)
      (effects (font (size 1.27 1.27)) (justify left bottom) hide)
    )
    (property "B_MAX" "0.3" (id 6) (at 0 0 0)
      (effects (font (size 1.27 1.27)) (justify left bottom) hide)
    )
    (property "DMAX" "" (id 7) (at 0 0 0)
      (effects (font (size 1.27 1.27)) (justify left bottom) hide)
    )
    (property "D_NOM" "5.0" (id 8) (at 0 0 0)
      (effects (font (size 1.27 1.27)) (justify left bottom) hide)
    )
    (property "PINS" "" (id 9) (at 0 0 0)
      (effects (font (size 1.27 1.27)) (justify left bottom) hide)
    )
    (property "THERMAL_PAD" "" (id 10) (at 0 0 0)
      (effects (font (size 1.27 1.27)) (justify left bottom) hide)
    )
    (property "STANDARD" "IPC 7351B" (id 11) (at 0 0 0)
      (effects (font (size 1.27 1.27)) (justify left bottom) hide)
    )
    (property "B_MIN" "0.2" (id 12) (at 0 0 0)
      (effects (font (size 1.27 1.27)) (justify left bottom) hide)
    )
    (property "MANUFACTURER" "Espressif" (id 13) (at 0 0 0)
      (effects (font (size 1.27 1.27)) (justify left bottom) hide)
    )
    (property "D2_NOM" "3.7" (id 14) (at 0 0 0)
      (effects (font (size 1.27 1.27)) (justify left bottom) hide)
    )
    (property "E_MAX" "5.05" (id 15) (at 0 0 0)
      (effects (font (size 1.27 1.27)) (justify left bottom) hide)
    )
    (property "L_MIN" "0.35" (id 16) (at 0 0 0)
      (effects (font (size 1.27 1.27)) (justify left bottom) hide)
    )
    (property "EMIN" "" (id 17) (at 0 0 0)
      (effects (font (size 1.27 1.27)) (justify left bottom) hide)
    )
    (property "E_NOM" "5.0" (id 18) (at 0 0 0)
      (effects (font (size 1.27 1.27)) (justify left bottom) hide)
    )
    (property "VACANCIES" "" (id 19) (at 0 0 0)
      (effects (font (size 1.27 1.27)) (justify left bottom) hide)
    )
    (property "ENOM" "0.5" (id 20) (at 0 0 0)
      (effects (font (size 1.27 1.27)) (justify left bottom) hide)
    )
    (property "L_NOM" "0.4" (id 21) (at 0 0 0)
      (effects (font (size 1.27 1.27)) (justify left bottom) hide)
    )
    (property "PIN_COUNT_D" "8.0" (id 22) (at 0 0 0)
      (effects (font (size 1.27 1.27)) (justify left bottom) hide)
    )
    (property "PIN_COUNT_E" "8.0" (id 23) (at 0 0 0)
      (effects (font (size 1.27 1.27)) (justify left bottom) hide)
    )
    (property "JEDEC" "" (id 24) (at 0 0 0)
      (effects (font (size 1.27 1.27)) (justify left bottom) hide)
    )
    (property "SNAPEDA_PACKAGE_ID" "" (id 25) (at 0 0 0)
      (effects (font (size 1.27 1.27)) (justify left bottom) hide)
    )
    (property "E_MIN" "4.95" (id 26) (at 0 0 0)
      (effects (font (size 1.27 1.27)) (justify left bottom) hide)
    )
    (property "L_MAX" "0.45" (id 27) (at 0 0 0)
      (effects (font (size 1.27 1.27)) (justify left bottom) hide)
    )
    (property "D_MIN" "4.95" (id 28) (at 0 0 0)
      (effects (font (size 1.27 1.27)) (justify left bottom) hide)
    )
    (property "IPC" "" (id 29) (at 0 0 0)
      (effects (font (size 1.27 1.27)) (justify left bottom) hide)
    )
    (property "B_NOM" "0.25" (id 30) (at 0 0 0)
      (effects (font (size 1.27 1.27)) (justify left bottom) hide)
    )
    (property "EMAX" "" (id 31) (at 0 0 0)
      (effects (font (size 1.27 1.27)) (justify left bottom) hide)
    )
    (property "PIN_COLUMNS" "" (id 32) (at 0 0 0)
      (effects (font (size 1.27 1.27)) (justify left bottom) hide)
    )
    (property "BALL_COLUMNS" "" (id 33) (at 0 0 0)
      (effects (font (size 1.27 1.27)) (justify left bottom) hide)
    )
    (property "BODY_DIAMETER" "" (id 34) (at 0 0 0)
      (effects (font (size 1.27 1.27)) (justify left bottom) hide)
    )
    (property "E2_NOM" "3.7" (id 35) (at 0 0 0)
      (effects (font (size 1.27 1.27)) (justify left bottom) hide)
    )
    (property "BALL_ROWS" "" (id 36) (at 0 0 0)
      (effects (font (size 1.27 1.27)) (justify left bottom) hide)
    )
    (property "PARTREV" "2.0" (id 37) (at 0 0 0)
      (effects (font (size 1.27 1.27)) (justify left bottom) hide)
    )
    (property "DNOM" "" (id 38) (at 0 0 0)
      (effects (font (size 1.27 1.27)) (justify left bottom) hide)
    )
    (property "D_MAX" "5.05" (id 39) (at 0 0 0)
      (effects (font (size 1.27 1.27)) (justify left bottom) hide)
    )
    (property "A_MAX" "0.9" (id 40) (at 0 0 0)
      (effects (font (size 1.27 1.27)) (justify left bottom) hide)
    )
    (property "ki_locked" "" (id 41) (at 0 0 0)
      (effects (font (size 1.27 1.27)))
    )
    (symbol "ESP8285_0_0"
      (rectangle (start -15.24 -33.02) (end 15.24 33.02)
        (stroke (width 0.254) (type default) (color 0 0 0 0))
        (fill (type background))
      )
      (pin power_in line (at 20.32 27.94 180) (length 5.08)
        (name "VDDA" (effects (font (size 1.016 1.016))))
        (number "1" (effects (font (size 1.016 1.016))))
      )
      (pin bidirectional line (at -20.32 -7.62 0) (length 5.08)
        (name "MTDI" (effects (font (size 1.016 1.016))))
        (number "10" (effects (font (size 1.016 1.016))))
      )
      (pin power_in line (at 20.32 22.86 180) (length 5.08)
        (name "VDDPST" (effects (font (size 1.016 1.016))))
        (number "11" (effects (font (size 1.016 1.016))))
      )
      (pin bidirectional clock (at -20.32 -10.16 0) (length 5.08)
        (name "MTCK" (effects (font (size 1.016 1.016))))
        (number "12" (effects (font (size 1.016 1.016))))
      )
      (pin bidirectional line (at -20.32 -12.7 0) (length 5.08)
        (name "MTDO" (effects (font (size 1.016 1.016))))
        (number "13" (effects (font (size 1.016 1.016))))
      )
      (pin bidirectional line (at -20.32 -20.32 0) (length 5.08)
        (name "GPIO2" (effects (font (size 1.016 1.016))))
        (number "14" (effects (font (size 1.016 1.016))))
      )
      (pin bidirectional line (at -20.32 -17.78 0) (length 5.08)
        (name "GPIO0" (effects (font (size 1.016 1.016))))
        (number "15" (effects (font (size 1.016 1.016))))
      )
      (pin bidirectional line (at -20.32 -22.86 0) (length 5.08)
        (name "GPIO4" (effects (font (size 1.016 1.016))))
        (number "16" (effects (font (size 1.016 1.016))))
      )
      (pin power_in line (at 20.32 22.86 180) (length 5.08)
        (name "VDDPST" (effects (font (size 1.016 1.016))))
        (number "17" (effects (font (size 1.016 1.016))))
      )
      (pin bidirectional line (at 20.32 -17.78 180) (length 5.08)
        (name "SD_DATA_2" (effects (font (size 1.016 1.016))))
        (number "18" (effects (font (size 1.016 1.016))))
      )
      (pin bidirectional line (at 20.32 -20.32 180) (length 5.08)
        (name "SD_DATA_3" (effects (font (size 1.016 1.016))))
        (number "19" (effects (font (size 1.016 1.016))))
      )
      (pin bidirectional line (at 20.32 -25.4 180) (length 5.08)
        (name "LNA" (effects (font (size 1.016 1.016))))
        (number "2" (effects (font (size 1.016 1.016))))
      )
      (pin bidirectional line (at 20.32 -10.16 180) (length 5.08)
        (name "SD_CMD" (effects (font (size 1.016 1.016))))
        (number "20" (effects (font (size 1.016 1.016))))
      )
      (pin bidirectional clock (at 20.32 -7.62 180) (length 5.08)
        (name "SD_CLK" (effects (font (size 1.016 1.016))))
        (number "21" (effects (font (size 1.016 1.016))))
      )
      (pin bidirectional line (at 20.32 -12.7 180) (length 5.08)
        (name "SD_DATA_0" (effects (font (size 1.016 1.016))))
        (number "22" (effects (font (size 1.016 1.016))))
      )
      (pin bidirectional line (at 20.32 -15.24 180) (length 5.08)
        (name "SD_DATA_1" (effects (font (size 1.016 1.016))))
        (number "23" (effects (font (size 1.016 1.016))))
      )
      (pin bidirectional line (at -20.32 -25.4 0) (length 5.08)
        (name "GPIO5" (effects (font (size 1.016 1.016))))
        (number "24" (effects (font (size 1.016 1.016))))
      )
      (pin bidirectional line (at 20.32 -2.54 180) (length 5.08)
        (name "U0RXD" (effects (font (size 1.016 1.016))))
        (number "25" (effects (font (size 1.016 1.016))))
      )
      (pin bidirectional line (at 20.32 0 180) (length 5.08)
        (name "U0TXD" (effects (font (size 1.016 1.016))))
        (number "26" (effects (font (size 1.016 1.016))))
      )
      (pin output line (at 20.32 7.62 180) (length 5.08)
        (name "XTAL_OUT" (effects (font (size 1.016 1.016))))
        (number "27" (effects (font (size 1.016 1.016))))
      )
      (pin input line (at 20.32 5.08 180) (length 5.08)
        (name "XTAL_IN" (effects (font (size 1.016 1.016))))
        (number "28" (effects (font (size 1.016 1.016))))
      )
      (pin power_in line (at 20.32 30.48 180) (length 5.08)
        (name "VDDD" (effects (font (size 1.016 1.016))))
        (number "29" (effects (font (size 1.016 1.016))))
      )
      (pin power_in line (at 20.32 25.4 180) (length 5.08)
        (name "VDD3P3" (effects (font (size 1.016 1.016))))
        (number "3" (effects (font (size 1.016 1.016))))
      )
      (pin power_in line (at 20.32 27.94 180) (length 5.08)
        (name "VDDA" (effects (font (size 1.016 1.016))))
        (number "30" (effects (font (size 1.016 1.016))))
      )
      (pin input line (at -20.32 10.16 0) (length 5.08)
        (name "RES12K" (effects (font (size 1.016 1.016))))
        (number "31" (effects (font (size 1.016 1.016))))
      )
      (pin input line (at -20.32 5.08 0) (length 5.08)
        (name "~{EXT_RST}" (effects (font (size 1.016 1.016))))
        (number "32" (effects (font (size 1.016 1.016))))
      )
      (pin power_in line (at 20.32 -30.48 180) (length 5.08)
        (name "GND" (effects (font (size 1.016 1.016))))
        (number "33" (effects (font (size 1.016 1.016))))
      )
      (pin power_in line (at 20.32 25.4 180) (length 5.08)
        (name "VDD3P3" (effects (font (size 1.016 1.016))))
        (number "4" (effects (font (size 1.016 1.016))))
      )
      (pin power_in line (at 20.32 20.32 180) (length 5.08)
        (name "VDD_RTC" (effects (font (size 1.016 1.016))))
        (number "5" (effects (font (size 1.016 1.016))))
      )
      (pin output line (at 20.32 12.7 180) (length 5.08)
        (name "TOUT" (effects (font (size 1.016 1.016))))
        (number "6" (effects (font (size 1.016 1.016))))
      )
      (pin input line (at -20.32 12.7 0) (length 5.08)
        (name "CHIP_EN" (effects (font (size 1.016 1.016))))
        (number "7" (effects (font (size 1.016 1.016))))
      )
      (pin bidirectional line (at -20.32 0 0) (length 5.08)
        (name "XPD_DCDC" (effects (font (size 1.016 1.016))))
        (number "8" (effects (font (size 1.016 1.016))))
      )
      (pin bidirectional clock (at -20.32 -5.08 0) (length 5.08)
        (name "MTMS" (effects (font (size 1.016 1.016))))
        (number "9" (effects (font (size 1.016 1.016))))
      )
    )
  )
)
