
(module PQFN50P200X200X80-10N (layer F.Cu) (tedit 6269E49D)
  (descr "")
  (fp_text reference REF** (at 0.0267225 -1.8061365 0) (layer F.SilkS)
    (effects (font (size 0.481065354331 0.481065354331) (thickness 0.15)))
  )
  (fp_text value PQFN50P200X200X80-10N (at 4.927009 1.797391 0) (layer F.Fab)
    (effects (font (size 0.482155905512 0.482155905512) (thickness 0.15)))
  )
  (pad 1 smd roundrect (roundrect_rratio 0.04) (at -0.78 -0.25) (size 0.42 0.35) (layers F.Cu F.Mask F.Paste))
  (pad 2 smd roundrect (roundrect_rratio 0.04) (at -0.78 0.25) (size 0.42 0.35) (layers F.Cu F.Mask F.Paste))
  (pad 3 smd roundrect (roundrect_rratio 0.04) (at -0.5 0.78 90.0) (size 0.42 0.35) (layers F.Cu F.Mask F.Paste))
  (pad 4 smd roundrect (roundrect_rratio 0.04) (at 0.0 0.78 90.0) (size 0.42 0.35) (layers F.Cu F.Mask F.Paste))
  (pad 5 smd roundrect (roundrect_rratio 0.04) (at 0.5 0.78 90.0) (size 0.42 0.35) (layers F.Cu F.Mask F.Paste))
  (pad 6 smd roundrect (roundrect_rratio 0.04) (at 0.78 0.25) (size 0.42 0.35) (layers F.Cu F.Mask F.Paste))
  (pad 7 smd roundrect (roundrect_rratio 0.04) (at 0.78 -0.25) (size 0.42 0.35) (layers F.Cu F.Mask F.Paste))
  (pad 8 smd roundrect (roundrect_rratio 0.04) (at 0.5 -0.78 90.0) (size 0.42 0.35) (layers F.Cu F.Mask F.Paste))
  (pad 9 smd roundrect (roundrect_rratio 0.04) (at 0.0 -0.78 90.0) (size 0.42 0.35) (layers F.Cu F.Mask F.Paste))
  (pad 10 smd roundrect (roundrect_rratio 0.04) (at -0.5 -0.78 90.0) (size 0.42 0.35) (layers F.Cu F.Mask F.Paste))
  (fp_line (start -1.05 -1.05) (end 1.05 -1.05) (layer F.Fab) (width 0.127))
  (fp_line (start 1.05 -1.05) (end 1.05 1.05) (layer F.Fab) (width 0.127))
  (fp_line (start 1.05 1.05) (end -1.05 1.05) (layer F.Fab) (width 0.127))
  (fp_line (start -1.05 1.05) (end -1.05 -1.05) (layer F.Fab) (width 0.127))
  (fp_line (start -1.05 -0.61) (end -1.05 -1.05) (layer F.SilkS) (width 0.127))
  (fp_line (start -1.05 -1.05) (end -0.86 -1.05) (layer F.SilkS) (width 0.127))
  (fp_line (start 0.86 -1.05) (end 1.05 -1.05) (layer F.SilkS) (width 0.127))
  (fp_line (start 1.05 -1.05) (end 1.05 -0.61) (layer F.SilkS) (width 0.127))
  (fp_line (start -1.05 0.61) (end -1.05 1.05) (layer F.SilkS) (width 0.127))
  (fp_line (start -1.05 1.05) (end -0.86 1.05) (layer F.SilkS) (width 0.127))
  (fp_line (start 0.86 1.05) (end 1.05 1.05) (layer F.SilkS) (width 0.127))
  (fp_line (start 1.05 1.05) (end 1.05 0.61) (layer F.SilkS) (width 0.127))
  (fp_line (start -1.24 -1.24) (end 1.24 -1.24) (layer F.CrtYd) (width 0.05))
  (fp_line (start 1.24 -1.24) (end 1.24 1.24) (layer F.CrtYd) (width 0.05))
  (fp_line (start 1.24 1.24) (end -1.24 1.24) (layer F.CrtYd) (width 0.05))
  (fp_line (start -1.24 1.24) (end -1.24 -1.24) (layer F.CrtYd) (width 0.05))
  (fp_circle (center -1.3 -0.25) (end -1.25 -0.25) (layer F.SilkS) (width 0.1))
  (fp_circle (center -0.75 -0.25) (end -0.7 -0.25) (layer F.Fab) (width 0.1))
)