
(module HRS_DF40C-40DP-0.4V_51_ (layer F.Cu) (tedit 62BD2E25)
  (descr "")
  (fp_text reference REF** (at -1.625 -2.735 0) (layer F.SilkS)
    (effects (font (size 1.0 1.0) (thickness 0.15)))
  )
  (fp_text value HRS_DF40C-40DP-0.4V_51_ (at 9.805 3.065 0) (layer F.Fab)
    (effects (font (size 1.0 1.0) (thickness 0.15)))
  )
  (pad 1 smd rect (at -3.8 1.355) (size 0.23 0.66) (layers F.Cu F.Mask F.Paste))
  (pad 2 smd rect (at -3.8 -1.355 180.0) (size 0.23 0.66) (layers F.Cu F.Mask F.Paste))
  (pad 3 smd rect (at -3.4 1.355) (size 0.23 0.66) (layers F.Cu F.Mask F.Paste))
  (pad 4 smd rect (at -3.4 -1.355 180.0) (size 0.23 0.66) (layers F.Cu F.Mask F.Paste))
  (pad 5 smd rect (at -3.0 1.355) (size 0.23 0.66) (layers F.Cu F.Mask F.Paste))
  (pad 6 smd rect (at -3.0 -1.355 180.0) (size 0.23 0.66) (layers F.Cu F.Mask F.Paste))
  (pad 7 smd rect (at -2.6 1.355) (size 0.23 0.66) (layers F.Cu F.Mask F.Paste))
  (pad 8 smd rect (at -2.6 -1.355 180.0) (size 0.23 0.66) (layers F.Cu F.Mask F.Paste))
  (pad 9 smd rect (at -2.2 1.355) (size 0.23 0.66) (layers F.Cu F.Mask F.Paste))
  (pad 10 smd rect (at -2.2 -1.355 180.0) (size 0.23 0.66) (layers F.Cu F.Mask F.Paste))
  (pad 11 smd rect (at -1.8 1.355) (size 0.23 0.66) (layers F.Cu F.Mask F.Paste))
  (pad 12 smd rect (at -1.8 -1.355 180.0) (size 0.23 0.66) (layers F.Cu F.Mask F.Paste))
  (pad 13 smd rect (at -1.4 1.355) (size 0.23 0.66) (layers F.Cu F.Mask F.Paste))
  (pad 14 smd rect (at -1.4 -1.355 180.0) (size 0.23 0.66) (layers F.Cu F.Mask F.Paste))
  (pad 15 smd rect (at -1.0 1.355) (size 0.23 0.66) (layers F.Cu F.Mask F.Paste))
  (pad 16 smd rect (at -1.0 -1.355 180.0) (size 0.23 0.66) (layers F.Cu F.Mask F.Paste))
  (pad 17 smd rect (at -0.6 1.355) (size 0.23 0.66) (layers F.Cu F.Mask F.Paste))
  (pad 18 smd rect (at -0.6 -1.355 180.0) (size 0.23 0.66) (layers F.Cu F.Mask F.Paste))
  (pad 19 smd rect (at -0.2 1.355) (size 0.23 0.66) (layers F.Cu F.Mask F.Paste))
  (pad 20 smd rect (at -0.2 -1.355 180.0) (size 0.23 0.66) (layers F.Cu F.Mask F.Paste))
  (pad 21 smd rect (at 0.2 1.355) (size 0.23 0.66) (layers F.Cu F.Mask F.Paste))
  (pad 22 smd rect (at 0.2 -1.355 180.0) (size 0.23 0.66) (layers F.Cu F.Mask F.Paste))
  (pad 23 smd rect (at 0.6 1.355) (size 0.23 0.66) (layers F.Cu F.Mask F.Paste))
  (pad 24 smd rect (at 0.6 -1.355 180.0) (size 0.23 0.66) (layers F.Cu F.Mask F.Paste))
  (pad 25 smd rect (at 1.0 1.355) (size 0.23 0.66) (layers F.Cu F.Mask F.Paste))
  (pad 26 smd rect (at 1.0 -1.355 180.0) (size 0.23 0.66) (layers F.Cu F.Mask F.Paste))
  (pad 27 smd rect (at 1.4 1.355) (size 0.23 0.66) (layers F.Cu F.Mask F.Paste))
  (pad 28 smd rect (at 1.4 -1.355 180.0) (size 0.23 0.66) (layers F.Cu F.Mask F.Paste))
  (pad 29 smd rect (at 1.8 1.355) (size 0.23 0.66) (layers F.Cu F.Mask F.Paste))
  (pad 30 smd rect (at 1.8 -1.355 180.0) (size 0.23 0.66) (layers F.Cu F.Mask F.Paste))
  (pad 31 smd rect (at 2.2 1.355) (size 0.23 0.66) (layers F.Cu F.Mask F.Paste))
  (pad 32 smd rect (at 2.2 -1.355 180.0) (size 0.23 0.66) (layers F.Cu F.Mask F.Paste))
  (pad 33 smd rect (at 2.6 1.355) (size 0.23 0.66) (layers F.Cu F.Mask F.Paste))
  (pad 34 smd rect (at 2.6 -1.355 180.0) (size 0.23 0.66) (layers F.Cu F.Mask F.Paste))
  (pad 35 smd rect (at 3.0 1.355) (size 0.23 0.66) (layers F.Cu F.Mask F.Paste))
  (pad 36 smd rect (at 3.0 -1.355 180.0) (size 0.23 0.66) (layers F.Cu F.Mask F.Paste))
  (pad 37 smd rect (at 3.4 1.355) (size 0.23 0.66) (layers F.Cu F.Mask F.Paste))
  (pad 38 smd rect (at 3.4 -1.355 180.0) (size 0.23 0.66) (layers F.Cu F.Mask F.Paste))
  (pad 39 smd rect (at 3.8 1.355) (size 0.23 0.66) (layers F.Cu F.Mask F.Paste))
  (pad 40 smd rect (at 3.8 -1.355 180.0) (size 0.23 0.66) (layers F.Cu F.Mask F.Paste))
  (pad S2 smd rect (at -4.275 -1.355 180.0) (size 0.35 0.66) (layers F.Cu F.Mask F.Paste))
  (pad S1 smd rect (at -4.275 1.355) (size 0.35 0.66) (layers F.Cu F.Mask F.Paste))
  (pad S4 smd rect (at 4.275 -1.355 180.0) (size 0.35 0.66) (layers F.Cu F.Mask F.Paste))
  (pad S3 smd rect (at 4.275 1.355) (size 0.35 0.66) (layers F.Cu F.Mask F.Paste))
  (fp_line (start -4.76 -0.925) (end 4.76 -0.925) (layer F.Fab) (width 0.127))
  (fp_line (start 4.76 -0.925) (end 4.76 0.925) (layer F.Fab) (width 0.127))
  (fp_line (start 4.76 0.925) (end -4.76 0.925) (layer F.Fab) (width 0.127))
  (fp_line (start -4.76 0.925) (end -4.76 -0.925) (layer F.Fab) (width 0.127))
  (fp_line (start -4.76 0.925) (end -4.76 -0.925) (layer F.SilkS) (width 0.127))
  (fp_line (start 4.76 -0.925) (end 4.76 0.925) (layer F.SilkS) (width 0.127))
  (fp_circle (center -3.8 2.1) (end -3.7 2.1) (layer F.SilkS) (width 0.2))
  (fp_circle (center -3.8 2.1) (end -3.7 2.1) (layer F.Fab) (width 0.2))
  (fp_line (start -5.01 -1.935) (end 5.01 -1.935) (layer F.CrtYd) (width 0.05))
  (fp_line (start 5.01 -1.935) (end 5.01 1.935) (layer F.CrtYd) (width 0.05))
  (fp_line (start 5.01 1.935) (end -5.01 1.935) (layer F.CrtYd) (width 0.05))
  (fp_line (start -5.01 1.935) (end -5.01 -1.935) (layer F.CrtYd) (width 0.05))
)