(footprint "8-USON" (version 20211014) (generator pcbnew)
  (layer "F.Cu")
  (tedit 5AEB17D9)
  (attr through_hole)
  (fp_text reference "REF**" (at 0 2) (layer "F.SilkS")
    (effects (font (size 0.7 0.7) (thickness 0.15)))
    (tstamp 847f4038-9279-4970-8048-720ac0c568c0)
  )
  (fp_text value "8-USON" (at 0 -2.25) (layer "F.Fab") hide
    (effects (font (size 1 1) (thickness 0.15)))
    (tstamp 904309fd-64c7-4d96-8336-14bd4a658565)
  )
  (fp_text user "${REFERENCE}" (at 0 0) (layer "F.Fab")
    (effects (font (size 0.7 0.7) (thickness 0.07)))
    (tstamp 8cbfe9bf-171a-4fb8-99e5-ad778a912ccb)
  )
  (fp_line (start -1.75 -1.5) (end -0.25 -1.5) (layer "F.SilkS") (width 0.2) (tstamp 49b4cea5-84e9-458d-8ade-fac421ff2fcd))
  (fp_line (start 0.25 1.25) (end 1.75 1.25) (layer "F.SilkS") (width 0.15) (tstamp 827976a8-50be-4ac1-ac21-70046fd65f2a))
  (fp_line (start -0.25 -1.25) (end -1.75 -1.25) (layer "F.SilkS") (width 0.15) (tstamp c0c5bf70-0931-45b5-8a7c-5f20ec9f2a55))
  (fp_line (start -1.75 -1.25) (end -1.75 0) (layer "F.SilkS") (width 0.15) (tstamp f1c70c13-3635-46bc-ae1b-74586db5a256))
  (fp_line (start 1.75 1.25) (end 1.75 0) (layer "F.SilkS") (width 0.15) (tstamp f344ea5d-f0ab-4d0d-8ff0-ef999545260f))
  (fp_line (start 1.75 -1.25) (end 1.75 1.25) (layer "F.CrtYd") (width 0.05) (tstamp 2410438b-24fb-48bc-9614-263d798ade50))
  (fp_line (start 1.75 1.25) (end -1.75 1.25) (layer "F.CrtYd") (width 0.05) (tstamp 91ee1a0d-22e4-476b-924b-0e24aa52ef10))
  (fp_line (start -1.75 1.25) (end -1.75 -1.25) (layer "F.CrtYd") (width 0.05) (tstamp b2fba8a1-a8e8-4335-9350-97c78855f30d))
  (fp_line (start -1.75 -1.25) (end 1.75 -1.25) (layer "F.CrtYd") (width 0.05) (tstamp beb90390-a95a-4902-9907-cfa293210cc2))
  (fp_line (start 1.75 -1.25) (end 1.75 1.25) (layer "F.Fab") (width 0.1) (tstamp 1857ae5b-b8c2-4b6c-a0f5-08196ec369d0))
  (fp_line (start -1.75 -1.25) (end 1.75 -1.25) (layer "F.Fab") (width 0.1) (tstamp 25c00e5c-105a-434b-89dd-40953c5f2efb))
  (fp_line (start -1.75 1.25) (end -1.75 -1.25) (layer "F.Fab") (width 0.1) (tstamp 74603fad-f052-4d8b-829f-2218acc6715d))
  (fp_line (start 1.75 1.25) (end -1.75 1.25) (layer "F.Fab") (width 0.1) (tstamp d0d28d3c-a2be-4516-bb83-26f70983a7a3))
  (fp_poly (pts
      (xy -1.75 -1.25)
      (xy -1.75 -0.25)
      (xy -0.75 -1.25)
    ) (layer "F.Fab") (width 0.1) (fill solid) (tstamp 07587d32-6183-4f3c-98ae-30f50bdd8f0d))
  (pad "" smd rect (at 0 0) (size 0.2 1.6) (layers "F.Cu" "F.Paste" "F.Mask") (tstamp 58208562-aaac-42c8-b882-bf9f1bdbff29))
  (pad "1" smd rect (at -1.2 -0.75) (size 0.3 0.25) (layers "F.Cu" "F.Paste" "F.Mask") (tstamp 8eb769c9-3c05-4f8a-a92a-63080fd1b883))
  (pad "2" smd rect (at -1.2 -0.25) (size 0.3 0.25) (layers "F.Cu" "F.Paste" "F.Mask") (tstamp d215a5b3-e21a-4e35-9fc0-f41909b6720b))
  (pad "3" smd rect (at -1.2 0.25) (size 0.3 0.25) (layers "F.Cu" "F.Paste" "F.Mask") (tstamp 56197052-4f67-4630-8f20-3a9d9b90f2c0))
  (pad "4" smd rect (at -1.2 0.75) (size 0.3 0.25) (layers "F.Cu" "F.Paste" "F.Mask") (tstamp fb8b9880-93d3-4af6-a0ba-b95d783f84b8))
  (pad "5" smd rect (at 1.2 0.75) (size 0.3 0.25) (layers "F.Cu" "F.Paste" "F.Mask") (tstamp 92ef3282-2fdf-455c-856d-8836b15c0a5a))
  (pad "6" smd rect (at 1.2 0.25) (size 0.3 0.25) (layers "F.Cu" "F.Paste" "F.Mask") (tstamp 18d63868-e0fc-45b2-a696-bdeb6e4567e0))
  (pad "7" smd rect (at 1.2 -0.25) (size 0.3 0.25) (layers "F.Cu" "F.Paste" "F.Mask") (tstamp 2aedc96c-4a51-4be4-9b64-921022f941ff))
  (pad "8" smd rect (at 1.2 -0.75) (size 0.3 0.25) (layers "F.Cu" "F.Paste" "F.Mask") (tstamp 40599b42-bc4f-42b1-aea9-0b407d2acc91))
)
