%!PS-Adobe-3.0
%%Creator: PCBNEW
%%CreationDate: Sat Oct 16 17:42:07 2021
%%Title: ()
%%Pages: 1
%%PageOrder: Ascend
%%BoundingBox: 0 0 596 842
%%DocumentMedia: A4 595 842 0 () ()
%%Orientation: Landscape
%%EndComments
%%BeginProlog
/line { newpath moveto lineto stroke } bind def
/cir0 { newpath 0 360 arc stroke } bind def
/cir1 { newpath 0 360 arc gsave fill grestore stroke } bind def
/cir2 { newpath 0 360 arc gsave fill grestore stroke } bind def
/arc0 { newpath arc stroke } bind def
/arc1 { newpath 4 index 4 index moveto arc closepath gsave fill
    grestore stroke } bind def
/arc2 { newpath 4 index 4 index moveto arc closepath gsave fill
    grestore stroke } bind def
/poly0 { stroke } bind def
/poly1 { closepath gsave fill grestore stroke } bind def
/poly2 { closepath gsave fill grestore stroke } bind def
/rect0 { rectstroke } bind def
/rect1 { rectfill } bind def
/rect2 { rectfill } bind def
/linemode0 { 0 setlinecap 0 setlinejoin 0 setlinewidth } bind def
/linemode1 { 1 setlinecap 1 setlinejoin } bind def
/dashedline { [200] 100 setdash } bind def
/solidline { [] 0 setdash } bind def
/phantomshow { moveto
    /KicadFont findfont 0.000001 scalefont setfont
    show } bind def
/textshow { gsave
    findfont exch scalefont setfont concat 1 scale 0 0 moveto show
    } bind def
/reencodefont {
  findfont dup length dict begin
  { 1 index /FID ne
    { def }
    { pop pop } ifelse
  } forall
  /Encoding ISOLatin1Encoding def
  currentdict
  end } bind def
/KicadFont /Helvetica reencodefont definefont pop
/KicadFont-Bold /Helvetica-Bold reencodefont definefont pop
/KicadFont-Oblique /Helvetica-Oblique reencodefont definefont pop
/KicadFont-BoldOblique /Helvetica-BoldOblique reencodefont definefont pop
%%EndProlog
%%Page: 1 1
%%BeginPageSetup
gsave
0.0072 0.0072 scale
linemode1
82680 0 translate 90 rotate
236.22 setlinewidth
%%EndPageSetup
0 0 0 setrgbcolor
118.11 setlinewidth
98622.5 45474.4 1181.1 -90 -0 arc0
0 0 0 setrgbcolor
18307.5 45474.4 1181.1 -180 -90 arc0
0 0 0 setrgbcolor
newpath
98622.5 71458.7 moveto
80905.9 71458.7 lineto
stroke
0 0 0 setrgbcolor
newpath
99803.6 45474.4 moveto
99803.6 46655.5 lineto
stroke
0 0 0 setrgbcolor
newpath
17126.4 69096.5 moveto
17126.4 46655.5 lineto
stroke
0 0 0 setrgbcolor
newpath
99803.6 69096.5 moveto
99803.6 70277.6 lineto
stroke
0 0 0 setrgbcolor
newpath
18307.5 71458.7 moveto
80905.9 71458.7 lineto
stroke
0 0 0 setrgbcolor
newpath
99803.6 46655.5 moveto
99803.6 69096.5 lineto
stroke
0 0 0 setrgbcolor
newpath
17126.4 45474.4 moveto
17126.4 46655.5 lineto
stroke
0 0 0 setrgbcolor
newpath
18307.5 44293.3 moveto
80905.9 44293.3 lineto
stroke
0 0 0 setrgbcolor
newpath
80905.9 44293.3 moveto
98622.5 44293.3 lineto
stroke
0 0 0 setrgbcolor
newpath
17126.4 69096.5 moveto
17126.4 70277.6 lineto
stroke
0 0 0 setrgbcolor
98622.5 70277.6 1181.1 -0 90 arc0
0 0 0 setrgbcolor
18307.5 70277.6 1181.1 90 180 arc0
236.22 setlinewidth
47.2441 setlinewidth
newpath
27992.6 66734.3 moveto
28465 66261.8 lineto
stroke
newpath
28465 66734.3 moveto
27992.6 66261.8 lineto
stroke
newpath
28313.9 62324.4 moveto
28786.3 61852 lineto
stroke
newpath
28786.3 62324.4 moveto
28313.9 61852 lineto
stroke
newpath
28701.2 59293.3 moveto
29173.7 58820.9 lineto
stroke
newpath
29173.7 59293.3 moveto
28701.2 58820.9 lineto
stroke
newpath
28701.2 57787.4 moveto
29173.7 57315 lineto
stroke
newpath
29173.7 57787.4 moveto
28701.2 57315 lineto
stroke
newpath
31251.5 56162.8 moveto
31723.9 55690.4 lineto
stroke
newpath
31723.9 56162.8 moveto
31251.5 55690.4 lineto
stroke
newpath
32480.7 61301.2 moveto
32953.2 60828.8 lineto
stroke
newpath
32953.2 61301.2 moveto
32480.7 60828.8 lineto
stroke
newpath
35787.8 59883.9 moveto
36260.3 59411.4 lineto
stroke
newpath
36260.3 59883.9 moveto
35787.8 59411.4 lineto
stroke
newpath
36082.3 55335.8 moveto
36554.7 54863.4 lineto
stroke
newpath
36554.7 55335.8 moveto
36082.3 54863.4 lineto
stroke
newpath
36732.7 50671.3 moveto
37205.2 50198.8 lineto
stroke
newpath
37205.2 50671.3 moveto
36732.7 50198.8 lineto
stroke
newpath
36732.7 48781.5 moveto
37205.2 48309.1 lineto
stroke
newpath
37205.2 48781.5 moveto
36732.7 48309.1 lineto
stroke
newpath
38120.5 62009.9 moveto
38593 61537.4 lineto
stroke
newpath
38593 62009.9 moveto
38120.5 61537.4 lineto
stroke
newpath
38120.5 60120.1 moveto
38593 59647.7 lineto
stroke
newpath
38593 60120.1 moveto
38120.5 59647.7 lineto
stroke
newpath
40496.7 68210.1 moveto
40969.1 67737.6 lineto
stroke
newpath
40969.1 68210.1 moveto
40496.7 67737.6 lineto
stroke
newpath
41929.6 51988.2 moveto
42402 51515.8 lineto
stroke
newpath
42402 51988.2 moveto
41929.6 51515.8 lineto
stroke
newpath
42638.2 57521.7 moveto
43110.7 57049.2 lineto
stroke
newpath
43110.7 57521.7 moveto
42638.2 57049.2 lineto
stroke
newpath
42860.7 58997.7 moveto
43333.2 58525.3 lineto
stroke
newpath
43333.2 58997.7 moveto
42860.7 58525.3 lineto
stroke
newpath
43228.8 62246.1 moveto
43701.2 61773.6 lineto
stroke
newpath
43701.2 62246.1 moveto
43228.8 61773.6 lineto
stroke
newpath
45118.5 67442.9 moveto
45591 66970.5 lineto
stroke
newpath
45591 67442.9 moveto
45118.5 66970.5 lineto
stroke
newpath
48780 67442.9 moveto
49252.4 66970.5 lineto
stroke
newpath
49252.4 67442.9 moveto
48780 66970.5 lineto
stroke
newpath
52087 63191 moveto
52559.5 62718.5 lineto
stroke
newpath
52559.5 63191 moveto
52087 62718.5 lineto
stroke
newpath
53031.9 61301.2 moveto
53504.4 60828.8 lineto
stroke
newpath
53504.4 61301.2 moveto
53031.9 60828.8 lineto
stroke
newpath
53150 59411.4 moveto
53622.5 58939 lineto
stroke
newpath
53622.5 59411.4 moveto
53150 58939 lineto
stroke
newpath
53268.1 63191 moveto
53740.6 62718.5 lineto
stroke
newpath
53740.6 63191 moveto
53268.1 62718.5 lineto
stroke
newpath
54223.3 67353.7 moveto
54695.7 66881.3 lineto
stroke
newpath
54695.7 67353.7 moveto
54223.3 66881.3 lineto
stroke
newpath
54449.3 53033.5 moveto
54921.7 52561 lineto
stroke
newpath
54921.7 53033.5 moveto
54449.3 52561 lineto
stroke
newpath
56575.2 60356.3 moveto
57047.7 59883.9 lineto
stroke
newpath
57047.7 60356.3 moveto
56575.2 59883.9 lineto
stroke
newpath
57992.6 61065 moveto
58465 60592.5 lineto
stroke
newpath
58465 61065 moveto
57992.6 60592.5 lineto
stroke
newpath
58465 67442.9 moveto
58937.4 66970.5 lineto
stroke
newpath
58937.4 67442.9 moveto
58465 66970.5 lineto
stroke
newpath
62480.7 58939 moveto
62953.2 58466.6 lineto
stroke
newpath
62953.2 58939 moveto
62480.7 58466.6 lineto
stroke
newpath
62480.7 57727.2 moveto
62953.2 57254.8 lineto
stroke
newpath
62953.2 57727.2 moveto
62480.7 57254.8 lineto
stroke
newpath
63071.3 64017.7 moveto
63543.7 63545.3 lineto
stroke
newpath
63543.7 64017.7 moveto
63071.3 63545.3 lineto
stroke
newpath
63071.3 62836.6 moveto
63543.7 62364.2 lineto
stroke
newpath
63543.7 62836.6 moveto
63071.3 62364.2 lineto
stroke
newpath
63543.7 66379.9 moveto
64016.2 65907.5 lineto
stroke
newpath
64016.2 66379.9 moveto
63543.7 65907.5 lineto
stroke
newpath
65551.6 55135.3 moveto
66024.1 54662.8 lineto
stroke
newpath
66024.1 55135.3 moveto
65551.6 54662.8 lineto
stroke
newpath
66839 63958.7 moveto
67311.5 63486.2 lineto
stroke
newpath
67311.5 63958.7 moveto
66839 63486.2 lineto
stroke
newpath
69154 46537.4 moveto
69626.4 46065 lineto
stroke
newpath
69626.4 46537.4 moveto
69154 46065 lineto
stroke
newpath
69255.1 55938.6 moveto
69727.6 55466.2 lineto
stroke
newpath
69727.6 55938.6 moveto
69255.1 55466.2 lineto
stroke
newpath
70689.4 46537.4 moveto
71161.8 46065 lineto
stroke
newpath
71161.8 46537.4 moveto
70689.4 46065 lineto
stroke
newpath
71693.3 51852.4 moveto
72165.8 51379.9 lineto
stroke
newpath
72165.8 51852.4 moveto
71693.3 51379.9 lineto
stroke
newpath
79370.5 58702.8 moveto
79843 58230.3 lineto
stroke
newpath
79843 58702.8 moveto
79370.5 58230.3 lineto
stroke
newpath
80315.4 57639.8 moveto
80787.8 57167.3 lineto
stroke
newpath
80787.8 57639.8 moveto
80315.4 57167.3 lineto
stroke
newpath
88465 58702.8 moveto
88937.4 58230.3 lineto
stroke
newpath
88937.4 58702.8 moveto
88465 58230.3 lineto
stroke
newpath
89528 57639.8 moveto
90000.4 57167.3 lineto
stroke
newpath
90000.4 57639.8 moveto
89528 57167.3 lineto
stroke
59.0551 setlinewidth
37913.8 51616.2 295.276 cir0
42992.6 67206.7 295.276 cir0
55630.4 67679.1 295.276 cir0
57874.4 49017.7 295.276 cir0
64370.5 49017.7 295.276 cir0
73701.2 50080.7 295.276 cir0
70.8661 setlinewidth
newpath
20669.7 66285.4 moveto
20669.7 65576.8 lineto
stroke
newpath
20315.4 65931.1 moveto
21024.1 65931.1 lineto
stroke
236.22 setlinewidth
newpath
21142.2 66167.3 moveto
20197.3 66167.3 lineto
stroke
newpath
21142.2 65694.9 moveto
20197.3 65694.9 lineto
stroke
20197.3 65931.1 236.22 450 630 arc0
21142.2 65931.1 236.22 270 450 arc0
70.8661 setlinewidth
newpath
20669.7 56080.7 moveto
20669.7 55372.1 lineto
stroke
newpath
20315.4 55726.4 moveto
21024.1 55726.4 lineto
stroke
236.22 setlinewidth
newpath
21142.2 55962.6 moveto
20197.3 55962.6 lineto
stroke
newpath
21142.2 55490.2 moveto
20197.3 55490.2 lineto
stroke
20197.3 55726.4 236.22 450 630 arc0
21142.2 55726.4 236.22 270 450 arc0
70.8661 setlinewidth
newpath
25606.7 66285.4 moveto
25606.7 65576.8 lineto
stroke
newpath
25252.4 65931.1 moveto
25961.1 65931.1 lineto
stroke
236.22 setlinewidth
newpath
26256.3 66167.3 moveto
24957.1 66167.3 lineto
stroke
newpath
26256.3 65694.9 moveto
24957.1 65694.9 lineto
stroke
24957.1 65931.1 236.22 450 630 arc0
26256.3 65931.1 236.22 270 450 arc0
70.8661 setlinewidth
newpath
25606.7 56080.7 moveto
25606.7 55372.1 lineto
stroke
newpath
25252.4 55726.4 moveto
25961.1 55726.4 lineto
stroke
236.22 setlinewidth
newpath
26256.3 55962.6 moveto
24957.1 55962.6 lineto
stroke
newpath
26256.3 55490.2 moveto
24957.1 55490.2 lineto
stroke
24957.1 55726.4 236.22 450 630 arc0
26256.3 55726.4 236.22 270 450 arc0
118.11 setlinewidth
newpath
20821.6 51334.4 moveto
20821.6 52169.6 lineto
19986.4 52169.6 lineto
19986.4 51334.4 lineto
20821.6 51334.4 lineto
poly0
newpath
20821.6 48334.4 moveto
20821.6 49169.6 lineto
19986.4 49169.6 lineto
19986.4 48334.4 lineto
20821.6 48334.4 lineto
poly0
newpath
23821.6 51334.4 moveto
23821.6 52169.6 lineto
22986.4 52169.6 lineto
22986.4 51334.4 lineto
23821.6 51334.4 lineto
poly0
newpath
23821.6 48334.4 moveto
23821.6 49169.6 lineto
22986.4 49169.6 lineto
22986.4 48334.4 lineto
23821.6 48334.4 lineto
poly0
newpath
26821.6 51334.4 moveto
26821.6 52169.6 lineto
25986.4 52169.6 lineto
25986.4 51334.4 lineto
26821.6 51334.4 lineto
poly0
newpath
26821.6 48334.4 moveto
26821.6 49169.6 lineto
25986.4 49169.6 lineto
25986.4 48334.4 lineto
26821.6 48334.4 lineto
poly0
newpath
29821.6 51334.4 moveto
29821.6 52169.6 lineto
28986.4 52169.6 lineto
28986.4 51334.4 lineto
29821.6 51334.4 lineto
poly0
newpath
29821.6 48334.4 moveto
29821.6 49169.6 lineto
28986.4 49169.6 lineto
28986.4 48334.4 lineto
29821.6 48334.4 lineto
poly0
newpath
41236.9 48334.4 moveto
41236.9 49169.6 lineto
40401.7 49169.6 lineto
40401.7 48334.4 lineto
41236.9 48334.4 lineto
poly0
newpath
44236.9 48334.4 moveto
44236.9 49169.6 lineto
43401.7 49169.6 lineto
43401.7 48334.4 lineto
44236.9 48334.4 lineto
poly0
newpath
47236.9 48334.4 moveto
47236.9 49169.6 lineto
46401.7 49169.6 lineto
46401.7 48334.4 lineto
47236.9 48334.4 lineto
poly0
newpath
50236.9 48334.4 moveto
50236.9 49169.6 lineto
49401.7 49169.6 lineto
49401.7 48334.4 lineto
50236.9 48334.4 lineto
poly0
newpath
71579.4 66836.4 moveto
71579.4 67671.5 lineto
70744.3 67671.5 lineto
70744.3 66836.4 lineto
71579.4 66836.4 lineto
poly0
newpath
71579.4 63836.4 moveto
71579.4 64671.5 lineto
70744.3 64671.5 lineto
70744.3 63836.4 lineto
71579.4 63836.4 lineto
poly0
newpath
71579.4 60836.4 moveto
71579.4 61671.5 lineto
70744.3 61671.5 lineto
70744.3 60836.4 lineto
71579.4 60836.4 lineto
poly0
newpath
71579.4 57836.4 moveto
71579.4 58671.5 lineto
70744.3 58671.5 lineto
70744.3 57836.4 lineto
71579.4 57836.4 lineto
poly0
153.543 setlinewidth
newpath
77717 63970.5 moveto
78484.7 64738.2 lineto
77717 65505.9 lineto
76949.3 64738.2 lineto
77717 63970.5 lineto
poly0
newpath
77717 50376 moveto
78484.7 51143.7 lineto
77717 51911.4 lineto
76949.3 51143.7 lineto
77717 50376 lineto
poly0
newpath
83717 63970.5 moveto
84484.7 64738.2 lineto
83717 65505.9 lineto
82949.3 64738.2 lineto
83717 63970.5 lineto
poly0
newpath
83717 50376 moveto
84484.7 51143.7 lineto
83717 51911.4 lineto
82949.3 51143.7 lineto
83717 50376 lineto
poly0
newpath
89717 63970.5 moveto
90484.7 64738.2 lineto
89717 65505.9 lineto
88949.3 64738.2 lineto
89717 63970.5 lineto
poly0
newpath
89717 50376 moveto
90484.7 51143.7 lineto
89717 51911.4 lineto
88949.3 51143.7 lineto
89717 50376 lineto
poly0
newpath
95717 63970.5 moveto
96484.7 64738.2 lineto
95717 65505.9 lineto
94949.3 64738.2 lineto
95717 63970.5 lineto
poly0
newpath
95717 50376 moveto
96484.7 51143.7 lineto
95717 51911.4 lineto
94949.3 51143.7 lineto
95717 50376 lineto
poly0
236.22 setlinewidth
78.7406 setlinewidth
0 0 0 setrgbcolor
0 0 0 setrgbcolor
newpath
17963.5 42893.8 moveto
17963.5 43681.2 lineto
18151 43681.2 lineto
18263.5 43643.7 lineto
18338.5 43568.7 lineto
18376 43493.7 lineto
18413.4 43343.8 lineto
18413.4 43231.3 lineto
18376 43081.3 lineto
18338.5 43006.3 lineto
18263.5 42931.3 lineto
18151 42893.8 lineto
17963.5 42893.8 lineto
stroke
newpath
18750.9 42893.8 moveto
18750.9 43418.7 lineto
stroke
newpath
18750.9 43268.8 moveto
18788.4 43343.8 lineto
18825.9 43381.2 lineto
18900.9 43418.7 lineto
18975.9 43418.7 lineto
stroke
newpath
19238.3 42893.8 moveto
19238.3 43418.7 lineto
stroke
newpath
19238.3 43681.2 moveto
19200.8 43643.7 lineto
19238.3 43606.2 lineto
19275.8 43643.7 lineto
19238.3 43681.2 lineto
19238.3 43606.2 lineto
stroke
newpath
19725.8 42893.8 moveto
19650.8 42931.3 lineto
19613.3 43006.3 lineto
19613.3 43681.2 lineto
stroke
newpath
20138.2 42893.8 moveto
20063.2 42931.3 lineto
20025.7 43006.3 lineto
20025.7 43681.2 lineto
stroke
newpath
21038.1 42893.8 moveto
21038.1 43681.2 lineto
21300.6 43118.8 lineto
21563.1 43681.2 lineto
21563.1 42893.8 lineto
stroke
newpath
22275.5 42893.8 moveto
22275.5 43306.3 lineto
22238 43381.2 lineto
22163 43418.7 lineto
22013 43418.7 lineto
21938 43381.2 lineto
stroke
newpath
22275.5 42931.3 moveto
22200.5 42893.8 lineto
22013 42893.8 lineto
21938 42931.3 lineto
21900.5 43006.3 lineto
21900.5 43081.3 lineto
21938 43156.3 lineto
22013 43193.8 lineto
22200.5 43193.8 lineto
22275.5 43231.3 lineto
stroke
newpath
22650.4 43418.7 moveto
22650.4 42631.3 lineto
stroke
newpath
22650.4 43381.2 moveto
22725.4 43418.7 lineto
22875.4 43418.7 lineto
22950.4 43381.2 lineto
22987.9 43343.8 lineto
23025.4 43268.8 lineto
23025.4 43043.8 lineto
22987.9 42968.8 lineto
22950.4 42931.3 lineto
22875.4 42893.8 lineto
22725.4 42893.8 lineto
22650.4 42931.3 lineto
stroke
newpath
23362.8 42968.8 moveto
23400.3 42931.3 lineto
23362.8 42893.8 lineto
23325.3 42931.3 lineto
23362.8 42968.8 lineto
23362.8 42893.8 lineto
stroke
newpath
23362.8 43381.2 moveto
23400.3 43343.8 lineto
23362.8 43306.3 lineto
23325.3 43343.8 lineto
23362.8 43381.2 lineto
23362.8 43306.3 lineto
stroke
47.2441 setlinewidth
newpath
16476.8 41832.7 moveto
16949.3 41360.2 lineto
stroke
newpath
16949.3 41832.7 moveto
16476.8 41360.2 lineto
stroke
236.22 setlinewidth
78.7406 setlinewidth
0 0 0 setrgbcolor
0 0 0 setrgbcolor
newpath
18113.5 42027.7 moveto
18188.5 42027.7 lineto
18263.5 41990.2 lineto
18301 41952.7 lineto
18338.5 41877.7 lineto
18376 41727.7 lineto
18376 41540.2 lineto
18338.5 41390.2 lineto
18301 41315.3 lineto
18263.5 41277.8 lineto
18188.5 41240.3 lineto
18113.5 41240.3 lineto
18038.5 41277.8 lineto
18001 41315.3 lineto
17963.5 41390.2 lineto
17926 41540.2 lineto
17926 41727.7 lineto
17963.5 41877.7 lineto
18001 41952.7 lineto
18038.5 41990.2 lineto
18113.5 42027.7 lineto
stroke
newpath
18713.4 41315.3 moveto
18750.9 41277.8 lineto
18713.4 41240.3 lineto
18675.9 41277.8 lineto
18713.4 41315.3 lineto
18713.4 41240.3 lineto
stroke
newpath
19425.8 41765.2 moveto
19425.8 41240.3 lineto
stroke
newpath
19238.3 42065.2 moveto
19050.9 41502.7 lineto
19538.3 41502.7 lineto
stroke
newpath
19988.3 42027.7 moveto
20063.2 42027.7 lineto
20138.2 41990.2 lineto
20175.7 41952.7 lineto
20213.2 41877.7 lineto
20250.7 41727.7 lineto
20250.7 41540.2 lineto
20213.2 41390.2 lineto
20175.7 41315.3 lineto
20138.2 41277.8 lineto
20063.2 41240.3 lineto
19988.3 41240.3 lineto
19913.3 41277.8 lineto
19875.8 41315.3 lineto
19838.3 41390.2 lineto
19800.8 41540.2 lineto
19800.8 41727.7 lineto
19838.3 41877.7 lineto
19875.8 41952.7 lineto
19913.3 41990.2 lineto
19988.3 42027.7 lineto
stroke
newpath
20738.2 42027.7 moveto
20813.1 42027.7 lineto
20888.1 41990.2 lineto
20925.6 41952.7 lineto
20963.1 41877.7 lineto
21000.6 41727.7 lineto
21000.6 41540.2 lineto
20963.1 41390.2 lineto
20925.6 41315.3 lineto
20888.1 41277.8 lineto
20813.1 41240.3 lineto
20738.2 41240.3 lineto
20663.2 41277.8 lineto
20625.7 41315.3 lineto
20588.2 41390.2 lineto
20550.7 41540.2 lineto
20550.7 41727.7 lineto
20588.2 41877.7 lineto
20625.7 41952.7 lineto
20663.2 41990.2 lineto
20738.2 42027.7 lineto
stroke
newpath
21338.1 41240.3 moveto
21338.1 41765.2 lineto
stroke
newpath
21338.1 41690.2 moveto
21375.6 41727.7 lineto
21450.6 41765.2 lineto
21563.1 41765.2 lineto
21638 41727.7 lineto
21675.5 41652.7 lineto
21675.5 41240.3 lineto
stroke
newpath
21675.5 41652.7 moveto
21713 41727.7 lineto
21788 41765.2 lineto
21900.5 41765.2 lineto
21975.5 41727.7 lineto
22013 41652.7 lineto
22013 41240.3 lineto
stroke
newpath
22388 41240.3 moveto
22388 41765.2 lineto
stroke
newpath
22388 41690.2 moveto
22425.4 41727.7 lineto
22500.4 41765.2 lineto
22612.9 41765.2 lineto
22687.9 41727.7 lineto
22725.4 41652.7 lineto
22725.4 41240.3 lineto
stroke
newpath
22725.4 41652.7 moveto
22762.9 41727.7 lineto
22837.9 41765.2 lineto
22950.4 41765.2 lineto
23025.4 41727.7 lineto
23062.9 41652.7 lineto
23062.9 41240.3 lineto
stroke
newpath
24600.2 42065.2 moveto
23925.3 41052.8 lineto
stroke
newpath
25612.6 42027.7 moveto
25687.5 42027.7 lineto
25762.5 41990.2 lineto
25800 41952.7 lineto
25837.5 41877.7 lineto
25875 41727.7 lineto
25875 41540.2 lineto
25837.5 41390.2 lineto
25800 41315.3 lineto
25762.5 41277.8 lineto
25687.5 41240.3 lineto
25612.6 41240.3 lineto
25537.6 41277.8 lineto
25500.1 41315.3 lineto
25462.6 41390.2 lineto
25425.1 41540.2 lineto
25425.1 41727.7 lineto
25462.6 41877.7 lineto
25500.1 41952.7 lineto
25537.6 41990.2 lineto
25612.6 42027.7 lineto
stroke
newpath
26212.5 41315.3 moveto
26250 41277.8 lineto
26212.5 41240.3 lineto
26175 41277.8 lineto
26212.5 41315.3 lineto
26212.5 41240.3 lineto
stroke
newpath
26737.4 42027.7 moveto
26812.4 42027.7 lineto
26887.4 41990.2 lineto
26924.9 41952.7 lineto
26962.4 41877.7 lineto
26999.9 41727.7 lineto
26999.9 41540.2 lineto
26962.4 41390.2 lineto
26924.9 41315.3 lineto
26887.4 41277.8 lineto
26812.4 41240.3 lineto
26737.4 41240.3 lineto
26662.4 41277.8 lineto
26624.9 41315.3 lineto
26587.4 41390.2 lineto
26549.9 41540.2 lineto
26549.9 41727.7 lineto
26587.4 41877.7 lineto
26624.9 41952.7 lineto
26662.4 41990.2 lineto
26737.4 42027.7 lineto
stroke
newpath
27749.8 41240.3 moveto
27299.8 41240.3 lineto
stroke
newpath
27524.8 41240.3 moveto
27524.8 42027.7 lineto
27449.8 41915.2 lineto
27374.8 41840.2 lineto
27299.8 41802.7 lineto
stroke
newpath
28462.2 42027.7 moveto
28087.2 42027.7 lineto
28049.7 41652.7 lineto
28087.2 41690.2 lineto
28162.2 41727.7 lineto
28349.7 41727.7 lineto
28424.7 41690.2 lineto
28462.2 41652.7 lineto
28499.7 41577.7 lineto
28499.7 41390.2 lineto
28462.2 41315.3 lineto
28424.7 41277.8 lineto
28349.7 41240.3 lineto
28162.2 41240.3 lineto
28087.2 41277.8 lineto
28049.7 41315.3 lineto
stroke
newpath
28762.2 42027.7 moveto
29287.1 42027.7 lineto
28949.6 41240.3 lineto
stroke
newpath
29549.6 42027.7 moveto
29549.6 41877.7 lineto
stroke
newpath
29849.5 42027.7 moveto
29849.5 41877.7 lineto
stroke
newpath
31011.9 40940.3 moveto
30974.4 40977.8 lineto
30899.4 41090.3 lineto
30861.9 41165.3 lineto
30824.4 41277.8 lineto
30786.9 41465.2 lineto
30786.9 41615.2 lineto
30824.4 41802.7 lineto
30861.9 41915.2 lineto
30899.4 41990.2 lineto
30974.4 42102.7 lineto
31011.9 42140.2 lineto
stroke
newpath
31649.3 41765.2 moveto
31649.3 41240.3 lineto
stroke
newpath
31461.8 42065.2 moveto
31274.3 41502.7 lineto
31761.8 41502.7 lineto
stroke
newpath
31986.8 42027.7 moveto
32474.2 42027.7 lineto
32211.7 41727.7 lineto
32324.2 41727.7 lineto
32399.2 41690.2 lineto
32436.7 41652.7 lineto
32474.2 41577.7 lineto
32474.2 41390.2 lineto
32436.7 41315.3 lineto
32399.2 41277.8 lineto
32324.2 41240.3 lineto
32099.2 41240.3 lineto
32024.3 41277.8 lineto
31986.8 41315.3 lineto
stroke
newpath
33411.6 41240.3 moveto
33411.6 42027.7 lineto
stroke
newpath
33749 41240.3 moveto
33749 41652.7 lineto
33711.5 41727.7 lineto
33636.6 41765.2 lineto
33524.1 41765.2 lineto
33449.1 41727.7 lineto
33411.6 41690.2 lineto
stroke
newpath
34236.5 41240.3 moveto
34161.5 41277.8 lineto
34124 41315.3 lineto
34086.5 41390.2 lineto
34086.5 41615.2 lineto
34124 41690.2 lineto
34161.5 41727.7 lineto
34236.5 41765.2 lineto
34349 41765.2 lineto
34424 41727.7 lineto
34461.4 41690.2 lineto
34498.9 41615.2 lineto
34498.9 41390.2 lineto
34461.4 41315.3 lineto
34424 41277.8 lineto
34349 41240.3 lineto
34236.5 41240.3 lineto
stroke
newpath
34948.9 41240.3 moveto
34873.9 41277.8 lineto
34836.4 41352.8 lineto
34836.4 42027.7 lineto
stroke
newpath
35548.8 41277.8 moveto
35473.8 41240.3 lineto
35323.8 41240.3 lineto
35248.9 41277.8 lineto
35211.4 41352.8 lineto
35211.4 41652.7 lineto
35248.9 41727.7 lineto
35323.8 41765.2 lineto
35473.8 41765.2 lineto
35548.8 41727.7 lineto
35586.3 41652.7 lineto
35586.3 41577.7 lineto
35211.4 41502.7 lineto
stroke
newpath
35886.3 41277.8 moveto
35961.3 41240.3 lineto
36111.2 41240.3 lineto
36186.2 41277.8 lineto
36223.7 41352.8 lineto
36223.7 41390.2 lineto
36186.2 41465.2 lineto
36111.2 41502.7 lineto
35998.8 41502.7 lineto
35923.8 41540.2 lineto
35886.3 41615.2 lineto
35886.3 41652.7 lineto
35923.8 41727.7 lineto
35998.8 41765.2 lineto
36111.2 41765.2 lineto
36186.2 41727.7 lineto
stroke
newpath
36486.2 40940.3 moveto
36523.7 40977.8 lineto
36598.7 41090.3 lineto
36636.2 41165.3 lineto
36673.7 41277.8 lineto
36711.2 41465.2 lineto
36711.2 41615.2 lineto
36673.7 41802.7 lineto
36636.2 41915.2 lineto
36598.7 41990.2 lineto
36523.7 42102.7 lineto
36486.2 42140.2 lineto
stroke
59.0551 setlinewidth
16654 40557.1 295.276 cir0
236.22 setlinewidth
78.7406 setlinewidth
0 0 0 setrgbcolor
0 0 0 setrgbcolor
newpath
18113.5 40988.3 moveto
18188.5 40988.3 lineto
18263.5 40950.8 lineto
18301 40913.3 lineto
18338.5 40838.3 lineto
18376 40688.3 lineto
18376 40500.9 lineto
18338.5 40350.9 lineto
18301 40275.9 lineto
18263.5 40238.4 lineto
18188.5 40200.9 lineto
18113.5 40200.9 lineto
18038.5 40238.4 lineto
18001 40275.9 lineto
17963.5 40350.9 lineto
17926 40500.9 lineto
17926 40688.3 lineto
17963.5 40838.3 lineto
18001 40913.3 lineto
18038.5 40950.8 lineto
18113.5 40988.3 lineto
stroke
newpath
18713.4 40275.9 moveto
18750.9 40238.4 lineto
18713.4 40200.9 lineto
18675.9 40238.4 lineto
18713.4 40275.9 lineto
18713.4 40200.9 lineto
stroke
newpath
19463.3 40988.3 moveto
19088.4 40988.3 lineto
19050.9 40613.3 lineto
19088.4 40650.8 lineto
19163.4 40688.3 lineto
19350.8 40688.3 lineto
19425.8 40650.8 lineto
19463.3 40613.3 lineto
19500.8 40538.4 lineto
19500.8 40350.9 lineto
19463.3 40275.9 lineto
19425.8 40238.4 lineto
19350.8 40200.9 lineto
19163.4 40200.9 lineto
19088.4 40238.4 lineto
19050.9 40275.9 lineto
stroke
newpath
19988.3 40988.3 moveto
20063.2 40988.3 lineto
20138.2 40950.8 lineto
20175.7 40913.3 lineto
20213.2 40838.3 lineto
20250.7 40688.3 lineto
20250.7 40500.9 lineto
20213.2 40350.9 lineto
20175.7 40275.9 lineto
20138.2 40238.4 lineto
20063.2 40200.9 lineto
19988.3 40200.9 lineto
19913.3 40238.4 lineto
19875.8 40275.9 lineto
19838.3 40350.9 lineto
19800.8 40500.9 lineto
19800.8 40688.3 lineto
19838.3 40838.3 lineto
19875.8 40913.3 lineto
19913.3 40950.8 lineto
19988.3 40988.3 lineto
stroke
newpath
20738.2 40988.3 moveto
20813.1 40988.3 lineto
20888.1 40950.8 lineto
20925.6 40913.3 lineto
20963.1 40838.3 lineto
21000.6 40688.3 lineto
21000.6 40500.9 lineto
20963.1 40350.9 lineto
20925.6 40275.9 lineto
20888.1 40238.4 lineto
20813.1 40200.9 lineto
20738.2 40200.9 lineto
20663.2 40238.4 lineto
20625.7 40275.9 lineto
20588.2 40350.9 lineto
20550.7 40500.9 lineto
20550.7 40688.3 lineto
20588.2 40838.3 lineto
20625.7 40913.3 lineto
20663.2 40950.8 lineto
20738.2 40988.3 lineto
stroke
newpath
21338.1 40200.9 moveto
21338.1 40725.8 lineto
stroke
newpath
21338.1 40650.8 moveto
21375.6 40688.3 lineto
21450.6 40725.8 lineto
21563.1 40725.8 lineto
21638 40688.3 lineto
21675.5 40613.3 lineto
21675.5 40200.9 lineto
stroke
newpath
21675.5 40613.3 moveto
21713 40688.3 lineto
21788 40725.8 lineto
21900.5 40725.8 lineto
21975.5 40688.3 lineto
22013 40613.3 lineto
22013 40200.9 lineto
stroke
newpath
22388 40200.9 moveto
22388 40725.8 lineto
stroke
newpath
22388 40650.8 moveto
22425.4 40688.3 lineto
22500.4 40725.8 lineto
22612.9 40725.8 lineto
22687.9 40688.3 lineto
22725.4 40613.3 lineto
22725.4 40200.9 lineto
stroke
newpath
22725.4 40613.3 moveto
22762.9 40688.3 lineto
22837.9 40725.8 lineto
22950.4 40725.8 lineto
23025.4 40688.3 lineto
23062.9 40613.3 lineto
23062.9 40200.9 lineto
stroke
newpath
24600.2 41025.8 moveto
23925.3 40013.4 lineto
stroke
newpath
25612.6 40988.3 moveto
25687.5 40988.3 lineto
25762.5 40950.8 lineto
25800 40913.3 lineto
25837.5 40838.3 lineto
25875 40688.3 lineto
25875 40500.9 lineto
25837.5 40350.9 lineto
25800 40275.9 lineto
25762.5 40238.4 lineto
25687.5 40200.9 lineto
25612.6 40200.9 lineto
25537.6 40238.4 lineto
25500.1 40275.9 lineto
25462.6 40350.9 lineto
25425.1 40500.9 lineto
25425.1 40688.3 lineto
25462.6 40838.3 lineto
25500.1 40913.3 lineto
25537.6 40950.8 lineto
25612.6 40988.3 lineto
stroke
newpath
26212.5 40275.9 moveto
26250 40238.4 lineto
26212.5 40200.9 lineto
26175 40238.4 lineto
26212.5 40275.9 lineto
26212.5 40200.9 lineto
stroke
newpath
26737.4 40988.3 moveto
26812.4 40988.3 lineto
26887.4 40950.8 lineto
26924.9 40913.3 lineto
26962.4 40838.3 lineto
26999.9 40688.3 lineto
26999.9 40500.9 lineto
26962.4 40350.9 lineto
26924.9 40275.9 lineto
26887.4 40238.4 lineto
26812.4 40200.9 lineto
26737.4 40200.9 lineto
26662.4 40238.4 lineto
26624.9 40275.9 lineto
26587.4 40350.9 lineto
26549.9 40500.9 lineto
26549.9 40688.3 lineto
26587.4 40838.3 lineto
26624.9 40913.3 lineto
26662.4 40950.8 lineto
26737.4 40988.3 lineto
stroke
newpath
27749.8 40200.9 moveto
27299.8 40200.9 lineto
stroke
newpath
27524.8 40200.9 moveto
27524.8 40988.3 lineto
27449.8 40875.8 lineto
27374.8 40800.8 lineto
27299.8 40763.3 lineto
stroke
newpath
28124.7 40200.9 moveto
28274.7 40200.9 lineto
28349.7 40238.4 lineto
28387.2 40275.9 lineto
28462.2 40388.4 lineto
28499.7 40538.4 lineto
28499.7 40838.3 lineto
28462.2 40913.3 lineto
28424.7 40950.8 lineto
28349.7 40988.3 lineto
28199.7 40988.3 lineto
28124.7 40950.8 lineto
28087.2 40913.3 lineto
28049.7 40838.3 lineto
28049.7 40650.8 lineto
28087.2 40575.8 lineto
28124.7 40538.4 lineto
28199.7 40500.9 lineto
28349.7 40500.9 lineto
28424.7 40538.4 lineto
28462.2 40575.8 lineto
28499.7 40650.8 lineto
stroke
newpath
28762.2 40988.3 moveto
29287.1 40988.3 lineto
28949.6 40200.9 lineto
stroke
newpath
29549.6 40988.3 moveto
29549.6 40838.3 lineto
stroke
newpath
29849.5 40988.3 moveto
29849.5 40838.3 lineto
stroke
newpath
31011.9 39900.9 moveto
30974.4 39938.4 lineto
30899.4 40050.9 lineto
30861.9 40125.9 lineto
30824.4 40238.4 lineto
30786.9 40425.9 lineto
30786.9 40575.8 lineto
30824.4 40763.3 lineto
30861.9 40875.8 lineto
30899.4 40950.8 lineto
30974.4 41063.3 lineto
31011.9 41100.8 lineto
stroke
newpath
31649.3 40988.3 moveto
31499.3 40988.3 lineto
31424.3 40950.8 lineto
31386.8 40913.3 lineto
31311.8 40800.8 lineto
31274.3 40650.8 lineto
31274.3 40350.9 lineto
31311.8 40275.9 lineto
31349.3 40238.4 lineto
31424.3 40200.9 lineto
31574.3 40200.9 lineto
31649.3 40238.4 lineto
31686.8 40275.9 lineto
31724.3 40350.9 lineto
31724.3 40538.4 lineto
31686.8 40613.3 lineto
31649.3 40650.8 lineto
31574.3 40688.3 lineto
31424.3 40688.3 lineto
31349.3 40650.8 lineto
31311.8 40613.3 lineto
31274.3 40538.4 lineto
stroke
newpath
32661.7 40200.9 moveto
32661.7 40988.3 lineto
stroke
newpath
32999.1 40200.9 moveto
32999.1 40613.3 lineto
32961.6 40688.3 lineto
32886.6 40725.8 lineto
32774.2 40725.8 lineto
32699.2 40688.3 lineto
32661.7 40650.8 lineto
stroke
newpath
33486.6 40200.9 moveto
33411.6 40238.4 lineto
33374.1 40275.9 lineto
33336.6 40350.9 lineto
33336.6 40575.8 lineto
33374.1 40650.8 lineto
33411.6 40688.3 lineto
33486.6 40725.8 lineto
33599.1 40725.8 lineto
33674 40688.3 lineto
33711.5 40650.8 lineto
33749 40575.8 lineto
33749 40350.9 lineto
33711.5 40275.9 lineto
33674 40238.4 lineto
33599.1 40200.9 lineto
33486.6 40200.9 lineto
stroke
newpath
34199 40200.9 moveto
34124 40238.4 lineto
34086.5 40313.4 lineto
34086.5 40988.3 lineto
stroke
newpath
34798.9 40238.4 moveto
34723.9 40200.9 lineto
34573.9 40200.9 lineto
34498.9 40238.4 lineto
34461.4 40313.4 lineto
34461.4 40613.3 lineto
34498.9 40688.3 lineto
34573.9 40725.8 lineto
34723.9 40725.8 lineto
34798.9 40688.3 lineto
34836.4 40613.3 lineto
34836.4 40538.4 lineto
34461.4 40463.4 lineto
stroke
newpath
35136.4 40238.4 moveto
35211.4 40200.9 lineto
35361.3 40200.9 lineto
35436.3 40238.4 lineto
35473.8 40313.4 lineto
35473.8 40350.9 lineto
35436.3 40425.9 lineto
35361.3 40463.4 lineto
35248.9 40463.4 lineto
35173.9 40500.9 lineto
35136.4 40575.8 lineto
35136.4 40613.3 lineto
35173.9 40688.3 lineto
35248.9 40725.8 lineto
35361.3 40725.8 lineto
35436.3 40688.3 lineto
stroke
newpath
35736.3 39900.9 moveto
35773.8 39938.4 lineto
35848.8 40050.9 lineto
35886.3 40125.9 lineto
35923.8 40238.4 lineto
35961.3 40425.9 lineto
35961.3 40575.8 lineto
35923.8 40763.3 lineto
35886.3 40875.8 lineto
35848.8 40950.8 lineto
35773.8 41063.3 lineto
35736.3 41100.8 lineto
stroke
70.8661 setlinewidth
newpath
16594.9 39848.4 moveto
16594.9 39139.8 lineto
stroke
newpath
16240.6 39494.1 moveto
16949.3 39494.1 lineto
stroke
236.22 setlinewidth
78.7406 setlinewidth
0 0 0 setrgbcolor
0 0 0 setrgbcolor
newpath
18113.5 39925.3 moveto
18188.5 39925.3 lineto
18263.5 39887.8 lineto
18301 39850.3 lineto
18338.5 39775.3 lineto
18376 39625.3 lineto
18376 39437.9 lineto
18338.5 39287.9 lineto
18301 39212.9 lineto
18263.5 39175.4 lineto
18188.5 39137.9 lineto
18113.5 39137.9 lineto
18038.5 39175.4 lineto
18001 39212.9 lineto
17963.5 39287.9 lineto
17926 39437.9 lineto
17926 39625.3 lineto
17963.5 39775.3 lineto
18001 39850.3 lineto
18038.5 39887.8 lineto
18113.5 39925.3 lineto
stroke
newpath
18713.4 39212.9 moveto
18750.9 39175.4 lineto
18713.4 39137.9 lineto
18675.9 39175.4 lineto
18713.4 39212.9 lineto
18713.4 39137.9 lineto
stroke
newpath
19425.8 39925.3 moveto
19275.8 39925.3 lineto
19200.8 39887.8 lineto
19163.4 39850.3 lineto
19088.4 39737.8 lineto
19050.9 39587.8 lineto
19050.9 39287.9 lineto
19088.4 39212.9 lineto
19125.9 39175.4 lineto
19200.8 39137.9 lineto
19350.8 39137.9 lineto
19425.8 39175.4 lineto
19463.3 39212.9 lineto
19500.8 39287.9 lineto
19500.8 39475.4 lineto
19463.3 39550.4 lineto
19425.8 39587.8 lineto
19350.8 39625.3 lineto
19200.8 39625.3 lineto
19125.9 39587.8 lineto
19088.4 39550.4 lineto
19050.9 39475.4 lineto
stroke
newpath
19988.3 39925.3 moveto
20063.2 39925.3 lineto
20138.2 39887.8 lineto
20175.7 39850.3 lineto
20213.2 39775.3 lineto
20250.7 39625.3 lineto
20250.7 39437.9 lineto
20213.2 39287.9 lineto
20175.7 39212.9 lineto
20138.2 39175.4 lineto
20063.2 39137.9 lineto
19988.3 39137.9 lineto
19913.3 39175.4 lineto
19875.8 39212.9 lineto
19838.3 39287.9 lineto
19800.8 39437.9 lineto
19800.8 39625.3 lineto
19838.3 39775.3 lineto
19875.8 39850.3 lineto
19913.3 39887.8 lineto
19988.3 39925.3 lineto
stroke
newpath
20738.2 39925.3 moveto
20813.1 39925.3 lineto
20888.1 39887.8 lineto
20925.6 39850.3 lineto
20963.1 39775.3 lineto
21000.6 39625.3 lineto
21000.6 39437.9 lineto
20963.1 39287.9 lineto
20925.6 39212.9 lineto
20888.1 39175.4 lineto
20813.1 39137.9 lineto
20738.2 39137.9 lineto
20663.2 39175.4 lineto
20625.7 39212.9 lineto
20588.2 39287.9 lineto
20550.7 39437.9 lineto
20550.7 39625.3 lineto
20588.2 39775.3 lineto
20625.7 39850.3 lineto
20663.2 39887.8 lineto
20738.2 39925.3 lineto
stroke
newpath
21338.1 39137.9 moveto
21338.1 39662.8 lineto
stroke
newpath
21338.1 39587.8 moveto
21375.6 39625.3 lineto
21450.6 39662.8 lineto
21563.1 39662.8 lineto
21638 39625.3 lineto
21675.5 39550.4 lineto
21675.5 39137.9 lineto
stroke
newpath
21675.5 39550.4 moveto
21713 39625.3 lineto
21788 39662.8 lineto
21900.5 39662.8 lineto
21975.5 39625.3 lineto
22013 39550.4 lineto
22013 39137.9 lineto
stroke
newpath
22388 39137.9 moveto
22388 39662.8 lineto
stroke
newpath
22388 39587.8 moveto
22425.4 39625.3 lineto
22500.4 39662.8 lineto
22612.9 39662.8 lineto
22687.9 39625.3 lineto
22725.4 39550.4 lineto
22725.4 39137.9 lineto
stroke
newpath
22725.4 39550.4 moveto
22762.9 39625.3 lineto
22837.9 39662.8 lineto
22950.4 39662.8 lineto
23025.4 39625.3 lineto
23062.9 39550.4 lineto
23062.9 39137.9 lineto
stroke
newpath
24600.2 39962.8 moveto
23925.3 38950.4 lineto
stroke
newpath
25612.6 39925.3 moveto
25687.5 39925.3 lineto
25762.5 39887.8 lineto
25800 39850.3 lineto
25837.5 39775.3 lineto
25875 39625.3 lineto
25875 39437.9 lineto
25837.5 39287.9 lineto
25800 39212.9 lineto
25762.5 39175.4 lineto
25687.5 39137.9 lineto
25612.6 39137.9 lineto
25537.6 39175.4 lineto
25500.1 39212.9 lineto
25462.6 39287.9 lineto
25425.1 39437.9 lineto
25425.1 39625.3 lineto
25462.6 39775.3 lineto
25500.1 39850.3 lineto
25537.6 39887.8 lineto
25612.6 39925.3 lineto
stroke
newpath
26212.5 39212.9 moveto
26250 39175.4 lineto
26212.5 39137.9 lineto
26175 39175.4 lineto
26212.5 39212.9 lineto
26212.5 39137.9 lineto
stroke
newpath
26737.4 39925.3 moveto
26812.4 39925.3 lineto
26887.4 39887.8 lineto
26924.9 39850.3 lineto
26962.4 39775.3 lineto
26999.9 39625.3 lineto
26999.9 39437.9 lineto
26962.4 39287.9 lineto
26924.9 39212.9 lineto
26887.4 39175.4 lineto
26812.4 39137.9 lineto
26737.4 39137.9 lineto
26662.4 39175.4 lineto
26624.9 39212.9 lineto
26587.4 39287.9 lineto
26549.9 39437.9 lineto
26549.9 39625.3 lineto
26587.4 39775.3 lineto
26624.9 39850.3 lineto
26662.4 39887.8 lineto
26737.4 39925.3 lineto
stroke
newpath
27299.8 39850.3 moveto
27337.3 39887.8 lineto
27412.3 39925.3 lineto
27599.8 39925.3 lineto
27674.8 39887.8 lineto
27712.3 39850.3 lineto
27749.8 39775.3 lineto
27749.8 39700.3 lineto
27712.3 39587.8 lineto
27262.3 39137.9 lineto
27749.8 39137.9 lineto
stroke
newpath
28012.3 39925.3 moveto
28499.7 39925.3 lineto
28237.2 39625.3 lineto
28349.7 39625.3 lineto
28424.7 39587.8 lineto
28462.2 39550.4 lineto
28499.7 39475.4 lineto
28499.7 39287.9 lineto
28462.2 39212.9 lineto
28424.7 39175.4 lineto
28349.7 39137.9 lineto
28124.7 39137.9 lineto
28049.7 39175.4 lineto
28012.3 39212.9 lineto
stroke
newpath
29174.6 39925.3 moveto
29024.6 39925.3 lineto
28949.6 39887.8 lineto
28912.1 39850.3 lineto
28837.1 39737.8 lineto
28799.7 39587.8 lineto
28799.7 39287.9 lineto
28837.1 39212.9 lineto
28874.6 39175.4 lineto
28949.6 39137.9 lineto
29099.6 39137.9 lineto
29174.6 39175.4 lineto
29212.1 39212.9 lineto
29249.6 39287.9 lineto
29249.6 39475.4 lineto
29212.1 39550.4 lineto
29174.6 39587.8 lineto
29099.6 39625.3 lineto
28949.6 39625.3 lineto
28874.6 39587.8 lineto
28837.1 39550.4 lineto
28799.7 39475.4 lineto
stroke
newpath
29549.6 39925.3 moveto
29549.6 39775.3 lineto
stroke
newpath
29849.5 39925.3 moveto
29849.5 39775.3 lineto
stroke
newpath
31011.9 38837.9 moveto
30974.4 38875.4 lineto
30899.4 38987.9 lineto
30861.9 39062.9 lineto
30824.4 39175.4 lineto
30786.9 39362.9 lineto
30786.9 39512.9 lineto
30824.4 39700.3 lineto
30861.9 39812.8 lineto
30899.4 39887.8 lineto
30974.4 40000.3 lineto
31011.9 40037.8 lineto
stroke
newpath
31461.8 39925.3 moveto
31536.8 39925.3 lineto
31611.8 39887.8 lineto
31649.3 39850.3 lineto
31686.8 39775.3 lineto
31724.3 39625.3 lineto
31724.3 39437.9 lineto
31686.8 39287.9 lineto
31649.3 39212.9 lineto
31611.8 39175.4 lineto
31536.8 39137.9 lineto
31461.8 39137.9 lineto
31386.8 39175.4 lineto
31349.3 39212.9 lineto
31311.8 39287.9 lineto
31274.3 39437.9 lineto
31274.3 39625.3 lineto
31311.8 39775.3 lineto
31349.3 39850.3 lineto
31386.8 39887.8 lineto
31461.8 39925.3 lineto
stroke
newpath
32661.7 39137.9 moveto
32661.7 39925.3 lineto
stroke
newpath
32999.1 39137.9 moveto
32999.1 39550.4 lineto
32961.6 39625.3 lineto
32886.6 39662.8 lineto
32774.2 39662.8 lineto
32699.2 39625.3 lineto
32661.7 39587.8 lineto
stroke
newpath
33486.6 39137.9 moveto
33411.6 39175.4 lineto
33374.1 39212.9 lineto
33336.6 39287.9 lineto
33336.6 39512.9 lineto
33374.1 39587.8 lineto
33411.6 39625.3 lineto
33486.6 39662.8 lineto
33599.1 39662.8 lineto
33674 39625.3 lineto
33711.5 39587.8 lineto
33749 39512.9 lineto
33749 39287.9 lineto
33711.5 39212.9 lineto
33674 39175.4 lineto
33599.1 39137.9 lineto
33486.6 39137.9 lineto
stroke
newpath
34199 39137.9 moveto
34124 39175.4 lineto
34086.5 39250.4 lineto
34086.5 39925.3 lineto
stroke
newpath
34798.9 39175.4 moveto
34723.9 39137.9 lineto
34573.9 39137.9 lineto
34498.9 39175.4 lineto
34461.4 39250.4 lineto
34461.4 39550.4 lineto
34498.9 39625.3 lineto
34573.9 39662.8 lineto
34723.9 39662.8 lineto
34798.9 39625.3 lineto
34836.4 39550.4 lineto
34836.4 39475.4 lineto
34461.4 39400.4 lineto
stroke
newpath
35136.4 39175.4 moveto
35211.4 39137.9 lineto
35361.3 39137.9 lineto
35436.3 39175.4 lineto
35473.8 39250.4 lineto
35473.8 39287.9 lineto
35436.3 39362.9 lineto
35361.3 39400.4 lineto
35248.9 39400.4 lineto
35173.9 39437.9 lineto
35136.4 39512.9 lineto
35136.4 39550.4 lineto
35173.9 39625.3 lineto
35248.9 39662.8 lineto
35361.3 39662.8 lineto
35436.3 39625.3 lineto
stroke
newpath
36411.2 39437.9 moveto
37011.1 39437.9 lineto
stroke
newpath
36711.2 39137.9 moveto
36711.2 39737.8 lineto
stroke
newpath
38323.5 39662.8 moveto
38323.5 39137.9 lineto
stroke
newpath
38136 39962.8 moveto
37948.5 39400.4 lineto
38436 39400.4 lineto
stroke
newpath
39298.3 39175.4 moveto
39373.3 39137.9 lineto
39523.3 39137.9 lineto
39598.3 39175.4 lineto
39635.8 39250.4 lineto
39635.8 39287.9 lineto
39598.3 39362.9 lineto
39523.3 39400.4 lineto
39410.8 39400.4 lineto
39335.8 39437.9 lineto
39298.3 39512.9 lineto
39298.3 39550.4 lineto
39335.8 39625.3 lineto
39410.8 39662.8 lineto
39523.3 39662.8 lineto
39598.3 39625.3 lineto
stroke
newpath
40085.7 39137.9 moveto
40010.8 39175.4 lineto
39973.3 39250.4 lineto
39973.3 39925.3 lineto
stroke
newpath
40498.2 39137.9 moveto
40423.2 39175.4 lineto
40385.7 39212.9 lineto
40348.2 39287.9 lineto
40348.2 39512.9 lineto
40385.7 39587.8 lineto
40423.2 39625.3 lineto
40498.2 39662.8 lineto
40610.7 39662.8 lineto
40685.7 39625.3 lineto
40723.2 39587.8 lineto
40760.7 39512.9 lineto
40760.7 39287.9 lineto
40723.2 39212.9 lineto
40685.7 39175.4 lineto
40610.7 39137.9 lineto
40498.2 39137.9 lineto
stroke
newpath
40985.6 39662.8 moveto
41285.6 39662.8 lineto
stroke
newpath
41098.1 39925.3 moveto
41098.1 39250.4 lineto
41135.6 39175.4 lineto
41210.6 39137.9 lineto
41285.6 39137.9 lineto
stroke
newpath
41510.6 39175.4 moveto
41585.6 39137.9 lineto
41735.5 39137.9 lineto
41810.5 39175.4 lineto
41848 39250.4 lineto
41848 39287.9 lineto
41810.5 39362.9 lineto
41735.5 39400.4 lineto
41623.1 39400.4 lineto
41548.1 39437.9 lineto
41510.6 39512.9 lineto
41510.6 39550.4 lineto
41548.1 39625.3 lineto
41623.1 39662.8 lineto
41735.5 39662.8 lineto
41810.5 39625.3 lineto
stroke
newpath
42110.5 38837.9 moveto
42148 38875.4 lineto
42223 38987.9 lineto
42260.5 39062.9 lineto
42298 39175.4 lineto
42335.5 39362.9 lineto
42335.5 39512.9 lineto
42298 39700.3 lineto
42260.5 39812.8 lineto
42223 39887.8 lineto
42148 40000.3 lineto
42110.5 40037.8 lineto
stroke
78.7394 setlinewidth
newpath
16833.9 38034.6 moveto
16833.9 38591.4 lineto
16277.2 38591.4 lineto
16277.2 38034.6 lineto
16833.9 38034.6 lineto
poly0
236.22 setlinewidth
78.7406 setlinewidth
0 0 0 setrgbcolor
0 0 0 setrgbcolor
newpath
18376 37956.8 moveto
17926 37956.8 lineto
stroke
newpath
18151 37956.8 moveto
18151 38744.2 lineto
18076 38631.7 lineto
18001 38556.7 lineto
17926 38519.2 lineto
stroke
newpath
18713.4 38031.8 moveto
18750.9 37994.3 lineto
18713.4 37956.8 lineto
18675.9 37994.3 lineto
18713.4 38031.8 lineto
18713.4 37956.8 lineto
stroke
newpath
19238.3 38744.2 moveto
19313.3 38744.2 lineto
19388.3 38706.7 lineto
19425.8 38669.2 lineto
19463.3 38594.2 lineto
19500.8 38444.2 lineto
19500.8 38256.8 lineto
19463.3 38106.8 lineto
19425.8 38031.8 lineto
19388.3 37994.3 lineto
19313.3 37956.8 lineto
19238.3 37956.8 lineto
19163.4 37994.3 lineto
19125.9 38031.8 lineto
19088.4 38106.8 lineto
19050.9 38256.8 lineto
19050.9 38444.2 lineto
19088.4 38594.2 lineto
19125.9 38669.2 lineto
19163.4 38706.7 lineto
19238.3 38744.2 lineto
stroke
newpath
19988.3 38744.2 moveto
20063.2 38744.2 lineto
20138.2 38706.7 lineto
20175.7 38669.2 lineto
20213.2 38594.2 lineto
20250.7 38444.2 lineto
20250.7 38256.8 lineto
20213.2 38106.8 lineto
20175.7 38031.8 lineto
20138.2 37994.3 lineto
20063.2 37956.8 lineto
19988.3 37956.8 lineto
19913.3 37994.3 lineto
19875.8 38031.8 lineto
19838.3 38106.8 lineto
19800.8 38256.8 lineto
19800.8 38444.2 lineto
19838.3 38594.2 lineto
19875.8 38669.2 lineto
19913.3 38706.7 lineto
19988.3 38744.2 lineto
stroke
newpath
20738.2 38744.2 moveto
20813.1 38744.2 lineto
20888.1 38706.7 lineto
20925.6 38669.2 lineto
20963.1 38594.2 lineto
21000.6 38444.2 lineto
21000.6 38256.8 lineto
20963.1 38106.8 lineto
20925.6 38031.8 lineto
20888.1 37994.3 lineto
20813.1 37956.8 lineto
20738.2 37956.8 lineto
20663.2 37994.3 lineto
20625.7 38031.8 lineto
20588.2 38106.8 lineto
20550.7 38256.8 lineto
20550.7 38444.2 lineto
20588.2 38594.2 lineto
20625.7 38669.2 lineto
20663.2 38706.7 lineto
20738.2 38744.2 lineto
stroke
newpath
21338.1 37956.8 moveto
21338.1 38481.7 lineto
stroke
newpath
21338.1 38406.7 moveto
21375.6 38444.2 lineto
21450.6 38481.7 lineto
21563.1 38481.7 lineto
21638 38444.2 lineto
21675.5 38369.2 lineto
21675.5 37956.8 lineto
stroke
newpath
21675.5 38369.2 moveto
21713 38444.2 lineto
21788 38481.7 lineto
21900.5 38481.7 lineto
21975.5 38444.2 lineto
22013 38369.2 lineto
22013 37956.8 lineto
stroke
newpath
22388 37956.8 moveto
22388 38481.7 lineto
stroke
newpath
22388 38406.7 moveto
22425.4 38444.2 lineto
22500.4 38481.7 lineto
22612.9 38481.7 lineto
22687.9 38444.2 lineto
22725.4 38369.2 lineto
22725.4 37956.8 lineto
stroke
newpath
22725.4 38369.2 moveto
22762.9 38444.2 lineto
22837.9 38481.7 lineto
22950.4 38481.7 lineto
23025.4 38444.2 lineto
23062.9 38369.2 lineto
23062.9 37956.8 lineto
stroke
newpath
24600.2 38781.7 moveto
23925.3 37769.3 lineto
stroke
newpath
25612.6 38744.2 moveto
25687.5 38744.2 lineto
25762.5 38706.7 lineto
25800 38669.2 lineto
25837.5 38594.2 lineto
25875 38444.2 lineto
25875 38256.8 lineto
25837.5 38106.8 lineto
25800 38031.8 lineto
25762.5 37994.3 lineto
25687.5 37956.8 lineto
25612.6 37956.8 lineto
25537.6 37994.3 lineto
25500.1 38031.8 lineto
25462.6 38106.8 lineto
25425.1 38256.8 lineto
25425.1 38444.2 lineto
25462.6 38594.2 lineto
25500.1 38669.2 lineto
25537.6 38706.7 lineto
25612.6 38744.2 lineto
stroke
newpath
26212.5 38031.8 moveto
26250 37994.3 lineto
26212.5 37956.8 lineto
26175 37994.3 lineto
26212.5 38031.8 lineto
26212.5 37956.8 lineto
stroke
newpath
26737.4 38744.2 moveto
26812.4 38744.2 lineto
26887.4 38706.7 lineto
26924.9 38669.2 lineto
26962.4 38594.2 lineto
26999.9 38444.2 lineto
26999.9 38256.8 lineto
26962.4 38106.8 lineto
26924.9 38031.8 lineto
26887.4 37994.3 lineto
26812.4 37956.8 lineto
26737.4 37956.8 lineto
26662.4 37994.3 lineto
26624.9 38031.8 lineto
26587.4 38106.8 lineto
26549.9 38256.8 lineto
26549.9 38444.2 lineto
26587.4 38594.2 lineto
26624.9 38669.2 lineto
26662.4 38706.7 lineto
26737.4 38744.2 lineto
stroke
newpath
27262.3 38744.2 moveto
27749.8 38744.2 lineto
27487.3 38444.2 lineto
27599.8 38444.2 lineto
27674.8 38406.7 lineto
27712.3 38369.2 lineto
27749.8 38294.3 lineto
27749.8 38106.8 lineto
27712.3 38031.8 lineto
27674.8 37994.3 lineto
27599.8 37956.8 lineto
27374.8 37956.8 lineto
27299.8 37994.3 lineto
27262.3 38031.8 lineto
stroke
newpath
28124.7 37956.8 moveto
28274.7 37956.8 lineto
28349.7 37994.3 lineto
28387.2 38031.8 lineto
28462.2 38144.3 lineto
28499.7 38294.3 lineto
28499.7 38594.2 lineto
28462.2 38669.2 lineto
28424.7 38706.7 lineto
28349.7 38744.2 lineto
28199.7 38744.2 lineto
28124.7 38706.7 lineto
28087.2 38669.2 lineto
28049.7 38594.2 lineto
28049.7 38406.7 lineto
28087.2 38331.8 lineto
28124.7 38294.3 lineto
28199.7 38256.8 lineto
28349.7 38256.8 lineto
28424.7 38294.3 lineto
28462.2 38331.8 lineto
28499.7 38406.7 lineto
stroke
newpath
29174.6 38481.7 moveto
29174.6 37956.8 lineto
stroke
newpath
28987.1 38781.7 moveto
28799.7 38219.3 lineto
29287.1 38219.3 lineto
stroke
newpath
29549.6 38744.2 moveto
29549.6 38594.2 lineto
stroke
newpath
29849.5 38744.2 moveto
29849.5 38594.2 lineto
stroke
newpath
31011.9 37656.8 moveto
30974.4 37694.3 lineto
30899.4 37806.8 lineto
30861.9 37881.8 lineto
30824.4 37994.3 lineto
30786.9 38181.8 lineto
30786.9 38331.8 lineto
30824.4 38519.2 lineto
30861.9 38631.7 lineto
30899.4 38706.7 lineto
30974.4 38819.2 lineto
31011.9 38856.7 lineto
stroke
newpath
31724.3 37956.8 moveto
31274.3 37956.8 lineto
stroke
newpath
31499.3 37956.8 moveto
31499.3 38744.2 lineto
31424.3 38631.7 lineto
31349.3 38556.7 lineto
31274.3 38519.2 lineto
stroke
newpath
32399.2 38744.2 moveto
32249.2 38744.2 lineto
32174.2 38706.7 lineto
32136.7 38669.2 lineto
32061.7 38556.7 lineto
32024.3 38406.7 lineto
32024.3 38106.8 lineto
32061.7 38031.8 lineto
32099.2 37994.3 lineto
32174.2 37956.8 lineto
32324.2 37956.8 lineto
32399.2 37994.3 lineto
32436.7 38031.8 lineto
32474.2 38106.8 lineto
32474.2 38294.3 lineto
32436.7 38369.2 lineto
32399.2 38406.7 lineto
32324.2 38444.2 lineto
32174.2 38444.2 lineto
32099.2 38406.7 lineto
32061.7 38369.2 lineto
32024.3 38294.3 lineto
stroke
newpath
33411.6 37956.8 moveto
33411.6 38744.2 lineto
stroke
newpath
33749 37956.8 moveto
33749 38369.2 lineto
33711.5 38444.2 lineto
33636.6 38481.7 lineto
33524.1 38481.7 lineto
33449.1 38444.2 lineto
33411.6 38406.7 lineto
stroke
newpath
34236.5 37956.8 moveto
34161.5 37994.3 lineto
34124 38031.8 lineto
34086.5 38106.8 lineto
34086.5 38331.8 lineto
34124 38406.7 lineto
34161.5 38444.2 lineto
34236.5 38481.7 lineto
34349 38481.7 lineto
34424 38444.2 lineto
34461.4 38406.7 lineto
34498.9 38331.8 lineto
34498.9 38106.8 lineto
34461.4 38031.8 lineto
34424 37994.3 lineto
34349 37956.8 lineto
34236.5 37956.8 lineto
stroke
newpath
34948.9 37956.8 moveto
34873.9 37994.3 lineto
34836.4 38069.3 lineto
34836.4 38744.2 lineto
stroke
newpath
35548.8 37994.3 moveto
35473.8 37956.8 lineto
35323.8 37956.8 lineto
35248.9 37994.3 lineto
35211.4 38069.3 lineto
35211.4 38369.2 lineto
35248.9 38444.2 lineto
35323.8 38481.7 lineto
35473.8 38481.7 lineto
35548.8 38444.2 lineto
35586.3 38369.2 lineto
35586.3 38294.3 lineto
35211.4 38219.3 lineto
stroke
newpath
35886.3 37994.3 moveto
35961.3 37956.8 lineto
36111.2 37956.8 lineto
36186.2 37994.3 lineto
36223.7 38069.3 lineto
36223.7 38106.8 lineto
36186.2 38181.8 lineto
36111.2 38219.3 lineto
35998.8 38219.3 lineto
35923.8 38256.8 lineto
35886.3 38331.8 lineto
35886.3 38369.2 lineto
35923.8 38444.2 lineto
35998.8 38481.7 lineto
36111.2 38481.7 lineto
36186.2 38444.2 lineto
stroke
newpath
36486.2 37656.8 moveto
36523.7 37694.3 lineto
36598.7 37806.8 lineto
36636.2 37881.8 lineto
36673.7 37994.3 lineto
36711.2 38181.8 lineto
36711.2 38331.8 lineto
36673.7 38519.2 lineto
36636.2 38631.7 lineto
36598.7 38706.7 lineto
36523.7 38819.2 lineto
36486.2 38856.7 lineto
stroke
78.7394 setlinewidth
newpath
16555.6 36659.5 moveto
16949.3 37053.2 lineto
16555.6 37446.9 lineto
16161.9 37053.2 lineto
16555.6 36659.5 lineto
poly0
236.22 setlinewidth
78.7406 setlinewidth
0 0 0 setrgbcolor
0 0 0 setrgbcolor
newpath
18376 36697 moveto
17926 36697 lineto
stroke
newpath
18151 36697 moveto
18151 37484.4 lineto
18076 37371.9 lineto
18001 37296.9 lineto
17926 37259.4 lineto
stroke
newpath
18713.4 36771.9 moveto
18750.9 36734.5 lineto
18713.4 36697 lineto
18675.9 36734.5 lineto
18713.4 36771.9 lineto
18713.4 36697 lineto
stroke
newpath
19013.4 37484.4 moveto
19500.8 37484.4 lineto
19238.3 37184.4 lineto
19350.8 37184.4 lineto
19425.8 37146.9 lineto
19463.3 37109.4 lineto
19500.8 37034.4 lineto
19500.8 36846.9 lineto
19463.3 36771.9 lineto
19425.8 36734.5 lineto
19350.8 36697 lineto
19125.9 36697 lineto
19050.9 36734.5 lineto
19013.4 36771.9 lineto
stroke
newpath
19988.3 37484.4 moveto
20063.2 37484.4 lineto
20138.2 37446.9 lineto
20175.7 37409.4 lineto
20213.2 37334.4 lineto
20250.7 37184.4 lineto
20250.7 36996.9 lineto
20213.2 36846.9 lineto
20175.7 36771.9 lineto
20138.2 36734.5 lineto
20063.2 36697 lineto
19988.3 36697 lineto
19913.3 36734.5 lineto
19875.8 36771.9 lineto
19838.3 36846.9 lineto
19800.8 36996.9 lineto
19800.8 37184.4 lineto
19838.3 37334.4 lineto
19875.8 37409.4 lineto
19913.3 37446.9 lineto
19988.3 37484.4 lineto
stroke
newpath
20738.2 37484.4 moveto
20813.1 37484.4 lineto
20888.1 37446.9 lineto
20925.6 37409.4 lineto
20963.1 37334.4 lineto
21000.6 37184.4 lineto
21000.6 36996.9 lineto
20963.1 36846.9 lineto
20925.6 36771.9 lineto
20888.1 36734.5 lineto
20813.1 36697 lineto
20738.2 36697 lineto
20663.2 36734.5 lineto
20625.7 36771.9 lineto
20588.2 36846.9 lineto
20550.7 36996.9 lineto
20550.7 37184.4 lineto
20588.2 37334.4 lineto
20625.7 37409.4 lineto
20663.2 37446.9 lineto
20738.2 37484.4 lineto
stroke
newpath
21338.1 36697 moveto
21338.1 37221.9 lineto
stroke
newpath
21338.1 37146.9 moveto
21375.6 37184.4 lineto
21450.6 37221.9 lineto
21563.1 37221.9 lineto
21638 37184.4 lineto
21675.5 37109.4 lineto
21675.5 36697 lineto
stroke
newpath
21675.5 37109.4 moveto
21713 37184.4 lineto
21788 37221.9 lineto
21900.5 37221.9 lineto
21975.5 37184.4 lineto
22013 37109.4 lineto
22013 36697 lineto
stroke
newpath
22388 36697 moveto
22388 37221.9 lineto
stroke
newpath
22388 37146.9 moveto
22425.4 37184.4 lineto
22500.4 37221.9 lineto
22612.9 37221.9 lineto
22687.9 37184.4 lineto
22725.4 37109.4 lineto
22725.4 36697 lineto
stroke
newpath
22725.4 37109.4 moveto
22762.9 37184.4 lineto
22837.9 37221.9 lineto
22950.4 37221.9 lineto
23025.4 37184.4 lineto
23062.9 37109.4 lineto
23062.9 36697 lineto
stroke
newpath
24600.2 37521.9 moveto
23925.3 36509.5 lineto
stroke
newpath
25612.6 37484.4 moveto
25687.5 37484.4 lineto
25762.5 37446.9 lineto
25800 37409.4 lineto
25837.5 37334.4 lineto
25875 37184.4 lineto
25875 36996.9 lineto
25837.5 36846.9 lineto
25800 36771.9 lineto
25762.5 36734.5 lineto
25687.5 36697 lineto
25612.6 36697 lineto
25537.6 36734.5 lineto
25500.1 36771.9 lineto
25462.6 36846.9 lineto
25425.1 36996.9 lineto
25425.1 37184.4 lineto
25462.6 37334.4 lineto
25500.1 37409.4 lineto
25537.6 37446.9 lineto
25612.6 37484.4 lineto
stroke
newpath
26212.5 36771.9 moveto
26250 36734.5 lineto
26212.5 36697 lineto
26175 36734.5 lineto
26212.5 36771.9 lineto
26212.5 36697 lineto
stroke
newpath
26737.4 37484.4 moveto
26812.4 37484.4 lineto
26887.4 37446.9 lineto
26924.9 37409.4 lineto
26962.4 37334.4 lineto
26999.9 37184.4 lineto
26999.9 36996.9 lineto
26962.4 36846.9 lineto
26924.9 36771.9 lineto
26887.4 36734.5 lineto
26812.4 36697 lineto
26737.4 36697 lineto
26662.4 36734.5 lineto
26624.9 36771.9 lineto
26587.4 36846.9 lineto
26549.9 36996.9 lineto
26549.9 37184.4 lineto
26587.4 37334.4 lineto
26624.9 37409.4 lineto
26662.4 37446.9 lineto
26737.4 37484.4 lineto
stroke
newpath
27712.3 37484.4 moveto
27337.3 37484.4 lineto
27299.8 37109.4 lineto
27337.3 37146.9 lineto
27412.3 37184.4 lineto
27599.8 37184.4 lineto
27674.8 37146.9 lineto
27712.3 37109.4 lineto
27749.8 37034.4 lineto
27749.8 36846.9 lineto
27712.3 36771.9 lineto
27674.8 36734.5 lineto
27599.8 36697 lineto
27412.3 36697 lineto
27337.3 36734.5 lineto
27299.8 36771.9 lineto
stroke
newpath
28499.7 36697 moveto
28049.7 36697 lineto
stroke
newpath
28274.7 36697 moveto
28274.7 37484.4 lineto
28199.7 37371.9 lineto
28124.7 37296.9 lineto
28049.7 37259.4 lineto
stroke
newpath
28799.7 37409.4 moveto
28837.1 37446.9 lineto
28912.1 37484.4 lineto
29099.6 37484.4 lineto
29174.6 37446.9 lineto
29212.1 37409.4 lineto
29249.6 37334.4 lineto
29249.6 37259.4 lineto
29212.1 37146.9 lineto
28762.2 36697 lineto
29249.6 36697 lineto
stroke
newpath
29549.6 37484.4 moveto
29549.6 37334.4 lineto
stroke
newpath
29849.5 37484.4 moveto
29849.5 37334.4 lineto
stroke
newpath
31011.9 36397 moveto
30974.4 36434.5 lineto
30899.4 36547 lineto
30861.9 36622 lineto
30824.4 36734.5 lineto
30786.9 36921.9 lineto
30786.9 37071.9 lineto
30824.4 37259.4 lineto
30861.9 37371.9 lineto
30899.4 37446.9 lineto
30974.4 37559.4 lineto
31011.9 37596.8 lineto
stroke
newpath
31424.3 37146.9 moveto
31349.3 37184.4 lineto
31311.8 37221.9 lineto
31274.3 37296.9 lineto
31274.3 37334.4 lineto
31311.8 37409.4 lineto
31349.3 37446.9 lineto
31424.3 37484.4 lineto
31574.3 37484.4 lineto
31649.3 37446.9 lineto
31686.8 37409.4 lineto
31724.3 37334.4 lineto
31724.3 37296.9 lineto
31686.8 37221.9 lineto
31649.3 37184.4 lineto
31574.3 37146.9 lineto
31424.3 37146.9 lineto
31349.3 37109.4 lineto
31311.8 37071.9 lineto
31274.3 36996.9 lineto
31274.3 36846.9 lineto
31311.8 36771.9 lineto
31349.3 36734.5 lineto
31424.3 36697 lineto
31574.3 36697 lineto
31649.3 36734.5 lineto
31686.8 36771.9 lineto
31724.3 36846.9 lineto
31724.3 36996.9 lineto
31686.8 37071.9 lineto
31649.3 37109.4 lineto
31574.3 37146.9 lineto
stroke
newpath
32661.7 36697 moveto
32661.7 37484.4 lineto
stroke
newpath
32999.1 36697 moveto
32999.1 37109.4 lineto
32961.6 37184.4 lineto
32886.6 37221.9 lineto
32774.2 37221.9 lineto
32699.2 37184.4 lineto
32661.7 37146.9 lineto
stroke
newpath
33486.6 36697 moveto
33411.6 36734.5 lineto
33374.1 36771.9 lineto
33336.6 36846.9 lineto
33336.6 37071.9 lineto
33374.1 37146.9 lineto
33411.6 37184.4 lineto
33486.6 37221.9 lineto
33599.1 37221.9 lineto
33674 37184.4 lineto
33711.5 37146.9 lineto
33749 37071.9 lineto
33749 36846.9 lineto
33711.5 36771.9 lineto
33674 36734.5 lineto
33599.1 36697 lineto
33486.6 36697 lineto
stroke
newpath
34199 36697 moveto
34124 36734.5 lineto
34086.5 36809.4 lineto
34086.5 37484.4 lineto
stroke
newpath
34798.9 36734.5 moveto
34723.9 36697 lineto
34573.9 36697 lineto
34498.9 36734.5 lineto
34461.4 36809.4 lineto
34461.4 37109.4 lineto
34498.9 37184.4 lineto
34573.9 37221.9 lineto
34723.9 37221.9 lineto
34798.9 37184.4 lineto
34836.4 37109.4 lineto
34836.4 37034.4 lineto
34461.4 36959.4 lineto
stroke
newpath
35136.4 36734.5 moveto
35211.4 36697 lineto
35361.3 36697 lineto
35436.3 36734.5 lineto
35473.8 36809.4 lineto
35473.8 36846.9 lineto
35436.3 36921.9 lineto
35361.3 36959.4 lineto
35248.9 36959.4 lineto
35173.9 36996.9 lineto
35136.4 37071.9 lineto
35136.4 37109.4 lineto
35173.9 37184.4 lineto
35248.9 37221.9 lineto
35361.3 37221.9 lineto
35436.3 37184.4 lineto
stroke
newpath
35736.3 36397 moveto
35773.8 36434.5 lineto
35848.8 36547 lineto
35886.3 36622 lineto
35923.8 36734.5 lineto
35961.3 36921.9 lineto
35961.3 37071.9 lineto
35923.8 37259.4 lineto
35886.3 37371.9 lineto
35848.8 37446.9 lineto
35773.8 37559.4 lineto
35736.3 37596.8 lineto
stroke
showpage
grestore
%%EOF
