%!PS-Adobe-3.0
%%Creator: PCBNEW
%%CreationDate: Sat Oct 16 17:42:07 2021
%%Title: ()
%%Pages: 1
%%PageOrder: Ascend
%%BoundingBox: 0 0 596 842
%%DocumentMedia: A4 595 842 0 () ()
%%Orientation: Landscape
%%EndComments
%%BeginProlog
/line { newpath moveto lineto stroke } bind def
/cir0 { newpath 0 360 arc stroke } bind def
/cir1 { newpath 0 360 arc gsave fill grestore stroke } bind def
/cir2 { newpath 0 360 arc gsave fill grestore stroke } bind def
/arc0 { newpath arc stroke } bind def
/arc1 { newpath 4 index 4 index moveto arc closepath gsave fill
    grestore stroke } bind def
/arc2 { newpath 4 index 4 index moveto arc closepath gsave fill
    grestore stroke } bind def
/poly0 { stroke } bind def
/poly1 { closepath gsave fill grestore stroke } bind def
/poly2 { closepath gsave fill grestore stroke } bind def
/rect0 { rectstroke } bind def
/rect1 { rectfill } bind def
/rect2 { rectfill } bind def
/linemode0 { 0 setlinecap 0 setlinejoin 0 setlinewidth } bind def
/linemode1 { 1 setlinecap 1 setlinejoin } bind def
/dashedline { [200] 100 setdash } bind def
/solidline { [] 0 setdash } bind def
/phantomshow { moveto
    /KicadFont findfont 0.000001 scalefont setfont
    show } bind def
/textshow { gsave
    findfont exch scalefont setfont concat 1 scale 0 0 moveto show
    } bind def
/reencodefont {
  findfont dup length dict begin
  { 1 index /FID ne
    { def }
    { pop pop } ifelse
  } forall
  /Encoding ISOLatin1Encoding def
  currentdict
  end } bind def
/KicadFont /Helvetica reencodefont definefont pop
/KicadFont-Bold /Helvetica-Bold reencodefont definefont pop
/KicadFont-Oblique /Helvetica-Oblique reencodefont definefont pop
/KicadFont-BoldOblique /Helvetica-BoldOblique reencodefont definefont pop
%%EndProlog
%%Page: 1 1
%%BeginPageSetup
gsave
0.0072 0.0072 scale
linemode1
82680 0 translate 90 rotate
236.22 setlinewidth
%%EndPageSetup
0 0 0 setrgbcolor
118.11 setlinewidth
98622.5 45474.4 1181.1 -90 -0 arc0
0 0 0 setrgbcolor
18307.5 45474.4 1181.1 -180 -90 arc0
0 0 0 setrgbcolor
newpath
98622.5 71458.7 moveto
80905.9 71458.7 lineto
stroke
0 0 0 setrgbcolor
newpath
99803.6 45474.4 moveto
99803.6 46655.5 lineto
stroke
0 0 0 setrgbcolor
newpath
17126.4 69096.5 moveto
17126.4 46655.5 lineto
stroke
0 0 0 setrgbcolor
newpath
99803.6 69096.5 moveto
99803.6 70277.6 lineto
stroke
0 0 0 setrgbcolor
newpath
18307.5 71458.7 moveto
80905.9 71458.7 lineto
stroke
0 0 0 setrgbcolor
newpath
99803.6 46655.5 moveto
99803.6 69096.5 lineto
stroke
0 0 0 setrgbcolor
newpath
17126.4 45474.4 moveto
17126.4 46655.5 lineto
stroke
0 0 0 setrgbcolor
newpath
18307.5 44293.3 moveto
80905.9 44293.3 lineto
stroke
0 0 0 setrgbcolor
newpath
80905.9 44293.3 moveto
98622.5 44293.3 lineto
stroke
0 0 0 setrgbcolor
newpath
17126.4 69096.5 moveto
17126.4 70277.6 lineto
stroke
0 0 0 setrgbcolor
98622.5 70277.6 1181.1 -0 90 arc0
0 0 0 setrgbcolor
18307.5 70277.6 1181.1 90 180 arc0
236.22 setlinewidth
76.7717 setlinewidth
newpath
24632.3 64626 moveto
25400 63858.3 lineto
stroke
newpath
25400 64626 moveto
24632.3 63858.3 lineto
stroke
newpath
24632.3 57799.2 moveto
25400 57031.5 lineto
stroke
newpath
25400 57799.2 moveto
24632.3 57031.5 lineto
stroke
259.843 setlinewidth
19488.6 69096.5 1299.21 cir0
63189.4 69096.5 1299.21 cir0
63189.4 46655.5 1299.21 cir0
236.22 setlinewidth
78.7406 setlinewidth
0 0 0 setrgbcolor
0 0 0 setrgbcolor
newpath
17963.5 42893.8 moveto
17963.5 43681.2 lineto
18151 43681.2 lineto
18263.5 43643.7 lineto
18338.5 43568.7 lineto
18376 43493.7 lineto
18413.4 43343.8 lineto
18413.4 43231.3 lineto
18376 43081.3 lineto
18338.5 43006.3 lineto
18263.5 42931.3 lineto
18151 42893.8 lineto
17963.5 42893.8 lineto
stroke
newpath
18750.9 42893.8 moveto
18750.9 43418.7 lineto
stroke
newpath
18750.9 43268.8 moveto
18788.4 43343.8 lineto
18825.9 43381.2 lineto
18900.9 43418.7 lineto
18975.9 43418.7 lineto
stroke
newpath
19238.3 42893.8 moveto
19238.3 43418.7 lineto
stroke
newpath
19238.3 43681.2 moveto
19200.8 43643.7 lineto
19238.3 43606.2 lineto
19275.8 43643.7 lineto
19238.3 43681.2 lineto
19238.3 43606.2 lineto
stroke
newpath
19725.8 42893.8 moveto
19650.8 42931.3 lineto
19613.3 43006.3 lineto
19613.3 43681.2 lineto
stroke
newpath
20138.2 42893.8 moveto
20063.2 42931.3 lineto
20025.7 43006.3 lineto
20025.7 43681.2 lineto
stroke
newpath
21038.1 42893.8 moveto
21038.1 43681.2 lineto
21300.6 43118.8 lineto
21563.1 43681.2 lineto
21563.1 42893.8 lineto
stroke
newpath
22275.5 42893.8 moveto
22275.5 43306.3 lineto
22238 43381.2 lineto
22163 43418.7 lineto
22013 43418.7 lineto
21938 43381.2 lineto
stroke
newpath
22275.5 42931.3 moveto
22200.5 42893.8 lineto
22013 42893.8 lineto
21938 42931.3 lineto
21900.5 43006.3 lineto
21900.5 43081.3 lineto
21938 43156.3 lineto
22013 43193.8 lineto
22200.5 43193.8 lineto
22275.5 43231.3 lineto
stroke
newpath
22650.4 43418.7 moveto
22650.4 42631.3 lineto
stroke
newpath
22650.4 43381.2 moveto
22725.4 43418.7 lineto
22875.4 43418.7 lineto
22950.4 43381.2 lineto
22987.9 43343.8 lineto
23025.4 43268.8 lineto
23025.4 43043.8 lineto
22987.9 42968.8 lineto
22950.4 42931.3 lineto
22875.4 42893.8 lineto
22725.4 42893.8 lineto
22650.4 42931.3 lineto
stroke
newpath
23362.8 42968.8 moveto
23400.3 42931.3 lineto
23362.8 42893.8 lineto
23325.3 42931.3 lineto
23362.8 42968.8 lineto
23362.8 42893.8 lineto
stroke
newpath
23362.8 43381.2 moveto
23400.3 43343.8 lineto
23362.8 43306.3 lineto
23325.3 43343.8 lineto
23362.8 43381.2 lineto
23362.8 43306.3 lineto
stroke
76.7717 setlinewidth
newpath
16181.5 41980.3 moveto
16949.3 41212.6 lineto
stroke
newpath
16949.3 41980.3 moveto
16181.5 41212.6 lineto
stroke
236.22 setlinewidth
78.7406 setlinewidth
0 0 0 setrgbcolor
0 0 0 setrgbcolor
newpath
18113.5 42027.7 moveto
18188.5 42027.7 lineto
18263.5 41990.2 lineto
18301 41952.7 lineto
18338.5 41877.7 lineto
18376 41727.7 lineto
18376 41540.2 lineto
18338.5 41390.2 lineto
18301 41315.3 lineto
18263.5 41277.8 lineto
18188.5 41240.3 lineto
18113.5 41240.3 lineto
18038.5 41277.8 lineto
18001 41315.3 lineto
17963.5 41390.2 lineto
17926 41540.2 lineto
17926 41727.7 lineto
17963.5 41877.7 lineto
18001 41952.7 lineto
18038.5 41990.2 lineto
18113.5 42027.7 lineto
stroke
newpath
18713.4 41315.3 moveto
18750.9 41277.8 lineto
18713.4 41240.3 lineto
18675.9 41277.8 lineto
18713.4 41315.3 lineto
18713.4 41240.3 lineto
stroke
newpath
19425.8 42027.7 moveto
19275.8 42027.7 lineto
19200.8 41990.2 lineto
19163.4 41952.7 lineto
19088.4 41840.2 lineto
19050.9 41690.2 lineto
19050.9 41390.2 lineto
19088.4 41315.3 lineto
19125.9 41277.8 lineto
19200.8 41240.3 lineto
19350.8 41240.3 lineto
19425.8 41277.8 lineto
19463.3 41315.3 lineto
19500.8 41390.2 lineto
19500.8 41577.7 lineto
19463.3 41652.7 lineto
19425.8 41690.2 lineto
19350.8 41727.7 lineto
19200.8 41727.7 lineto
19125.9 41690.2 lineto
19088.4 41652.7 lineto
19050.9 41577.7 lineto
stroke
newpath
20213.2 42027.7 moveto
19838.3 42027.7 lineto
19800.8 41652.7 lineto
19838.3 41690.2 lineto
19913.3 41727.7 lineto
20100.7 41727.7 lineto
20175.7 41690.2 lineto
20213.2 41652.7 lineto
20250.7 41577.7 lineto
20250.7 41390.2 lineto
20213.2 41315.3 lineto
20175.7 41277.8 lineto
20100.7 41240.3 lineto
19913.3 41240.3 lineto
19838.3 41277.8 lineto
19800.8 41315.3 lineto
stroke
newpath
20738.2 42027.7 moveto
20813.1 42027.7 lineto
20888.1 41990.2 lineto
20925.6 41952.7 lineto
20963.1 41877.7 lineto
21000.6 41727.7 lineto
21000.6 41540.2 lineto
20963.1 41390.2 lineto
20925.6 41315.3 lineto
20888.1 41277.8 lineto
20813.1 41240.3 lineto
20738.2 41240.3 lineto
20663.2 41277.8 lineto
20625.7 41315.3 lineto
20588.2 41390.2 lineto
20550.7 41540.2 lineto
20550.7 41727.7 lineto
20588.2 41877.7 lineto
20625.7 41952.7 lineto
20663.2 41990.2 lineto
20738.2 42027.7 lineto
stroke
newpath
21338.1 41240.3 moveto
21338.1 41765.2 lineto
stroke
newpath
21338.1 41690.2 moveto
21375.6 41727.7 lineto
21450.6 41765.2 lineto
21563.1 41765.2 lineto
21638 41727.7 lineto
21675.5 41652.7 lineto
21675.5 41240.3 lineto
stroke
newpath
21675.5 41652.7 moveto
21713 41727.7 lineto
21788 41765.2 lineto
21900.5 41765.2 lineto
21975.5 41727.7 lineto
22013 41652.7 lineto
22013 41240.3 lineto
stroke
newpath
22388 41240.3 moveto
22388 41765.2 lineto
stroke
newpath
22388 41690.2 moveto
22425.4 41727.7 lineto
22500.4 41765.2 lineto
22612.9 41765.2 lineto
22687.9 41727.7 lineto
22725.4 41652.7 lineto
22725.4 41240.3 lineto
stroke
newpath
22725.4 41652.7 moveto
22762.9 41727.7 lineto
22837.9 41765.2 lineto
22950.4 41765.2 lineto
23025.4 41727.7 lineto
23062.9 41652.7 lineto
23062.9 41240.3 lineto
stroke
newpath
24600.2 42065.2 moveto
23925.3 41052.8 lineto
stroke
newpath
25612.6 42027.7 moveto
25687.5 42027.7 lineto
25762.5 41990.2 lineto
25800 41952.7 lineto
25837.5 41877.7 lineto
25875 41727.7 lineto
25875 41540.2 lineto
25837.5 41390.2 lineto
25800 41315.3 lineto
25762.5 41277.8 lineto
25687.5 41240.3 lineto
25612.6 41240.3 lineto
25537.6 41277.8 lineto
25500.1 41315.3 lineto
25462.6 41390.2 lineto
25425.1 41540.2 lineto
25425.1 41727.7 lineto
25462.6 41877.7 lineto
25500.1 41952.7 lineto
25537.6 41990.2 lineto
25612.6 42027.7 lineto
stroke
newpath
26212.5 41315.3 moveto
26250 41277.8 lineto
26212.5 41240.3 lineto
26175 41277.8 lineto
26212.5 41315.3 lineto
26212.5 41240.3 lineto
stroke
newpath
26737.4 42027.7 moveto
26812.4 42027.7 lineto
26887.4 41990.2 lineto
26924.9 41952.7 lineto
26962.4 41877.7 lineto
26999.9 41727.7 lineto
26999.9 41540.2 lineto
26962.4 41390.2 lineto
26924.9 41315.3 lineto
26887.4 41277.8 lineto
26812.4 41240.3 lineto
26737.4 41240.3 lineto
26662.4 41277.8 lineto
26624.9 41315.3 lineto
26587.4 41390.2 lineto
26549.9 41540.2 lineto
26549.9 41727.7 lineto
26587.4 41877.7 lineto
26624.9 41952.7 lineto
26662.4 41990.2 lineto
26737.4 42027.7 lineto
stroke
newpath
27299.8 41952.7 moveto
27337.3 41990.2 lineto
27412.3 42027.7 lineto
27599.8 42027.7 lineto
27674.8 41990.2 lineto
27712.3 41952.7 lineto
27749.8 41877.7 lineto
27749.8 41802.7 lineto
27712.3 41690.2 lineto
27262.3 41240.3 lineto
27749.8 41240.3 lineto
stroke
newpath
28462.2 42027.7 moveto
28087.2 42027.7 lineto
28049.7 41652.7 lineto
28087.2 41690.2 lineto
28162.2 41727.7 lineto
28349.7 41727.7 lineto
28424.7 41690.2 lineto
28462.2 41652.7 lineto
28499.7 41577.7 lineto
28499.7 41390.2 lineto
28462.2 41315.3 lineto
28424.7 41277.8 lineto
28349.7 41240.3 lineto
28162.2 41240.3 lineto
28087.2 41277.8 lineto
28049.7 41315.3 lineto
stroke
newpath
29174.6 42027.7 moveto
29024.6 42027.7 lineto
28949.6 41990.2 lineto
28912.1 41952.7 lineto
28837.1 41840.2 lineto
28799.7 41690.2 lineto
28799.7 41390.2 lineto
28837.1 41315.3 lineto
28874.6 41277.8 lineto
28949.6 41240.3 lineto
29099.6 41240.3 lineto
29174.6 41277.8 lineto
29212.1 41315.3 lineto
29249.6 41390.2 lineto
29249.6 41577.7 lineto
29212.1 41652.7 lineto
29174.6 41690.2 lineto
29099.6 41727.7 lineto
28949.6 41727.7 lineto
28874.6 41690.2 lineto
28837.1 41652.7 lineto
28799.7 41577.7 lineto
stroke
newpath
29549.6 42027.7 moveto
29549.6 41877.7 lineto
stroke
newpath
29849.5 42027.7 moveto
29849.5 41877.7 lineto
stroke
newpath
31011.9 40940.3 moveto
30974.4 40977.8 lineto
30899.4 41090.3 lineto
30861.9 41165.3 lineto
30824.4 41277.8 lineto
30786.9 41465.2 lineto
30786.9 41615.2 lineto
30824.4 41802.7 lineto
30861.9 41915.2 lineto
30899.4 41990.2 lineto
30974.4 42102.7 lineto
31011.9 42140.2 lineto
stroke
newpath
31274.3 41952.7 moveto
31311.8 41990.2 lineto
31386.8 42027.7 lineto
31574.3 42027.7 lineto
31649.3 41990.2 lineto
31686.8 41952.7 lineto
31724.3 41877.7 lineto
31724.3 41802.7 lineto
31686.8 41690.2 lineto
31236.9 41240.3 lineto
31724.3 41240.3 lineto
stroke
newpath
32661.7 41240.3 moveto
32661.7 42027.7 lineto
stroke
newpath
32999.1 41240.3 moveto
32999.1 41652.7 lineto
32961.6 41727.7 lineto
32886.6 41765.2 lineto
32774.2 41765.2 lineto
32699.2 41727.7 lineto
32661.7 41690.2 lineto
stroke
newpath
33486.6 41240.3 moveto
33411.6 41277.8 lineto
33374.1 41315.3 lineto
33336.6 41390.2 lineto
33336.6 41615.2 lineto
33374.1 41690.2 lineto
33411.6 41727.7 lineto
33486.6 41765.2 lineto
33599.1 41765.2 lineto
33674 41727.7 lineto
33711.5 41690.2 lineto
33749 41615.2 lineto
33749 41390.2 lineto
33711.5 41315.3 lineto
33674 41277.8 lineto
33599.1 41240.3 lineto
33486.6 41240.3 lineto
stroke
newpath
34199 41240.3 moveto
34124 41277.8 lineto
34086.5 41352.8 lineto
34086.5 42027.7 lineto
stroke
newpath
34798.9 41277.8 moveto
34723.9 41240.3 lineto
34573.9 41240.3 lineto
34498.9 41277.8 lineto
34461.4 41352.8 lineto
34461.4 41652.7 lineto
34498.9 41727.7 lineto
34573.9 41765.2 lineto
34723.9 41765.2 lineto
34798.9 41727.7 lineto
34836.4 41652.7 lineto
34836.4 41577.7 lineto
34461.4 41502.7 lineto
stroke
newpath
35136.4 41277.8 moveto
35211.4 41240.3 lineto
35361.3 41240.3 lineto
35436.3 41277.8 lineto
35473.8 41352.8 lineto
35473.8 41390.2 lineto
35436.3 41465.2 lineto
35361.3 41502.7 lineto
35248.9 41502.7 lineto
35173.9 41540.2 lineto
35136.4 41615.2 lineto
35136.4 41652.7 lineto
35173.9 41727.7 lineto
35248.9 41765.2 lineto
35361.3 41765.2 lineto
35436.3 41727.7 lineto
stroke
newpath
35736.3 40940.3 moveto
35773.8 40977.8 lineto
35848.8 41090.3 lineto
35886.3 41165.3 lineto
35923.8 41277.8 lineto
35961.3 41465.2 lineto
35961.3 41615.2 lineto
35923.8 41802.7 lineto
35886.3 41915.2 lineto
35848.8 41990.2 lineto
35773.8 42102.7 lineto
35736.3 42140.2 lineto
stroke
newpath
37161.1 40940.3 moveto
37123.6 40977.8 lineto
37048.6 41090.3 lineto
37011.1 41165.3 lineto
36973.6 41277.8 lineto
36936.1 41465.2 lineto
36936.1 41615.2 lineto
36973.6 41802.7 lineto
37011.1 41915.2 lineto
37048.6 41990.2 lineto
37123.6 42102.7 lineto
37161.1 42140.2 lineto
stroke
newpath
37461.1 41765.2 moveto
37461.1 41240.3 lineto
stroke
newpath
37461.1 41690.2 moveto
37498.6 41727.7 lineto
37573.6 41765.2 lineto
37686 41765.2 lineto
37761 41727.7 lineto
37798.5 41652.7 lineto
37798.5 41240.3 lineto
stroke
newpath
38286 41240.3 moveto
38211 41277.8 lineto
38173.5 41315.3 lineto
38136 41390.2 lineto
38136 41615.2 lineto
38173.5 41690.2 lineto
38211 41727.7 lineto
38286 41765.2 lineto
38398.5 41765.2 lineto
38473.4 41727.7 lineto
38510.9 41690.2 lineto
38548.4 41615.2 lineto
38548.4 41390.2 lineto
38510.9 41315.3 lineto
38473.4 41277.8 lineto
38398.5 41240.3 lineto
38286 41240.3 lineto
stroke
newpath
38773.4 41765.2 moveto
39073.4 41765.2 lineto
stroke
newpath
38885.9 42027.7 moveto
38885.9 41352.8 lineto
38923.4 41277.8 lineto
38998.4 41240.3 lineto
39073.4 41240.3 lineto
stroke
newpath
39935.8 41765.2 moveto
39935.8 40977.8 lineto
stroke
newpath
39935.8 41727.7 moveto
40010.8 41765.2 lineto
40160.7 41765.2 lineto
40235.7 41727.7 lineto
40273.2 41690.2 lineto
40310.7 41615.2 lineto
40310.7 41390.2 lineto
40273.2 41315.3 lineto
40235.7 41277.8 lineto
40160.7 41240.3 lineto
40010.8 41240.3 lineto
39935.8 41277.8 lineto
stroke
newpath
40760.7 41240.3 moveto
40685.7 41277.8 lineto
40648.2 41352.8 lineto
40648.2 42027.7 lineto
stroke
newpath
41398.1 41240.3 moveto
41398.1 41652.7 lineto
41360.6 41727.7 lineto
41285.6 41765.2 lineto
41135.6 41765.2 lineto
41060.6 41727.7 lineto
stroke
newpath
41398.1 41277.8 moveto
41323.1 41240.3 lineto
41135.6 41240.3 lineto
41060.6 41277.8 lineto
41023.1 41352.8 lineto
41023.1 41427.7 lineto
41060.6 41502.7 lineto
41135.6 41540.2 lineto
41323.1 41540.2 lineto
41398.1 41577.7 lineto
stroke
newpath
41660.6 41765.2 moveto
41960.5 41765.2 lineto
stroke
newpath
41773 42027.7 moveto
41773 41352.8 lineto
41810.5 41277.8 lineto
41885.5 41240.3 lineto
41960.5 41240.3 lineto
stroke
newpath
42522.9 41277.8 moveto
42448 41240.3 lineto
42298 41240.3 lineto
42223 41277.8 lineto
42185.5 41352.8 lineto
42185.5 41652.7 lineto
42223 41727.7 lineto
42298 41765.2 lineto
42448 41765.2 lineto
42522.9 41727.7 lineto
42560.4 41652.7 lineto
42560.4 41577.7 lineto
42185.5 41502.7 lineto
stroke
newpath
43235.4 41240.3 moveto
43235.4 42027.7 lineto
stroke
newpath
43235.4 41277.8 moveto
43160.4 41240.3 lineto
43010.4 41240.3 lineto
42935.4 41277.8 lineto
42897.9 41315.3 lineto
42860.4 41390.2 lineto
42860.4 41615.2 lineto
42897.9 41690.2 lineto
42935.4 41727.7 lineto
43010.4 41765.2 lineto
43160.4 41765.2 lineto
43235.4 41727.7 lineto
stroke
newpath
43535.3 40940.3 moveto
43572.8 40977.8 lineto
43647.8 41090.3 lineto
43685.3 41165.3 lineto
43722.8 41277.8 lineto
43760.3 41465.2 lineto
43760.3 41615.2 lineto
43722.8 41802.7 lineto
43685.3 41915.2 lineto
43647.8 41990.2 lineto
43572.8 42102.7 lineto
43535.3 42140.2 lineto
stroke
78.7394 setlinewidth
16555.6 40356.3 393.7 cir0
236.22 setlinewidth
78.7406 setlinewidth
0 0 0 setrgbcolor
0 0 0 setrgbcolor
newpath
17926 40712.5 moveto
17963.5 40750 lineto
18038.5 40787.5 lineto
18226 40787.5 lineto
18301 40750 lineto
18338.5 40712.5 lineto
18376 40637.5 lineto
18376 40562.5 lineto
18338.5 40450.1 lineto
17888.5 40000.1 lineto
18376 40000.1 lineto
stroke
newpath
18713.4 40075.1 moveto
18750.9 40037.6 lineto
18713.4 40000.1 lineto
18675.9 40037.6 lineto
18713.4 40075.1 lineto
18713.4 40000.1 lineto
stroke
newpath
19050.9 40712.5 moveto
19088.4 40750 lineto
19163.4 40787.5 lineto
19350.8 40787.5 lineto
19425.8 40750 lineto
19463.3 40712.5 lineto
19500.8 40637.5 lineto
19500.8 40562.5 lineto
19463.3 40450.1 lineto
19013.4 40000.1 lineto
19500.8 40000.1 lineto
stroke
newpath
19988.3 40787.5 moveto
20063.2 40787.5 lineto
20138.2 40750 lineto
20175.7 40712.5 lineto
20213.2 40637.5 lineto
20250.7 40487.5 lineto
20250.7 40300.1 lineto
20213.2 40150.1 lineto
20175.7 40075.1 lineto
20138.2 40037.6 lineto
20063.2 40000.1 lineto
19988.3 40000.1 lineto
19913.3 40037.6 lineto
19875.8 40075.1 lineto
19838.3 40150.1 lineto
19800.8 40300.1 lineto
19800.8 40487.5 lineto
19838.3 40637.5 lineto
19875.8 40712.5 lineto
19913.3 40750 lineto
19988.3 40787.5 lineto
stroke
newpath
20738.2 40787.5 moveto
20813.1 40787.5 lineto
20888.1 40750 lineto
20925.6 40712.5 lineto
20963.1 40637.5 lineto
21000.6 40487.5 lineto
21000.6 40300.1 lineto
20963.1 40150.1 lineto
20925.6 40075.1 lineto
20888.1 40037.6 lineto
20813.1 40000.1 lineto
20738.2 40000.1 lineto
20663.2 40037.6 lineto
20625.7 40075.1 lineto
20588.2 40150.1 lineto
20550.7 40300.1 lineto
20550.7 40487.5 lineto
20588.2 40637.5 lineto
20625.7 40712.5 lineto
20663.2 40750 lineto
20738.2 40787.5 lineto
stroke
newpath
21338.1 40000.1 moveto
21338.1 40525 lineto
stroke
newpath
21338.1 40450.1 moveto
21375.6 40487.5 lineto
21450.6 40525 lineto
21563.1 40525 lineto
21638 40487.5 lineto
21675.5 40412.6 lineto
21675.5 40000.1 lineto
stroke
newpath
21675.5 40412.6 moveto
21713 40487.5 lineto
21788 40525 lineto
21900.5 40525 lineto
21975.5 40487.5 lineto
22013 40412.6 lineto
22013 40000.1 lineto
stroke
newpath
22388 40000.1 moveto
22388 40525 lineto
stroke
newpath
22388 40450.1 moveto
22425.4 40487.5 lineto
22500.4 40525 lineto
22612.9 40525 lineto
22687.9 40487.5 lineto
22725.4 40412.6 lineto
22725.4 40000.1 lineto
stroke
newpath
22725.4 40412.6 moveto
22762.9 40487.5 lineto
22837.9 40525 lineto
22950.4 40525 lineto
23025.4 40487.5 lineto
23062.9 40412.6 lineto
23062.9 40000.1 lineto
stroke
newpath
24600.2 40825 moveto
23925.3 39812.6 lineto
stroke
newpath
25612.6 40787.5 moveto
25687.5 40787.5 lineto
25762.5 40750 lineto
25800 40712.5 lineto
25837.5 40637.5 lineto
25875 40487.5 lineto
25875 40300.1 lineto
25837.5 40150.1 lineto
25800 40075.1 lineto
25762.5 40037.6 lineto
25687.5 40000.1 lineto
25612.6 40000.1 lineto
25537.6 40037.6 lineto
25500.1 40075.1 lineto
25462.6 40150.1 lineto
25425.1 40300.1 lineto
25425.1 40487.5 lineto
25462.6 40637.5 lineto
25500.1 40712.5 lineto
25537.6 40750 lineto
25612.6 40787.5 lineto
stroke
newpath
26212.5 40075.1 moveto
26250 40037.6 lineto
26212.5 40000.1 lineto
26175 40037.6 lineto
26212.5 40075.1 lineto
26212.5 40000.1 lineto
stroke
newpath
26737.4 40787.5 moveto
26812.4 40787.5 lineto
26887.4 40750 lineto
26924.9 40712.5 lineto
26962.4 40637.5 lineto
26999.9 40487.5 lineto
26999.9 40300.1 lineto
26962.4 40150.1 lineto
26924.9 40075.1 lineto
26887.4 40037.6 lineto
26812.4 40000.1 lineto
26737.4 40000.1 lineto
26662.4 40037.6 lineto
26624.9 40075.1 lineto
26587.4 40150.1 lineto
26549.9 40300.1 lineto
26549.9 40487.5 lineto
26587.4 40637.5 lineto
26624.9 40712.5 lineto
26662.4 40750 lineto
26737.4 40787.5 lineto
stroke
newpath
27449.8 40450.1 moveto
27374.8 40487.5 lineto
27337.3 40525 lineto
27299.8 40600 lineto
27299.8 40637.5 lineto
27337.3 40712.5 lineto
27374.8 40750 lineto
27449.8 40787.5 lineto
27599.8 40787.5 lineto
27674.8 40750 lineto
27712.3 40712.5 lineto
27749.8 40637.5 lineto
27749.8 40600 lineto
27712.3 40525 lineto
27674.8 40487.5 lineto
27599.8 40450.1 lineto
27449.8 40450.1 lineto
27374.8 40412.6 lineto
27337.3 40375.1 lineto
27299.8 40300.1 lineto
27299.8 40150.1 lineto
27337.3 40075.1 lineto
27374.8 40037.6 lineto
27449.8 40000.1 lineto
27599.8 40000.1 lineto
27674.8 40037.6 lineto
27712.3 40075.1 lineto
27749.8 40150.1 lineto
27749.8 40300.1 lineto
27712.3 40375.1 lineto
27674.8 40412.6 lineto
27599.8 40450.1 lineto
stroke
newpath
28424.7 40787.5 moveto
28274.7 40787.5 lineto
28199.7 40750 lineto
28162.2 40712.5 lineto
28087.2 40600 lineto
28049.7 40450.1 lineto
28049.7 40150.1 lineto
28087.2 40075.1 lineto
28124.7 40037.6 lineto
28199.7 40000.1 lineto
28349.7 40000.1 lineto
28424.7 40037.6 lineto
28462.2 40075.1 lineto
28499.7 40150.1 lineto
28499.7 40337.6 lineto
28462.2 40412.6 lineto
28424.7 40450.1 lineto
28349.7 40487.5 lineto
28199.7 40487.5 lineto
28124.7 40450.1 lineto
28087.2 40412.6 lineto
28049.7 40337.6 lineto
stroke
newpath
29174.6 40787.5 moveto
29024.6 40787.5 lineto
28949.6 40750 lineto
28912.1 40712.5 lineto
28837.1 40600 lineto
28799.7 40450.1 lineto
28799.7 40150.1 lineto
28837.1 40075.1 lineto
28874.6 40037.6 lineto
28949.6 40000.1 lineto
29099.6 40000.1 lineto
29174.6 40037.6 lineto
29212.1 40075.1 lineto
29249.6 40150.1 lineto
29249.6 40337.6 lineto
29212.1 40412.6 lineto
29174.6 40450.1 lineto
29099.6 40487.5 lineto
28949.6 40487.5 lineto
28874.6 40450.1 lineto
28837.1 40412.6 lineto
28799.7 40337.6 lineto
stroke
newpath
29549.6 40787.5 moveto
29549.6 40637.5 lineto
stroke
newpath
29849.5 40787.5 moveto
29849.5 40637.5 lineto
stroke
newpath
31011.9 39700.1 moveto
30974.4 39737.6 lineto
30899.4 39850.1 lineto
30861.9 39925.1 lineto
30824.4 40037.6 lineto
30786.9 40225.1 lineto
30786.9 40375.1 lineto
30824.4 40562.5 lineto
30861.9 40675 lineto
30899.4 40750 lineto
30974.4 40862.5 lineto
31011.9 40900 lineto
stroke
newpath
31236.9 40787.5 moveto
31724.3 40787.5 lineto
31461.8 40487.5 lineto
31574.3 40487.5 lineto
31649.3 40450.1 lineto
31686.8 40412.6 lineto
31724.3 40337.6 lineto
31724.3 40150.1 lineto
31686.8 40075.1 lineto
31649.3 40037.6 lineto
31574.3 40000.1 lineto
31349.3 40000.1 lineto
31274.3 40037.6 lineto
31236.9 40075.1 lineto
stroke
newpath
32661.7 40000.1 moveto
32661.7 40787.5 lineto
stroke
newpath
32999.1 40000.1 moveto
32999.1 40412.6 lineto
32961.6 40487.5 lineto
32886.6 40525 lineto
32774.2 40525 lineto
32699.2 40487.5 lineto
32661.7 40450.1 lineto
stroke
newpath
33486.6 40000.1 moveto
33411.6 40037.6 lineto
33374.1 40075.1 lineto
33336.6 40150.1 lineto
33336.6 40375.1 lineto
33374.1 40450.1 lineto
33411.6 40487.5 lineto
33486.6 40525 lineto
33599.1 40525 lineto
33674 40487.5 lineto
33711.5 40450.1 lineto
33749 40375.1 lineto
33749 40150.1 lineto
33711.5 40075.1 lineto
33674 40037.6 lineto
33599.1 40000.1 lineto
33486.6 40000.1 lineto
stroke
newpath
34199 40000.1 moveto
34124 40037.6 lineto
34086.5 40112.6 lineto
34086.5 40787.5 lineto
stroke
newpath
34798.9 40037.6 moveto
34723.9 40000.1 lineto
34573.9 40000.1 lineto
34498.9 40037.6 lineto
34461.4 40112.6 lineto
34461.4 40412.6 lineto
34498.9 40487.5 lineto
34573.9 40525 lineto
34723.9 40525 lineto
34798.9 40487.5 lineto
34836.4 40412.6 lineto
34836.4 40337.6 lineto
34461.4 40262.6 lineto
stroke
newpath
35136.4 40037.6 moveto
35211.4 40000.1 lineto
35361.3 40000.1 lineto
35436.3 40037.6 lineto
35473.8 40112.6 lineto
35473.8 40150.1 lineto
35436.3 40225.1 lineto
35361.3 40262.6 lineto
35248.9 40262.6 lineto
35173.9 40300.1 lineto
35136.4 40375.1 lineto
35136.4 40412.6 lineto
35173.9 40487.5 lineto
35248.9 40525 lineto
35361.3 40525 lineto
35436.3 40487.5 lineto
stroke
newpath
35736.3 39700.1 moveto
35773.8 39737.6 lineto
35848.8 39850.1 lineto
35886.3 39925.1 lineto
35923.8 40037.6 lineto
35961.3 40225.1 lineto
35961.3 40375.1 lineto
35923.8 40562.5 lineto
35886.3 40675 lineto
35848.8 40750 lineto
35773.8 40862.5 lineto
35736.3 40900 lineto
stroke
newpath
37161.1 39700.1 moveto
37123.6 39737.6 lineto
37048.6 39850.1 lineto
37011.1 39925.1 lineto
36973.6 40037.6 lineto
36936.1 40225.1 lineto
36936.1 40375.1 lineto
36973.6 40562.5 lineto
37011.1 40675 lineto
37048.6 40750 lineto
37123.6 40862.5 lineto
37161.1 40900 lineto
stroke
newpath
37461.1 40525 moveto
37461.1 40000.1 lineto
stroke
newpath
37461.1 40450.1 moveto
37498.6 40487.5 lineto
37573.6 40525 lineto
37686 40525 lineto
37761 40487.5 lineto
37798.5 40412.6 lineto
37798.5 40000.1 lineto
stroke
newpath
38286 40000.1 moveto
38211 40037.6 lineto
38173.5 40075.1 lineto
38136 40150.1 lineto
38136 40375.1 lineto
38173.5 40450.1 lineto
38211 40487.5 lineto
38286 40525 lineto
38398.5 40525 lineto
38473.4 40487.5 lineto
38510.9 40450.1 lineto
38548.4 40375.1 lineto
38548.4 40150.1 lineto
38510.9 40075.1 lineto
38473.4 40037.6 lineto
38398.5 40000.1 lineto
38286 40000.1 lineto
stroke
newpath
38773.4 40525 moveto
39073.4 40525 lineto
stroke
newpath
38885.9 40787.5 moveto
38885.9 40112.6 lineto
38923.4 40037.6 lineto
38998.4 40000.1 lineto
39073.4 40000.1 lineto
stroke
newpath
39935.8 40525 moveto
39935.8 39737.6 lineto
stroke
newpath
39935.8 40487.5 moveto
40010.8 40525 lineto
40160.7 40525 lineto
40235.7 40487.5 lineto
40273.2 40450.1 lineto
40310.7 40375.1 lineto
40310.7 40150.1 lineto
40273.2 40075.1 lineto
40235.7 40037.6 lineto
40160.7 40000.1 lineto
40010.8 40000.1 lineto
39935.8 40037.6 lineto
stroke
newpath
40760.7 40000.1 moveto
40685.7 40037.6 lineto
40648.2 40112.6 lineto
40648.2 40787.5 lineto
stroke
newpath
41398.1 40000.1 moveto
41398.1 40412.6 lineto
41360.6 40487.5 lineto
41285.6 40525 lineto
41135.6 40525 lineto
41060.6 40487.5 lineto
stroke
newpath
41398.1 40037.6 moveto
41323.1 40000.1 lineto
41135.6 40000.1 lineto
41060.6 40037.6 lineto
41023.1 40112.6 lineto
41023.1 40187.6 lineto
41060.6 40262.6 lineto
41135.6 40300.1 lineto
41323.1 40300.1 lineto
41398.1 40337.6 lineto
stroke
newpath
41660.6 40525 moveto
41960.5 40525 lineto
stroke
newpath
41773 40787.5 moveto
41773 40112.6 lineto
41810.5 40037.6 lineto
41885.5 40000.1 lineto
41960.5 40000.1 lineto
stroke
newpath
42522.9 40037.6 moveto
42448 40000.1 lineto
42298 40000.1 lineto
42223 40037.6 lineto
42185.5 40112.6 lineto
42185.5 40412.6 lineto
42223 40487.5 lineto
42298 40525 lineto
42448 40525 lineto
42522.9 40487.5 lineto
42560.4 40412.6 lineto
42560.4 40337.6 lineto
42185.5 40262.6 lineto
stroke
newpath
43235.4 40000.1 moveto
43235.4 40787.5 lineto
stroke
newpath
43235.4 40037.6 moveto
43160.4 40000.1 lineto
43010.4 40000.1 lineto
42935.4 40037.6 lineto
42897.9 40075.1 lineto
42860.4 40150.1 lineto
42860.4 40375.1 lineto
42897.9 40450.1 lineto
42935.4 40487.5 lineto
43010.4 40525 lineto
43160.4 40525 lineto
43235.4 40487.5 lineto
stroke
newpath
43535.3 39700.1 moveto
43572.8 39737.6 lineto
43647.8 39850.1 lineto
43685.3 39925.1 lineto
43722.8 40037.6 lineto
43760.3 40225.1 lineto
43760.3 40375.1 lineto
43722.8 40562.5 lineto
43685.3 40675 lineto
43647.8 40750 lineto
43572.8 40862.5 lineto
43535.3 40900 lineto
stroke
showpage
grestore
%%EOF
