(module LOGO (layer F.Cu)
  (at 0 0)
(attr board_only exclude_from_pos_files exclude_from_bom)
 (fp_text reference "G***" (at 0 0) (layer F.SilkS)
  (effects (font (thickness 0.3)))
  )
  (fp_text value "LOGO" (at 0.75 0) (layer F.SilkS) hide
  (effects (font (thickness 0.3)))
  )
  (fp_poly (pts (xy -0.209226 0.251071) (xy -0.701214 0.251071) (xy -0.721944 0.285070) (xy -0.735415 0.309040) (xy -0.742429 0.325182) (xy -0.742713 0.326915) (xy -0.732725 0.329040) (xy -0.704588 0.330946)
     (xy -0.661074 0.332552) (xy -0.604957 0.333777) (xy -0.539010 0.334539) (xy -0.475989 0.334761) (xy -0.209226 0.334761) (xy -0.209226 1.475378) (xy 0.074478 1.472594) (xy 0.358181 1.469811)
     (xy 0.948441 0.444682) (xy 1.026157 0.309763) (xy 1.101033 0.179884) (xy 1.172399 0.056200) (xy 1.239585 -0.060134) (xy 1.301923 -0.167964) (xy 1.358743 -0.266134) (xy 1.409377 -0.353490)
     (xy 1.453156 -0.428877) (xy 1.489410 -0.491139) (xy 1.517470 -0.539123) (xy 1.536668 -0.571673) (xy 1.546334 -0.587634) (xy 1.547332 -0.589079) (xy 1.554182 -0.582146) (xy 1.570280 -0.558825)
     (xy 1.594527 -0.520914) (xy 1.625821 -0.470210) (xy 1.663063 -0.408510) (xy 1.705153 -0.337611) (xy 1.750991 -0.259310) (xy 1.782768 -0.204441) (xy 2.009570 0.188829) (xy 0.989238 1.956261)
     (xy -1.051920 1.956261) (xy -1.239943 1.629571) (xy -1.283277 1.553678) (xy -1.323052 1.482859) (xy -1.358091 1.419302) (xy -1.387214 1.365196) (xy -1.409243 1.322727) (xy -1.422999 1.294083)
     (xy -1.427334 1.281733) (xy -1.422100 1.270091) (xy -1.407002 1.241515) (xy -1.382696 1.197161) (xy -1.349837 1.138181) (xy -1.309081 1.065727) (xy -1.261082 0.980955) (xy -1.206497 0.885016)
     (xy -1.145980 0.779065) (xy -1.080188 0.664254) (xy -1.009776 0.541737) (xy -0.935399 0.412667) (xy -0.857712 0.278197) (xy -0.817964 0.209524) (xy -0.209226 -0.841537) )(layer F.SilkS) (width  0.000000)
  )
  (fp_poly (pts (xy 1.197991 -1.217120) (xy 1.243594 -1.137745) (xy 1.285651 -1.063978) (xy 1.323064 -0.997789) (xy 1.354733 -0.941148) (xy 1.379560 -0.896024) (xy 1.396446 -0.864388) (xy 1.404292 -0.848208)
     (xy 1.404706 -0.846583) (xy 1.399285 -0.836688) (xy 1.384188 -0.810092) (xy 1.360229 -0.768199) (xy 1.328217 -0.712413) (xy 1.288965 -0.644138) (xy 1.243283 -0.564777) (xy 1.191983 -0.475736)
     (xy 1.135877 -0.378418) (xy 1.075775 -0.274228) (xy 1.012489 -0.164568) (xy 0.946830 -0.050844) (xy 0.879610 0.065541) (xy 0.811639 0.183183) (xy 0.743730 0.300677) (xy 0.676693 0.416619)
     (xy 0.611340 0.529606) (xy 0.548481 0.638234) (xy 0.488929 0.741098) (xy 0.433495 0.836794) (xy 0.382990 0.923918) (xy 0.338224 1.001067) (xy 0.300011 1.066835) (xy 0.269160 1.119820)
     (xy 0.246483 1.158617) (xy 0.232792 1.181821) (xy 0.229432 1.187356) (xy 0.226341 1.191897) (xy 0.223588 1.194445) (xy 0.221153 1.193884) (xy 0.219018 1.189100) (xy 0.217161 1.178977)
     (xy 0.215564 1.162397) (xy 0.214206 1.138247) (xy 0.213068 1.105410) (xy 0.212130 1.062771) (xy 0.211371 1.009214) (xy 0.210773 0.943622) (xy 0.210315 0.864881) (xy 0.209977 0.771875)
     (xy 0.209740 0.663487) (xy 0.209583 0.538603) (xy 0.209488 0.396106) (xy 0.209433 0.234882) (xy 0.209401 0.060153) (xy 0.209225 -1.098435) (xy -0.351395 -1.098435) (xy -0.955703 -0.048200)
     (xy -1.034425 0.088566) (xy -1.110368 0.220418) (xy -1.182868 0.346203) (xy -1.251256 0.464770) (xy -1.314869 0.574966) (xy -1.373039 0.675641) (xy -1.425100 0.765642) (xy -1.470387 0.843816)
     (xy -1.508232 0.909013) (xy -1.537971 0.960080) (xy -1.558936 0.995866) (xy -1.570462 1.015218) (xy -1.572449 1.018334) (xy -1.576845 1.019700) (xy -1.584171 1.014483) (xy -1.595274 1.001340)
     (xy -1.610999 0.978925) (xy -1.632192 0.945897) (xy -1.659697 0.900910) (xy -1.694362 0.842621) (xy -1.737031 0.769688) (xy -1.788551 0.680765) (xy -1.828432 0.611589) (xy -2.071979 0.188546)
     (xy -1.561669 -0.695549) (xy -1.051360 -1.579643) (xy -0.031210 -1.579648) (xy 0.988941 -1.579654) )(layer F.SilkS) (width  0.000000)
  )
)
