M48
; DRILL file {KiCad (5.99.0-11030-gabc5a6e775)} date Wed Jun 23 18:59:04 2021
; FORMAT={-:-/ absolute / inch / decimal}
; #@! TF.CreationDate,2021-06-23T18:59:04-07:00
; #@! TF.GenerationSoftware,Kicad,Pcbnew,(5.99.0-11030-gabc5a6e775)
; #@! TF.FileFunction,NonPlated,1,2,NPTH
FMAT,2
INCH
; #@! TA.AperFunction,NonPlated,NPTH,ComponentDrill
T1C0.0236
%
G90
G05
T1
X4.0886Y-2.3031
X4.0886Y-2.4606
T0
M30
