(kicad_sch (version 20211123) (generator eeschema)

  (uuid 08b6d2d3-96bb-4d5f-af5a-2d83fa8b62bd)

  (paper "A4")

  (lib_symbols
    (symbol "Connector_Generic:Conn_01x09" (pin_names (offset 1.016) hide) (in_bom yes) (on_board yes)
      (property "Reference" "J" (id 0) (at 0 12.7 0)
        (effects (font (size 1.27 1.27)))
      )
      (property "Value" "Conn_01x09" (id 1) (at 0 -12.7 0)
        (effects (font (size 1.27 1.27)))
      )
      (property "Footprint" "" (id 2) (at 0 0 0)
        (effects (font (size 1.27 1.27)) hide)
      )
      (property "Datasheet" "~" (id 3) (at 0 0 0)
        (effects (font (size 1.27 1.27)) hide)
      )
      (property "ki_keywords" "connector" (id 4) (at 0 0 0)
        (effects (font (size 1.27 1.27)) hide)
      )
      (property "ki_description" "Generic connector, single row, 01x09, script generated (kicad-library-utils/schlib/autogen/connector/)" (id 5) (at 0 0 0)
        (effects (font (size 1.27 1.27)) hide)
      )
      (property "ki_fp_filters" "Connector*:*_1x??_*" (id 6) (at 0 0 0)
        (effects (font (size 1.27 1.27)) hide)
      )
      (symbol "Conn_01x09_1_1"
        (rectangle (start -1.27 -10.033) (end 0 -10.287)
          (stroke (width 0.1524) (type default) (color 0 0 0 0))
          (fill (type none))
        )
        (rectangle (start -1.27 -7.493) (end 0 -7.747)
          (stroke (width 0.1524) (type default) (color 0 0 0 0))
          (fill (type none))
        )
        (rectangle (start -1.27 -4.953) (end 0 -5.207)
          (stroke (width 0.1524) (type default) (color 0 0 0 0))
          (fill (type none))
        )
        (rectangle (start -1.27 -2.413) (end 0 -2.667)
          (stroke (width 0.1524) (type default) (color 0 0 0 0))
          (fill (type none))
        )
        (rectangle (start -1.27 0.127) (end 0 -0.127)
          (stroke (width 0.1524) (type default) (color 0 0 0 0))
          (fill (type none))
        )
        (rectangle (start -1.27 2.667) (end 0 2.413)
          (stroke (width 0.1524) (type default) (color 0 0 0 0))
          (fill (type none))
        )
        (rectangle (start -1.27 5.207) (end 0 4.953)
          (stroke (width 0.1524) (type default) (color 0 0 0 0))
          (fill (type none))
        )
        (rectangle (start -1.27 7.747) (end 0 7.493)
          (stroke (width 0.1524) (type default) (color 0 0 0 0))
          (fill (type none))
        )
        (rectangle (start -1.27 10.287) (end 0 10.033)
          (stroke (width 0.1524) (type default) (color 0 0 0 0))
          (fill (type none))
        )
        (rectangle (start -1.27 11.43) (end 1.27 -11.43)
          (stroke (width 0.254) (type default) (color 0 0 0 0))
          (fill (type background))
        )
        (pin passive line (at -5.08 10.16 0) (length 3.81)
          (name "Pin_1" (effects (font (size 1.27 1.27))))
          (number "1" (effects (font (size 1.27 1.27))))
        )
        (pin passive line (at -5.08 7.62 0) (length 3.81)
          (name "Pin_2" (effects (font (size 1.27 1.27))))
          (number "2" (effects (font (size 1.27 1.27))))
        )
        (pin passive line (at -5.08 5.08 0) (length 3.81)
          (name "Pin_3" (effects (font (size 1.27 1.27))))
          (number "3" (effects (font (size 1.27 1.27))))
        )
        (pin passive line (at -5.08 2.54 0) (length 3.81)
          (name "Pin_4" (effects (font (size 1.27 1.27))))
          (number "4" (effects (font (size 1.27 1.27))))
        )
        (pin passive line (at -5.08 0 0) (length 3.81)
          (name "Pin_5" (effects (font (size 1.27 1.27))))
          (number "5" (effects (font (size 1.27 1.27))))
        )
        (pin passive line (at -5.08 -2.54 0) (length 3.81)
          (name "Pin_6" (effects (font (size 1.27 1.27))))
          (number "6" (effects (font (size 1.27 1.27))))
        )
        (pin passive line (at -5.08 -5.08 0) (length 3.81)
          (name "Pin_7" (effects (font (size 1.27 1.27))))
          (number "7" (effects (font (size 1.27 1.27))))
        )
        (pin passive line (at -5.08 -7.62 0) (length 3.81)
          (name "Pin_8" (effects (font (size 1.27 1.27))))
          (number "8" (effects (font (size 1.27 1.27))))
        )
        (pin passive line (at -5.08 -10.16 0) (length 3.81)
          (name "Pin_9" (effects (font (size 1.27 1.27))))
          (number "9" (effects (font (size 1.27 1.27))))
        )
      )
    )
    (symbol "Device:C" (pin_numbers hide) (pin_names (offset 0.254)) (in_bom yes) (on_board yes)
      (property "Reference" "C" (id 0) (at 0.635 2.54 0)
        (effects (font (size 1.27 1.27)) (justify left))
      )
      (property "Value" "C" (id 1) (at 0.635 -2.54 0)
        (effects (font (size 1.27 1.27)) (justify left))
      )
      (property "Footprint" "" (id 2) (at 0.9652 -3.81 0)
        (effects (font (size 1.27 1.27)) hide)
      )
      (property "Datasheet" "~" (id 3) (at 0 0 0)
        (effects (font (size 1.27 1.27)) hide)
      )
      (property "ki_keywords" "cap capacitor" (id 4) (at 0 0 0)
        (effects (font (size 1.27 1.27)) hide)
      )
      (property "ki_description" "Unpolarized capacitor" (id 5) (at 0 0 0)
        (effects (font (size 1.27 1.27)) hide)
      )
      (property "ki_fp_filters" "C_*" (id 6) (at 0 0 0)
        (effects (font (size 1.27 1.27)) hide)
      )
      (symbol "C_0_1"
        (polyline
          (pts
            (xy -2.032 -0.762)
            (xy 2.032 -0.762)
          )
          (stroke (width 0.508) (type default) (color 0 0 0 0))
          (fill (type none))
        )
        (polyline
          (pts
            (xy -2.032 0.762)
            (xy 2.032 0.762)
          )
          (stroke (width 0.508) (type default) (color 0 0 0 0))
          (fill (type none))
        )
      )
      (symbol "C_1_1"
        (pin passive line (at 0 3.81 270) (length 2.794)
          (name "~" (effects (font (size 1.27 1.27))))
          (number "1" (effects (font (size 1.27 1.27))))
        )
        (pin passive line (at 0 -3.81 90) (length 2.794)
          (name "~" (effects (font (size 1.27 1.27))))
          (number "2" (effects (font (size 1.27 1.27))))
        )
      )
    )
    (symbol "Device:LED" (pin_numbers hide) (pin_names (offset 1.016) hide) (in_bom yes) (on_board yes)
      (property "Reference" "D" (id 0) (at 0 2.54 0)
        (effects (font (size 1.27 1.27)))
      )
      (property "Value" "LED" (id 1) (at 0 -2.54 0)
        (effects (font (size 1.27 1.27)))
      )
      (property "Footprint" "" (id 2) (at 0 0 0)
        (effects (font (size 1.27 1.27)) hide)
      )
      (property "Datasheet" "~" (id 3) (at 0 0 0)
        (effects (font (size 1.27 1.27)) hide)
      )
      (property "ki_keywords" "LED diode" (id 4) (at 0 0 0)
        (effects (font (size 1.27 1.27)) hide)
      )
      (property "ki_description" "Light emitting diode" (id 5) (at 0 0 0)
        (effects (font (size 1.27 1.27)) hide)
      )
      (property "ki_fp_filters" "LED* LED_SMD:* LED_THT:*" (id 6) (at 0 0 0)
        (effects (font (size 1.27 1.27)) hide)
      )
      (symbol "LED_0_1"
        (polyline
          (pts
            (xy -1.27 -1.27)
            (xy -1.27 1.27)
          )
          (stroke (width 0.254) (type default) (color 0 0 0 0))
          (fill (type none))
        )
        (polyline
          (pts
            (xy -1.27 0)
            (xy 1.27 0)
          )
          (stroke (width 0) (type default) (color 0 0 0 0))
          (fill (type none))
        )
        (polyline
          (pts
            (xy 1.27 -1.27)
            (xy 1.27 1.27)
            (xy -1.27 0)
            (xy 1.27 -1.27)
          )
          (stroke (width 0.254) (type default) (color 0 0 0 0))
          (fill (type none))
        )
        (polyline
          (pts
            (xy -3.048 -0.762)
            (xy -4.572 -2.286)
            (xy -3.81 -2.286)
            (xy -4.572 -2.286)
            (xy -4.572 -1.524)
          )
          (stroke (width 0) (type default) (color 0 0 0 0))
          (fill (type none))
        )
        (polyline
          (pts
            (xy -1.778 -0.762)
            (xy -3.302 -2.286)
            (xy -2.54 -2.286)
            (xy -3.302 -2.286)
            (xy -3.302 -1.524)
          )
          (stroke (width 0) (type default) (color 0 0 0 0))
          (fill (type none))
        )
      )
      (symbol "LED_1_1"
        (pin passive line (at -3.81 0 0) (length 2.54)
          (name "K" (effects (font (size 1.27 1.27))))
          (number "1" (effects (font (size 1.27 1.27))))
        )
        (pin passive line (at 3.81 0 180) (length 2.54)
          (name "A" (effects (font (size 1.27 1.27))))
          (number "2" (effects (font (size 1.27 1.27))))
        )
      )
    )
    (symbol "Device:R" (pin_numbers hide) (pin_names (offset 0)) (in_bom yes) (on_board yes)
      (property "Reference" "R" (id 0) (at 2.032 0 90)
        (effects (font (size 1.27 1.27)))
      )
      (property "Value" "R" (id 1) (at 0 0 90)
        (effects (font (size 1.27 1.27)))
      )
      (property "Footprint" "" (id 2) (at -1.778 0 90)
        (effects (font (size 1.27 1.27)) hide)
      )
      (property "Datasheet" "~" (id 3) (at 0 0 0)
        (effects (font (size 1.27 1.27)) hide)
      )
      (property "ki_keywords" "R res resistor" (id 4) (at 0 0 0)
        (effects (font (size 1.27 1.27)) hide)
      )
      (property "ki_description" "Resistor" (id 5) (at 0 0 0)
        (effects (font (size 1.27 1.27)) hide)
      )
      (property "ki_fp_filters" "R_*" (id 6) (at 0 0 0)
        (effects (font (size 1.27 1.27)) hide)
      )
      (symbol "R_0_1"
        (rectangle (start -1.016 -2.54) (end 1.016 2.54)
          (stroke (width 0.254) (type default) (color 0 0 0 0))
          (fill (type none))
        )
      )
      (symbol "R_1_1"
        (pin passive line (at 0 3.81 270) (length 1.27)
          (name "~" (effects (font (size 1.27 1.27))))
          (number "1" (effects (font (size 1.27 1.27))))
        )
        (pin passive line (at 0 -3.81 90) (length 1.27)
          (name "~" (effects (font (size 1.27 1.27))))
          (number "2" (effects (font (size 1.27 1.27))))
        )
      )
    )
    (symbol "IMU:ICM-20789" (pin_names (offset 1.016)) (in_bom yes) (on_board yes)
      (property "Reference" "U" (id 0) (at 0 -1.27 0)
        (effects (font (size 1.27 1.27)) (justify left bottom))
      )
      (property "Value" "ICM-20789" (id 1) (at -3.81 -3.81 0)
        (effects (font (size 1.27 1.27)) (justify left bottom))
      )
      (property "Footprint" "" (id 2) (at 24.13 -26.67 0)
        (effects (font (size 1.27 1.27)) (justify left bottom) hide)
      )
      (property "Datasheet" "" (id 3) (at 0 0 0)
        (effects (font (size 1.27 1.27)) (justify left bottom) hide)
      )
      (property "DESCRIPTION" "" (id 4) (at -8.89 -8.89 0)
        (effects (font (size 1.27 1.27)) (justify left bottom) hide)
      )
      (property "NOTES" "" (id 5) (at -57.15 22.86 0)
        (effects (font (size 1.27 1.27)) (justify left bottom) hide)
      )
      (property "MF" "" (id 6) (at -3.81 -3.81 0)
        (effects (font (size 1.27 1.27)) (justify left bottom) hide)
      )
      (property "DIGI-KEY_PURCHASE_URL" "" (id 7) (at -21.59 7.62 0)
        (effects (font (size 1.27 1.27)) (justify left bottom) hide)
      )
      (property "DIGI-KEY_PART_NUMBER" "" (id 8) (at 36.83 -15.24 0)
        (effects (font (size 1.27 1.27)) (justify left bottom) hide)
      )
      (property "MP" "" (id 9) (at -5.08 -6.35 0)
        (effects (font (size 1.27 1.27)) (justify left bottom) hide)
      )
      (property "PACKAGE" "" (id 10) (at 34.29 -8.89 0)
        (effects (font (size 1.27 1.27)) (justify left bottom) hide)
      )
      (property "ki_locked" "" (id 11) (at 0 0 0)
        (effects (font (size 1.27 1.27)))
      )
      (symbol "ICM-20789_0_0"
        (rectangle (start -17.78 -20.32) (end 17.78 20.32)
          (stroke (width 0.4064) (type default) (color 0 0 0 0))
          (fill (type background))
        )
        (pin passive line (at -22.86 -7.62 0) (length 5.08)
          (name "REGOUT" (effects (font (size 1.016 1.016))))
          (number "10" (effects (font (size 1.016 1.016))))
        )
        (pin input line (at -22.86 7.62 0) (length 5.08)
          (name "FSYNC" (effects (font (size 1.016 1.016))))
          (number "11" (effects (font (size 1.016 1.016))))
        )
        (pin output line (at 22.86 0 180) (length 5.08)
          (name "INT" (effects (font (size 1.016 1.016))))
          (number "12" (effects (font (size 1.016 1.016))))
        )
        (pin power_in line (at 22.86 15.24 180) (length 5.08)
          (name "VDD" (effects (font (size 1.016 1.016))))
          (number "13" (effects (font (size 1.016 1.016))))
        )
        (pin power_in line (at 22.86 -17.78 180) (length 5.08)
          (name "GND" (effects (font (size 1.016 1.016))))
          (number "18" (effects (font (size 1.016 1.016))))
        )
        (pin input line (at -22.86 12.7 0) (length 5.08)
          (name "~CS" (effects (font (size 1.016 1.016))))
          (number "22" (effects (font (size 1.016 1.016))))
        )
        (pin input clock (at -22.86 2.54 0) (length 5.08)
          (name "SCL/SCLK" (effects (font (size 1.016 1.016))))
          (number "23" (effects (font (size 1.016 1.016))))
        )
        (pin bidirectional line (at -22.86 0 0) (length 5.08)
          (name "SDA/SDI" (effects (font (size 1.016 1.016))))
          (number "24" (effects (font (size 1.016 1.016))))
        )
        (pin bidirectional line (at -22.86 -10.16 0) (length 5.08)
          (name "PR_DA" (effects (font (size 1.016 1.016))))
          (number "6" (effects (font (size 1.016 1.016))))
        )
        (pin bidirectional line (at -22.86 -12.7 0) (length 5.08)
          (name "PR_CL" (effects (font (size 1.016 1.016))))
          (number "7" (effects (font (size 1.016 1.016))))
        )
        (pin power_in line (at 22.86 17.78 180) (length 5.08)
          (name "VDDIO" (effects (font (size 1.016 1.016))))
          (number "8" (effects (font (size 1.016 1.016))))
        )
        (pin bidirectional line (at -22.86 -2.54 0) (length 5.08)
          (name "AD0/SDO" (effects (font (size 1.016 1.016))))
          (number "9" (effects (font (size 1.016 1.016))))
        )
      )
    )
    (symbol "LSF0204:LSF0204RUTR" (in_bom yes) (on_board yes)
      (property "Reference" "U" (id 0) (at -12.7 12.7 0)
        (effects (font (size 1.27 1.27)))
      )
      (property "Value" "LSF0204RUTR" (id 1) (at -12.7 10.16 0)
        (effects (font (size 1.27 1.27)))
      )
      (property "Footprint" "" (id 2) (at 3.81 0 0)
        (effects (font (size 1.27 1.27)) hide)
      )
      (property "Datasheet" "" (id 3) (at 3.81 0 0)
        (effects (font (size 1.27 1.27)) hide)
      )
      (symbol "LSF0204RUTR_0_1"
        (rectangle (start -6.35 7.62) (end 6.35 -15.24)
          (stroke (width 0) (type default) (color 0 0 0 0))
          (fill (type background))
        )
      )
      (symbol "LSF0204RUTR_1_1"
        (pin power_in line (at -1.27 10.16 270) (length 2.54)
          (name "VA" (effects (font (size 1.27 1.27))))
          (number "1" (effects (font (size 1.27 1.27))))
        )
        (pin bidirectional line (at 8.89 0 180) (length 2.54)
          (name "B1" (effects (font (size 1.27 1.27))))
          (number "10" (effects (font (size 1.27 1.27))))
        )
        (pin power_in line (at 1.27 10.16 270) (length 2.54)
          (name "VB" (effects (font (size 1.27 1.27))))
          (number "11" (effects (font (size 1.27 1.27))))
        )
        (pin bidirectional line (at -8.89 -11.43 0) (length 2.54)
          (name "EN" (effects (font (size 1.27 1.27))))
          (number "12" (effects (font (size 1.27 1.27))))
        )
        (pin bidirectional line (at -8.89 0 0) (length 2.54)
          (name "A1" (effects (font (size 1.27 1.27))))
          (number "2" (effects (font (size 1.27 1.27))))
        )
        (pin bidirectional line (at -8.89 -2.54 0) (length 2.54)
          (name "A2" (effects (font (size 1.27 1.27))))
          (number "3" (effects (font (size 1.27 1.27))))
        )
        (pin bidirectional line (at -8.89 -5.08 0) (length 2.54)
          (name "A3" (effects (font (size 1.27 1.27))))
          (number "4" (effects (font (size 1.27 1.27))))
        )
        (pin bidirectional line (at -8.89 -7.62 0) (length 2.54)
          (name "A4" (effects (font (size 1.27 1.27))))
          (number "5" (effects (font (size 1.27 1.27))))
        )
        (pin power_in line (at 0 -17.78 90) (length 2.54)
          (name "GND" (effects (font (size 1.27 1.27))))
          (number "6" (effects (font (size 1.27 1.27))))
        )
        (pin bidirectional line (at 8.89 -7.62 180) (length 2.54)
          (name "B4" (effects (font (size 1.27 1.27))))
          (number "7" (effects (font (size 1.27 1.27))))
        )
        (pin bidirectional line (at 8.89 -5.08 180) (length 2.54)
          (name "B3" (effects (font (size 1.27 1.27))))
          (number "8" (effects (font (size 1.27 1.27))))
        )
        (pin bidirectional line (at 8.89 -2.54 180) (length 2.54)
          (name "B2" (effects (font (size 1.27 1.27))))
          (number "9" (effects (font (size 1.27 1.27))))
        )
      )
    )
    (symbol "Regulator:NCP161-1.8" (in_bom yes) (on_board yes)
      (property "Reference" "U" (id 0) (at 0 10.16 0)
        (effects (font (size 1.27 1.27)))
      )
      (property "Value" "NCP161-1.8" (id 1) (at 0 7.62 0)
        (effects (font (size 1.27 1.27)))
      )
      (property "Footprint" "" (id 2) (at 1.27 0 0)
        (effects (font (size 1.27 1.27)) hide)
      )
      (property "Datasheet" "" (id 3) (at 1.27 0 0)
        (effects (font (size 1.27 1.27)) hide)
      )
      (symbol "NCP161-1.8_0_1"
        (rectangle (start -7.62 3.81) (end 7.62 -5.08)
          (stroke (width 0) (type default) (color 0 0 0 0))
          (fill (type background))
        )
      )
      (symbol "NCP161-1.8_1_1"
        (pin power_in line (at -10.16 1.27 0) (length 2.54)
          (name "IN" (effects (font (size 1.27 1.27))))
          (number "1" (effects (font (size 1.27 1.27))))
        )
        (pin power_in line (at 0 -7.62 90) (length 2.54)
          (name "GND" (effects (font (size 1.27 1.27))))
          (number "2" (effects (font (size 1.27 1.27))))
        )
        (pin input line (at -10.16 -2.54 0) (length 2.54)
          (name "EN" (effects (font (size 1.27 1.27))))
          (number "3" (effects (font (size 1.27 1.27))))
        )
        (pin power_out line (at 10.16 1.27 180) (length 2.54)
          (name "OUT" (effects (font (size 1.27 1.27))))
          (number "5" (effects (font (size 1.27 1.27))))
        )
      )
    )
    (symbol "power:+1V8" (power) (pin_names (offset 0)) (in_bom yes) (on_board yes)
      (property "Reference" "#PWR" (id 0) (at 0 -3.81 0)
        (effects (font (size 1.27 1.27)) hide)
      )
      (property "Value" "+1V8" (id 1) (at 0 3.556 0)
        (effects (font (size 1.27 1.27)))
      )
      (property "Footprint" "" (id 2) (at 0 0 0)
        (effects (font (size 1.27 1.27)) hide)
      )
      (property "Datasheet" "" (id 3) (at 0 0 0)
        (effects (font (size 1.27 1.27)) hide)
      )
      (property "ki_keywords" "power-flag" (id 4) (at 0 0 0)
        (effects (font (size 1.27 1.27)) hide)
      )
      (property "ki_description" "Power symbol creates a global label with name \"+1V8\"" (id 5) (at 0 0 0)
        (effects (font (size 1.27 1.27)) hide)
      )
      (symbol "+1V8_0_1"
        (polyline
          (pts
            (xy -0.762 1.27)
            (xy 0 2.54)
          )
          (stroke (width 0) (type default) (color 0 0 0 0))
          (fill (type none))
        )
        (polyline
          (pts
            (xy 0 0)
            (xy 0 2.54)
          )
          (stroke (width 0) (type default) (color 0 0 0 0))
          (fill (type none))
        )
        (polyline
          (pts
            (xy 0 2.54)
            (xy 0.762 1.27)
          )
          (stroke (width 0) (type default) (color 0 0 0 0))
          (fill (type none))
        )
      )
      (symbol "+1V8_1_1"
        (pin power_in line (at 0 0 90) (length 0) hide
          (name "+1V8" (effects (font (size 1.27 1.27))))
          (number "1" (effects (font (size 1.27 1.27))))
        )
      )
    )
    (symbol "power:GND" (power) (pin_names (offset 0)) (in_bom yes) (on_board yes)
      (property "Reference" "#PWR" (id 0) (at 0 -6.35 0)
        (effects (font (size 1.27 1.27)) hide)
      )
      (property "Value" "GND" (id 1) (at 0 -3.81 0)
        (effects (font (size 1.27 1.27)))
      )
      (property "Footprint" "" (id 2) (at 0 0 0)
        (effects (font (size 1.27 1.27)) hide)
      )
      (property "Datasheet" "" (id 3) (at 0 0 0)
        (effects (font (size 1.27 1.27)) hide)
      )
      (property "ki_keywords" "power-flag" (id 4) (at 0 0 0)
        (effects (font (size 1.27 1.27)) hide)
      )
      (property "ki_description" "Power symbol creates a global label with name \"GND\" , ground" (id 5) (at 0 0 0)
        (effects (font (size 1.27 1.27)) hide)
      )
      (symbol "GND_0_1"
        (polyline
          (pts
            (xy 0 0)
            (xy 0 -1.27)
            (xy 1.27 -1.27)
            (xy 0 -2.54)
            (xy -1.27 -1.27)
            (xy 0 -1.27)
          )
          (stroke (width 0) (type default) (color 0 0 0 0))
          (fill (type none))
        )
      )
      (symbol "GND_1_1"
        (pin power_in line (at 0 0 270) (length 0) hide
          (name "GND" (effects (font (size 1.27 1.27))))
          (number "1" (effects (font (size 1.27 1.27))))
        )
      )
    )
    (symbol "power:PWR_FLAG" (power) (pin_numbers hide) (pin_names (offset 0) hide) (in_bom yes) (on_board yes)
      (property "Reference" "#FLG" (id 0) (at 0 1.905 0)
        (effects (font (size 1.27 1.27)) hide)
      )
      (property "Value" "PWR_FLAG" (id 1) (at 0 3.81 0)
        (effects (font (size 1.27 1.27)))
      )
      (property "Footprint" "" (id 2) (at 0 0 0)
        (effects (font (size 1.27 1.27)) hide)
      )
      (property "Datasheet" "~" (id 3) (at 0 0 0)
        (effects (font (size 1.27 1.27)) hide)
      )
      (property "ki_keywords" "power-flag" (id 4) (at 0 0 0)
        (effects (font (size 1.27 1.27)) hide)
      )
      (property "ki_description" "Special symbol for telling ERC where power comes from" (id 5) (at 0 0 0)
        (effects (font (size 1.27 1.27)) hide)
      )
      (symbol "PWR_FLAG_0_0"
        (pin power_out line (at 0 0 90) (length 0)
          (name "pwr" (effects (font (size 1.27 1.27))))
          (number "1" (effects (font (size 1.27 1.27))))
        )
      )
      (symbol "PWR_FLAG_0_1"
        (polyline
          (pts
            (xy 0 0)
            (xy 0 1.27)
            (xy -1.016 1.905)
            (xy 0 2.54)
            (xy 1.016 1.905)
            (xy 0 1.27)
          )
          (stroke (width 0) (type default) (color 0 0 0 0))
          (fill (type none))
        )
      )
    )
    (symbol "power:VDD" (power) (pin_names (offset 0)) (in_bom yes) (on_board yes)
      (property "Reference" "#PWR" (id 0) (at 0 -3.81 0)
        (effects (font (size 1.27 1.27)) hide)
      )
      (property "Value" "VDD" (id 1) (at 0 3.81 0)
        (effects (font (size 1.27 1.27)))
      )
      (property "Footprint" "" (id 2) (at 0 0 0)
        (effects (font (size 1.27 1.27)) hide)
      )
      (property "Datasheet" "" (id 3) (at 0 0 0)
        (effects (font (size 1.27 1.27)) hide)
      )
      (property "ki_keywords" "power-flag" (id 4) (at 0 0 0)
        (effects (font (size 1.27 1.27)) hide)
      )
      (property "ki_description" "Power symbol creates a global label with name \"VDD\"" (id 5) (at 0 0 0)
        (effects (font (size 1.27 1.27)) hide)
      )
      (symbol "VDD_0_1"
        (polyline
          (pts
            (xy -0.762 1.27)
            (xy 0 2.54)
          )
          (stroke (width 0) (type default) (color 0 0 0 0))
          (fill (type none))
        )
        (polyline
          (pts
            (xy 0 0)
            (xy 0 2.54)
          )
          (stroke (width 0) (type default) (color 0 0 0 0))
          (fill (type none))
        )
        (polyline
          (pts
            (xy 0 2.54)
            (xy 0.762 1.27)
          )
          (stroke (width 0) (type default) (color 0 0 0 0))
          (fill (type none))
        )
      )
      (symbol "VDD_1_1"
        (pin power_in line (at 0 0 90) (length 0) hide
          (name "VDD" (effects (font (size 1.27 1.27))))
          (number "1" (effects (font (size 1.27 1.27))))
        )
      )
    )
  )

  (junction (at 147.32 104.14) (diameter 0) (color 0 0 0 0)
    (uuid 1d47658d-d012-4f32-aeca-c3463a343bc6)
  )
  (junction (at 157.48 104.14) (diameter 0) (color 0 0 0 0)
    (uuid 1eff43bf-9814-413b-b810-f3099eb17974)
  )
  (junction (at 87.63 36.83) (diameter 0) (color 0 0 0 0)
    (uuid 523e0acc-da36-428b-9682-5bf2258a1e74)
  )
  (junction (at 50.8 106.68) (diameter 0) (color 0 0 0 0)
    (uuid 569e183e-6d71-4467-b4ae-430e47fbe9e1)
  )
  (junction (at 96.52 36.83) (diameter 0) (color 0 0 0 0)
    (uuid 6b17475a-861a-4fd9-8c74-d20374052910)
  )
  (junction (at 87.63 34.29) (diameter 0) (color 0 0 0 0)
    (uuid 893d6a8f-4581-4a49-bbbc-66c8f4c34d95)
  )
  (junction (at 46.99 106.68) (diameter 0) (color 0 0 0 0)
    (uuid b3ba148b-0c63-40ea-84b3-848ccd0e5ba6)
  )
  (junction (at 74.93 106.68) (diameter 0) (color 0 0 0 0)
    (uuid d560e5c5-b976-4fef-bbed-b538e05ae6ed)
  )
  (junction (at 96.52 44.45) (diameter 0) (color 0 0 0 0)
    (uuid f5fa0023-a854-4977-96f8-de888f9a76cc)
  )
  (junction (at 152.4 104.14) (diameter 0) (color 0 0 0 0)
    (uuid fc339ba5-4dc3-47b2-b566-2b83ae60496e)
  )

  (no_connect (at 227.33 53.34) (uuid 18a195ca-7d83-4db8-b00e-0559baca29ec))
  (no_connect (at 245.11 53.34) (uuid 18a195ca-7d83-4db8-b00e-0559baca29ed))

  (wire (pts (xy 82.55 34.29) (xy 87.63 34.29))
    (stroke (width 0) (type solid) (color 0 0 0 0))
    (uuid 07e1c963-d58e-4b19-93d8-c0e584b088a2)
  )
  (wire (pts (xy 35.56 158.75) (xy 34.29 158.75))
    (stroke (width 0) (type default) (color 0 0 0 0))
    (uuid 0a5f4711-1994-4988-bac7-c3987f77dc68)
  )
  (wire (pts (xy 27.94 39.37) (xy 36.83 39.37))
    (stroke (width 0) (type default) (color 0 0 0 0))
    (uuid 0b3f3749-60de-4826-8fa2-cf9aacb2ca92)
  )
  (wire (pts (xy 74.93 106.68) (xy 74.93 111.76))
    (stroke (width 0) (type default) (color 0 0 0 0))
    (uuid 1033726f-af71-4f46-9282-cd633b0b05b0)
  )
  (wire (pts (xy 214.63 48.26) (xy 227.33 48.26))
    (stroke (width 0) (type default) (color 0 0 0 0))
    (uuid 1193de4c-a49c-4e98-b900-8a727cf651c8)
  )
  (wire (pts (xy 137.16 104.14) (xy 147.32 104.14))
    (stroke (width 0) (type default) (color 0 0 0 0))
    (uuid 19b647c4-d38d-411c-81be-41b1cce6ee2d)
  )
  (wire (pts (xy 25.4 163.83) (xy 35.56 163.83))
    (stroke (width 0) (type default) (color 0 0 0 0))
    (uuid 24ae4660-ad7d-473b-a4b2-3c43ac8b7891)
  )
  (wire (pts (xy 87.63 44.45) (xy 96.52 44.45))
    (stroke (width 0) (type default) (color 0 0 0 0))
    (uuid 254f1878-94ca-43e6-bfb6-12ee2423b749)
  )
  (wire (pts (xy 74.93 104.14) (xy 74.93 106.68))
    (stroke (width 0) (type default) (color 0 0 0 0))
    (uuid 25518abe-13a5-478a-be31-4ae1824a32e5)
  )
  (polyline (pts (xy 115.57 83.82) (xy 191.77 83.82))
    (stroke (width 0) (type default) (color 0 0 0 0))
    (uuid 2c21cacd-d776-4a36-b754-7afabf335bf2)
  )

  (wire (pts (xy 50.8 106.68) (xy 50.8 110.49))
    (stroke (width 0) (type default) (color 0 0 0 0))
    (uuid 2d83b9db-bc14-4cbf-bf33-0d62fae04f9e)
  )
  (wire (pts (xy 25.4 168.91) (xy 35.56 168.91))
    (stroke (width 0) (type default) (color 0 0 0 0))
    (uuid 355f8a83-3c93-48e8-98c6-f5376ee4a507)
  )
  (wire (pts (xy 25.4 173.99) (xy 35.56 173.99))
    (stroke (width 0) (type default) (color 0 0 0 0))
    (uuid 378c6978-3fd6-4858-93b5-b1f6cb8d0205)
  )
  (wire (pts (xy 167.64 49.53) (xy 161.29 49.53))
    (stroke (width 0) (type default) (color 0 0 0 0))
    (uuid 38947350-f998-4caf-88b9-4291aac52499)
  )
  (wire (pts (xy 237.49 33.02) (xy 237.49 35.56))
    (stroke (width 0) (type solid) (color 0 0 0 0))
    (uuid 3a9fdd23-bf4a-4dd0-9076-2b1f8fdf0331)
  )
  (wire (pts (xy 82.55 36.83) (xy 87.63 36.83))
    (stroke (width 0) (type default) (color 0 0 0 0))
    (uuid 3e6780b2-da23-46c4-8f10-4d135671dc6f)
  )
  (wire (pts (xy 46.99 104.14) (xy 46.99 106.68))
    (stroke (width 0) (type default) (color 0 0 0 0))
    (uuid 3ecd582f-5ab4-4b6b-98ad-2140d526bc80)
  )
  (wire (pts (xy 133.35 44.45) (xy 143.51 44.45))
    (stroke (width 0) (type default) (color 0 0 0 0))
    (uuid 3ef7b4e8-6ebd-49a8-82be-161b7d6f0020)
  )
  (wire (pts (xy 167.64 52.07) (xy 161.29 52.07))
    (stroke (width 0) (type default) (color 0 0 0 0))
    (uuid 418471f9-189b-41d3-86c4-683e878b5aff)
  )
  (wire (pts (xy 35.56 179.07) (xy 34.29 179.07))
    (stroke (width 0) (type default) (color 0 0 0 0))
    (uuid 43222f02-00c0-4758-add5-2e6926ebb0fc)
  )
  (wire (pts (xy 72.39 106.68) (xy 74.93 106.68))
    (stroke (width 0) (type default) (color 0 0 0 0))
    (uuid 4332546b-82dd-4f27-83a0-68304e488cad)
  )
  (wire (pts (xy 167.64 46.99) (xy 161.29 46.99))
    (stroke (width 0) (type default) (color 0 0 0 0))
    (uuid 4d4db3d6-779b-41d0-b2c6-4691300d113a)
  )
  (wire (pts (xy 50.8 110.49) (xy 52.07 110.49))
    (stroke (width 0) (type default) (color 0 0 0 0))
    (uuid 4e46f08a-73f8-4f0f-baf2-1a2547940261)
  )
  (wire (pts (xy 62.23 115.57) (xy 62.23 119.38))
    (stroke (width 0) (type default) (color 0 0 0 0))
    (uuid 52815120-e936-4139-b76e-e754945eb3d4)
  )
  (polyline (pts (xy 12.7 83.82) (xy 115.57 83.82))
    (stroke (width 0) (type default) (color 0 0 0 0))
    (uuid 58783a85-3ac0-4b45-94e7-3aaedcab9602)
  )

  (wire (pts (xy 82.55 52.07) (xy 91.44 52.07))
    (stroke (width 0) (type default) (color 0 0 0 0))
    (uuid 58e6473f-c826-4823-adbd-65cb8ca5522a)
  )
  (wire (pts (xy 26.67 54.61) (xy 36.83 54.61))
    (stroke (width 0) (type default) (color 0 0 0 0))
    (uuid 5e958cb3-4ab1-4027-98d3-2294877742f4)
  )
  (wire (pts (xy 34.29 156.21) (xy 34.29 158.75))
    (stroke (width 0) (type default) (color 0 0 0 0))
    (uuid 60f1c7d2-8392-4699-a495-e2461e6fc1db)
  )
  (wire (pts (xy 50.8 106.68) (xy 52.07 106.68))
    (stroke (width 0) (type default) (color 0 0 0 0))
    (uuid 6c726089-4608-4503-ae1b-dd6878e8a9fa)
  )
  (wire (pts (xy 245.11 50.8) (xy 255.27 50.8))
    (stroke (width 0) (type solid) (color 0 0 0 0))
    (uuid 6dcb0b99-2142-4404-8454-46d25602e1e7)
  )
  (wire (pts (xy 26.67 52.07) (xy 36.83 52.07))
    (stroke (width 0) (type default) (color 0 0 0 0))
    (uuid 6e3b7b06-defb-479b-b82d-56c712aa24f0)
  )
  (wire (pts (xy 245.11 45.72) (xy 255.27 45.72))
    (stroke (width 0) (type default) (color 0 0 0 0))
    (uuid 7054c3ae-34f7-42eb-9e7d-1e713c1e6287)
  )
  (wire (pts (xy 34.29 179.07) (xy 34.29 181.61))
    (stroke (width 0) (type default) (color 0 0 0 0))
    (uuid 74ea6a5a-ba1f-47ea-9eb2-bc46f26fe36b)
  )
  (wire (pts (xy 25.4 166.37) (xy 35.56 166.37))
    (stroke (width 0) (type default) (color 0 0 0 0))
    (uuid 836aac0e-ac92-4281-beee-cf64cebcda66)
  )
  (polyline (pts (xy 191.77 137.16) (xy 191.77 83.82))
    (stroke (width 0) (type default) (color 0 0 0 0))
    (uuid 9315cc51-67cd-43ab-b033-2e8fd5f312cc)
  )

  (wire (pts (xy 167.64 44.45) (xy 161.29 44.45))
    (stroke (width 0) (type default) (color 0 0 0 0))
    (uuid 9d932cf0-a7d4-4ce9-8472-44d89e64f3cb)
  )
  (wire (pts (xy 46.99 106.68) (xy 46.99 111.76))
    (stroke (width 0) (type default) (color 0 0 0 0))
    (uuid 9ecc6fbe-3854-423b-9926-b57a45e28044)
  )
  (wire (pts (xy 214.63 50.8) (xy 227.33 50.8))
    (stroke (width 0) (type default) (color 0 0 0 0))
    (uuid a049e388-16e6-45ce-8cdb-d2e9e70cd913)
  )
  (wire (pts (xy 133.35 46.99) (xy 143.51 46.99))
    (stroke (width 0) (type default) (color 0 0 0 0))
    (uuid a4d022df-3fc9-4d41-8d41-d574039f0388)
  )
  (wire (pts (xy 157.48 111.76) (xy 157.48 123.19))
    (stroke (width 0) (type default) (color 0 0 0 0))
    (uuid a65aaca0-6e10-41ad-bb2c-a5c1e58bcca1)
  )
  (wire (pts (xy 25.4 171.45) (xy 35.56 171.45))
    (stroke (width 0) (type default) (color 0 0 0 0))
    (uuid aa2f504c-dd34-416a-9a64-74630b0aa3e4)
  )
  (wire (pts (xy 25.4 176.53) (xy 35.56 176.53))
    (stroke (width 0) (type default) (color 0 0 0 0))
    (uuid ae452d44-c4cc-4236-9917-ead71620ce84)
  )
  (wire (pts (xy 133.35 49.53) (xy 143.51 49.53))
    (stroke (width 0) (type default) (color 0 0 0 0))
    (uuid afde8f81-f26c-427f-a288-f656a4bf38d9)
  )
  (wire (pts (xy 167.64 111.76) (xy 167.64 123.19))
    (stroke (width 0) (type default) (color 0 0 0 0))
    (uuid b204fd6b-95e3-4da4-8d79-ddc1c2c529b6)
  )
  (wire (pts (xy 20.32 62.23) (xy 36.83 62.23))
    (stroke (width 0) (type default) (color 0 0 0 0))
    (uuid b3488037-67ae-42b2-a777-c2c6d76a5fa7)
  )
  (wire (pts (xy 20.32 64.77) (xy 36.83 64.77))
    (stroke (width 0) (type default) (color 0 0 0 0))
    (uuid b4ed3087-7a8e-41cf-a3ee-53f7f1911ced)
  )
  (polyline (pts (xy 115.57 137.16) (xy 115.57 198.12))
    (stroke (width 0) (type default) (color 0 0 0 0))
    (uuid b6aa8a54-6e2f-47a7-a921-ec9697a0b87d)
  )
  (polyline (pts (xy 191.77 83.82) (xy 284.48 83.82))
    (stroke (width 0) (type default) (color 0 0 0 0))
    (uuid bc9fb260-3b5e-4a33-8ee0-090bfcecbdfa)
  )

  (wire (pts (xy 96.52 36.83) (xy 102.87 36.83))
    (stroke (width 0) (type default) (color 0 0 0 0))
    (uuid bdfee6d7-ddab-469a-867e-37b38f71c3d8)
  )
  (wire (pts (xy 34.29 67.31) (xy 34.29 59.69))
    (stroke (width 0) (type default) (color 0 0 0 0))
    (uuid be5241fa-0543-49ca-be94-5abe8dcf04a0)
  )
  (polyline (pts (xy 115.57 137.16) (xy 12.7 137.16))
    (stroke (width 0) (type default) (color 0 0 0 0))
    (uuid c12ca847-d2fa-44f8-9025-066a78fa3e89)
  )

  (wire (pts (xy 147.32 111.76) (xy 147.32 123.19))
    (stroke (width 0) (type default) (color 0 0 0 0))
    (uuid c222ab30-ef6b-4177-954e-8f93e04f3963)
  )
  (polyline (pts (xy 63.5 137.16) (xy 63.5 196.85))
    (stroke (width 0) (type default) (color 0 0 0 0))
    (uuid c22ef3fe-aa98-4060-b2f7-1e2f869ad5f8)
  )

  (wire (pts (xy 21.59 44.45) (xy 21.59 46.99))
    (stroke (width 0) (type default) (color 0 0 0 0))
    (uuid c3f4dbde-931c-45ca-95b8-dcca82afed21)
  )
  (wire (pts (xy 133.35 52.07) (xy 143.51 52.07))
    (stroke (width 0) (type default) (color 0 0 0 0))
    (uuid c4e7fb45-a5d1-42be-9ab1-fd2c01e16ac6)
  )
  (wire (pts (xy 87.63 36.83) (xy 96.52 36.83))
    (stroke (width 0) (type solid) (color 0 0 0 0))
    (uuid c5f1f6f8-a153-4c06-adfb-b0a9c5e10681)
  )
  (wire (pts (xy 218.44 45.72) (xy 227.33 45.72))
    (stroke (width 0) (type default) (color 0 0 0 0))
    (uuid c64fd490-fe02-4457-9860-45805d57e6cc)
  )
  (wire (pts (xy 245.11 48.26) (xy 255.27 48.26))
    (stroke (width 0) (type solid) (color 0 0 0 0))
    (uuid c85f0adc-6239-477a-873e-acfc638b8c62)
  )
  (wire (pts (xy 21.59 44.45) (xy 36.83 44.45))
    (stroke (width 0) (type default) (color 0 0 0 0))
    (uuid cd56f29a-d135-4ca2-a1a4-88c583a372cb)
  )
  (wire (pts (xy 34.29 59.69) (xy 36.83 59.69))
    (stroke (width 0) (type default) (color 0 0 0 0))
    (uuid d53c9461-eeab-4ea2-83d3-c5677294ad07)
  )
  (polyline (pts (xy 115.57 12.7) (xy 115.57 83.82))
    (stroke (width 0) (type default) (color 0 0 0 0))
    (uuid d6a26013-ab80-4059-9920-2288271ab4ff)
  )

  (wire (pts (xy 26.67 49.53) (xy 36.83 49.53))
    (stroke (width 0) (type default) (color 0 0 0 0))
    (uuid d779db2d-8c69-4f9a-96dc-f7828499f268)
  )
  (polyline (pts (xy 115.57 83.82) (xy 115.57 137.16))
    (stroke (width 0) (type default) (color 0 0 0 0))
    (uuid de7e38d4-b574-43bd-a281-1df7f63aa186)
  )

  (wire (pts (xy 87.63 34.29) (xy 92.71 34.29))
    (stroke (width 0) (type default) (color 0 0 0 0))
    (uuid e5bbd1e3-7c2b-4c9d-adf2-b2351b2630ea)
  )
  (wire (pts (xy 157.48 104.14) (xy 167.64 104.14))
    (stroke (width 0) (type default) (color 0 0 0 0))
    (uuid e72f60f8-6bc1-45e3-8544-1773adadc7e0)
  )
  (wire (pts (xy 25.4 161.29) (xy 35.56 161.29))
    (stroke (width 0) (type default) (color 0 0 0 0))
    (uuid e8a993ec-3ca1-4e1c-b9db-8fedba6ba9f3)
  )
  (wire (pts (xy 152.4 101.6) (xy 152.4 104.14))
    (stroke (width 0) (type default) (color 0 0 0 0))
    (uuid ef5e0eb0-a557-42ce-b80b-bdd3c23e9f96)
  )
  (wire (pts (xy 46.99 106.68) (xy 50.8 106.68))
    (stroke (width 0) (type default) (color 0 0 0 0))
    (uuid f044b668-7def-469a-930e-b43528bb7983)
  )
  (wire (pts (xy 147.32 104.14) (xy 152.4 104.14))
    (stroke (width 0) (type default) (color 0 0 0 0))
    (uuid f5505110-076a-4ada-9445-206bfda44503)
  )
  (polyline (pts (xy 115.57 137.16) (xy 191.77 137.16))
    (stroke (width 0) (type default) (color 0 0 0 0))
    (uuid f617cc93-c3ac-4c32-a0fc-8d6de991bdc2)
  )
  (polyline (pts (xy 191.77 83.82) (xy 191.77 12.7))
    (stroke (width 0) (type default) (color 0 0 0 0))
    (uuid f7f474fc-8b6e-420d-ab8d-5237afa2d035)
  )

  (wire (pts (xy 234.95 33.02) (xy 234.95 35.56))
    (stroke (width 0) (type solid) (color 0 0 0 0))
    (uuid fd0f1b84-ac17-43b2-bceb-f94a41f7348d)
  )
  (wire (pts (xy 137.16 111.76) (xy 137.16 123.19))
    (stroke (width 0) (type default) (color 0 0 0 0))
    (uuid fe4a0234-f546-48a2-be89-9f5d6c8a0fcd)
  )
  (wire (pts (xy 152.4 104.14) (xy 157.48 104.14))
    (stroke (width 0) (type default) (color 0 0 0 0))
    (uuid ffba38a2-bbbe-415f-b424-ecf00507da9b)
  )

  (text "Pullups" (at 118.11 90.17 0)
    (effects (font (size 1.27 1.27)) (justify left bottom))
    (uuid 09d92bef-d237-4dcf-982a-1017a9498301)
  )
  (text "ICM20789 IMU" (at 13.97 17.78 0)
    (effects (font (size 1.27 1.27)) (justify left bottom))
    (uuid 340bf7e9-fbc0-48e0-b683-26ace86ba0e5)
  )
  (text "IMU SPI/I2C Logic Level Shifter" (at 118.11 17.78 0)
    (effects (font (size 1.27 1.27)) (justify left bottom))
    (uuid 3ecfe249-ea38-4357-a3c0-3ceaeaf4e30a)
  )
  (text "Status LED\n" (at 67.31 142.24 0)
    (effects (font (size 1.27 1.27)) (justify left bottom))
    (uuid 7d0d9d84-010d-4b5c-b57d-78924ea7860f)
  )
  (text "Regulator - 1.8V" (at 15.24 88.9 0)
    (effects (font (size 1.27 1.27)) (justify left bottom))
    (uuid 90f74e9c-bd0d-4ccf-bcda-d150d4e8a6c4)
  )
  (text "Connector" (at 15.24 142.24 0)
    (effects (font (size 1.27 1.27)) (justify left bottom))
    (uuid cdb6fee2-ee1f-4416-8932-f6c98254e666)
  )
  (text "Pressure Sensor I2C Logic Level Shifter" (at 195.58 17.78 0)
    (effects (font (size 1.27 1.27)) (justify left bottom))
    (uuid f81b3e92-5767-4b80-9eb6-7ead8b114712)
  )

  (label "nCS" (at 167.64 44.45 180)
    (effects (font (size 1.27 1.27)) (justify right bottom))
    (uuid 09cab12d-57ff-44ab-8de6-52624889928e)
  )
  (label "SCL" (at 25.4 161.29 0)
    (effects (font (size 1.27 1.27)) (justify left bottom))
    (uuid 14eb3c88-8913-47dd-afe7-6c6e2b7e6682)
  )
  (label "PR_CL" (at 25.4 173.99 0)
    (effects (font (size 1.27 1.27)) (justify left bottom))
    (uuid 157baf65-c8a3-42ce-a1b2-c49e77e6b974)
  )
  (label "PR_CL_1V8" (at 157.48 123.19 90)
    (effects (font (size 1.27 1.27)) (justify left bottom))
    (uuid 213a9aea-a221-4c22-873e-2781d2836b01)
  )
  (label "PR_DA_1V8" (at 20.32 62.23 0)
    (effects (font (size 1.27 1.27)) (justify left bottom))
    (uuid 2750b4fc-5dd4-42a3-9fd7-82cd674a6260)
  )
  (label "PR_CL_1V8" (at 214.63 48.26 0)
    (effects (font (size 1.27 1.27)) (justify left bottom))
    (uuid 289a7d54-dd67-42d1-b7f3-0c826fabd35c)
  )
  (label "SCL_1V8" (at 133.35 52.07 0)
    (effects (font (size 1.27 1.27)) (justify left bottom))
    (uuid 388f1722-6692-4db4-9e6f-9089df49b2a6)
  )
  (label "SDA_1V8" (at 133.35 49.53 0)
    (effects (font (size 1.27 1.27)) (justify left bottom))
    (uuid 39fe0bf2-2cd8-411c-9ca5-73fe52189497)
  )
  (label "SCL" (at 167.64 52.07 180)
    (effects (font (size 1.27 1.27)) (justify right bottom))
    (uuid 3afd73a1-40cb-496a-9abe-ac7336ecfd02)
  )
  (label "PR_CL" (at 255.27 48.26 180)
    (effects (font (size 1.27 1.27)) (justify right bottom))
    (uuid 3d9bf36b-be49-491d-8f1c-a84887effa0f)
  )
  (label "SDA_1V8" (at 147.32 123.19 90)
    (effects (font (size 1.27 1.27)) (justify left bottom))
    (uuid 42213a0d-bea5-454d-923d-d1d1808a54ba)
  )
  (label "AD0_1V8" (at 133.35 46.99 0)
    (effects (font (size 1.27 1.27)) (justify left bottom))
    (uuid 4a802a3d-0922-4803-a46e-4719d6ef96f1)
  )
  (label "SCL_1V8" (at 137.16 123.19 90)
    (effects (font (size 1.27 1.27)) (justify left bottom))
    (uuid 4aac9073-ed9a-46e1-9625-e272b5e2865f)
  )
  (label "AD0" (at 25.4 166.37 0)
    (effects (font (size 1.27 1.27)) (justify left bottom))
    (uuid 506840e7-253d-4631-82fb-e432383081fb)
  )
  (label "PR_CL_1V8" (at 20.32 64.77 0)
    (effects (font (size 1.27 1.27)) (justify left bottom))
    (uuid 54e4edf5-3b81-45ea-860a-9539cda0009b)
  )
  (label "PR_DA_1V8" (at 167.64 123.19 90)
    (effects (font (size 1.27 1.27)) (justify left bottom))
    (uuid 73357503-d4a6-4b03-80b3-fa9c54b12210)
  )
  (label "PR_DA" (at 25.4 171.45 0)
    (effects (font (size 1.27 1.27)) (justify left bottom))
    (uuid 76d59344-472a-4bc6-8ede-2ff98bea2091)
  )
  (label "SDA" (at 167.64 49.53 180)
    (effects (font (size 1.27 1.27)) (justify right bottom))
    (uuid 7ce15359-35b9-4951-85dc-e9202d018849)
  )
  (label "PR_DA_1V8" (at 214.63 50.8 0)
    (effects (font (size 1.27 1.27)) (justify left bottom))
    (uuid 7e729c90-9f0a-4732-9397-d4e159160e81)
  )
  (label "PR_DA" (at 255.27 50.8 180)
    (effects (font (size 1.27 1.27)) (justify right bottom))
    (uuid 84a8c3eb-2e61-48ae-ab92-061974bfb7a1)
  )
  (label "AD0" (at 167.64 46.99 180)
    (effects (font (size 1.27 1.27)) (justify right bottom))
    (uuid 85c61c49-150c-4edf-93ea-48b9506d455e)
  )
  (label "INT" (at 255.27 45.72 180)
    (effects (font (size 1.27 1.27)) (justify right bottom))
    (uuid 9afb6805-fe7d-4582-b564-a54f3bc9b22b)
  )
  (label "SCL_1V8" (at 26.67 49.53 0)
    (effects (font (size 1.27 1.27)) (justify left bottom))
    (uuid 9b0b921b-e54e-4464-8175-ddc6813980ce)
  )
  (label "nCS_1V8" (at 27.94 39.37 0)
    (effects (font (size 1.27 1.27)) (justify left bottom))
    (uuid aca9ffdb-9fcc-4e02-8cc1-5c59a2979033)
  )
  (label "INT" (at 25.4 176.53 0)
    (effects (font (size 1.27 1.27)) (justify left bottom))
    (uuid b0c9976c-0296-4efd-a063-bd7495a5fa6d)
  )
  (label "INT_1V8" (at 91.44 52.07 180)
    (effects (font (size 1.27 1.27)) (justify right bottom))
    (uuid b2eba656-573c-4441-ac62-a855350157c4)
  )
  (label "nCS_1V8" (at 133.35 44.45 0)
    (effects (font (size 1.27 1.27)) (justify left bottom))
    (uuid b3271cad-7e6a-46c2-995f-e9800f944c5c)
  )
  (label "AD0_1V8" (at 26.67 54.61 0)
    (effects (font (size 1.27 1.27)) (justify left bottom))
    (uuid bc4ae468-4e51-4141-936d-4786bc4a71c2)
  )
  (label "SDA_1V8" (at 26.67 52.07 0)
    (effects (font (size 1.27 1.27)) (justify left bottom))
    (uuid c11d5645-9ffb-4394-9d54-f6d20968a3a3)
  )
  (label "nCS" (at 25.4 168.91 0)
    (effects (font (size 1.27 1.27)) (justify left bottom))
    (uuid d119eeda-ad88-4a41-ad56-4edad8b301e9)
  )
  (label "INT_1V8" (at 218.44 45.72 0)
    (effects (font (size 1.27 1.27)) (justify left bottom))
    (uuid d525a021-f3ff-458f-ae71-dade840e7fa5)
  )
  (label "SDA" (at 25.4 163.83 0)
    (effects (font (size 1.27 1.27)) (justify left bottom))
    (uuid f099bc2b-13fe-4a50-b6d8-005c64cb0064)
  )

  (symbol (lib_id "power:PWR_FLAG") (at 102.87 93.98 90) (unit 1)
    (in_bom yes) (on_board yes) (fields_autoplaced)
    (uuid 03cd7bc6-0ea0-4595-8c74-6e4b3b0aa2f2)
    (property "Reference" "#FLG0102" (id 0) (at 100.965 93.98 0)
      (effects (font (size 1.27 1.27)) hide)
    )
    (property "Value" "PWR_FLAG" (id 1) (at 99.06 93.9799 90)
      (effects (font (size 1.27 1.27)) (justify left))
    )
    (property "Footprint" "" (id 2) (at 102.87 93.98 0)
      (effects (font (size 1.27 1.27)) hide)
    )
    (property "Datasheet" "~" (id 3) (at 102.87 93.98 0)
      (effects (font (size 1.27 1.27)) hide)
    )
    (pin "1" (uuid d095c2c4-c239-4c0b-9a17-425938a923d8))
  )

  (symbol (lib_id "power:GND") (at 82.55 69.85 90) (unit 1)
    (in_bom yes) (on_board yes) (fields_autoplaced)
    (uuid 05bba830-30cf-4f82-982f-b6148be45a7d)
    (property "Reference" "#PWR0105" (id 0) (at 88.9 69.85 0)
      (effects (font (size 1.27 1.27)) hide)
    )
    (property "Value" "GND" (id 1) (at 86.868 69.8499 90)
      (effects (font (size 1.27 1.27)) (justify right))
    )
    (property "Footprint" "" (id 2) (at 82.55 69.85 0)
      (effects (font (size 1.27 1.27)) hide)
    )
    (property "Datasheet" "" (id 3) (at 82.55 69.85 0)
      (effects (font (size 1.27 1.27)) hide)
    )
    (pin "1" (uuid 6b9baef6-41a3-48ff-b5b8-396cc5846289))
  )

  (symbol (lib_id "Device:R") (at 157.48 107.95 0) (unit 1)
    (in_bom yes) (on_board yes) (fields_autoplaced)
    (uuid 09a84b52-4e71-4e98-a7df-a91449300631)
    (property "Reference" "R6" (id 0) (at 160.02 106.6799 0)
      (effects (font (size 1.27 1.27)) (justify left))
    )
    (property "Value" "2.2K" (id 1) (at 160.02 109.2199 0)
      (effects (font (size 1.27 1.27)) (justify left))
    )
    (property "Footprint" "Resistor_SMD:R_0603_1608Metric" (id 2) (at 155.702 107.95 90)
      (effects (font (size 1.27 1.27)) hide)
    )
    (property "Datasheet" "~" (id 3) (at 157.48 107.95 0)
      (effects (font (size 1.27 1.27)) hide)
    )
    (pin "1" (uuid 13243781-03ed-4d12-a9a8-6da3fcf0eca3))
    (pin "2" (uuid e40b2bb0-e8f0-40eb-9f2c-fb7586994261))
  )

  (symbol (lib_id "Device:R") (at 90.17 163.83 0) (unit 1)
    (in_bom yes) (on_board yes) (fields_autoplaced)
    (uuid 0be6725b-8861-44a5-b7f5-f89642463d63)
    (property "Reference" "R2" (id 0) (at 92.71 162.5599 0)
      (effects (font (size 1.27 1.27)) (justify left))
    )
    (property "Value" "1K" (id 1) (at 92.71 165.0999 0)
      (effects (font (size 1.27 1.27)) (justify left))
    )
    (property "Footprint" "Resistor_SMD:R_0603_1608Metric" (id 2) (at 88.392 163.83 90)
      (effects (font (size 1.27 1.27)) hide)
    )
    (property "Datasheet" "~" (id 3) (at 90.17 163.83 0)
      (effects (font (size 1.27 1.27)) hide)
    )
    (pin "1" (uuid 502c5fea-70f8-41ff-a3ab-4cc1fce822ee))
    (pin "2" (uuid c7c76eef-debe-4982-9bb3-9d67ac12db3e))
  )

  (symbol (lib_id "Device:R") (at 137.16 107.95 0) (unit 1)
    (in_bom yes) (on_board yes) (fields_autoplaced)
    (uuid 10165703-da8a-4933-bd03-1de83ece570c)
    (property "Reference" "R1" (id 0) (at 139.7 106.6799 0)
      (effects (font (size 1.27 1.27)) (justify left))
    )
    (property "Value" "2.2K" (id 1) (at 139.7 109.2199 0)
      (effects (font (size 1.27 1.27)) (justify left))
    )
    (property "Footprint" "Resistor_SMD:R_0603_1608Metric" (id 2) (at 135.382 107.95 90)
      (effects (font (size 1.27 1.27)) hide)
    )
    (property "Datasheet" "~" (id 3) (at 137.16 107.95 0)
      (effects (font (size 1.27 1.27)) hide)
    )
    (pin "1" (uuid f6c11ee9-15d9-4518-a493-6b00d118a1ea))
    (pin "2" (uuid 407c76ee-bebb-409c-a065-130d56d59030))
  )

  (symbol (lib_id "Device:R") (at 167.64 107.95 0) (unit 1)
    (in_bom yes) (on_board yes) (fields_autoplaced)
    (uuid 153e33af-5994-45a0-bddf-6f337cf32fb8)
    (property "Reference" "R7" (id 0) (at 170.18 106.6799 0)
      (effects (font (size 1.27 1.27)) (justify left))
    )
    (property "Value" "2.2K" (id 1) (at 170.18 109.2199 0)
      (effects (font (size 1.27 1.27)) (justify left))
    )
    (property "Footprint" "Resistor_SMD:R_0603_1608Metric" (id 2) (at 165.862 107.95 90)
      (effects (font (size 1.27 1.27)) hide)
    )
    (property "Datasheet" "~" (id 3) (at 167.64 107.95 0)
      (effects (font (size 1.27 1.27)) hide)
    )
    (pin "1" (uuid 62c3b2ba-8604-436b-a2e4-38521138b345))
    (pin "2" (uuid e4a66c1d-5056-4870-9ebd-b779a5ab784a))
  )

  (symbol (lib_id "power:VDD") (at 237.49 33.02 0) (unit 1)
    (in_bom yes) (on_board yes)
    (uuid 1ad733c6-e302-49b3-aa07-8b8101ad5e1e)
    (property "Reference" "#PWR0115" (id 0) (at 237.49 36.83 0)
      (effects (font (size 1.27 1.27)) hide)
    )
    (property "Value" "VDD" (id 1) (at 238.76 29.21 0))
    (property "Footprint" "" (id 2) (at 237.49 33.02 0)
      (effects (font (size 1.27 1.27)) hide)
    )
    (property "Datasheet" "" (id 3) (at 237.49 33.02 0)
      (effects (font (size 1.27 1.27)) hide)
    )
    (pin "1" (uuid 9125ba51-0145-4080-af89-9befafb036a7))
  )

  (symbol (lib_id "Device:C") (at 96.52 40.64 0) (unit 1)
    (in_bom yes) (on_board yes)
    (uuid 1c3617f7-6d29-4367-8e24-adf6783a5f1b)
    (property "Reference" "C3" (id 0) (at 100.33 39.37 0)
      (effects (font (size 1.27 1.27)) (justify left))
    )
    (property "Value" "2.2uF" (id 1) (at 100.33 41.91 0)
      (effects (font (size 1.27 1.27)) (justify left))
    )
    (property "Footprint" "Capacitor_SMD:C_0603_1608Metric" (id 2) (at 97.4852 44.45 0)
      (effects (font (size 1.27 1.27)) hide)
    )
    (property "Datasheet" "~" (id 3) (at 96.52 40.64 0)
      (effects (font (size 1.27 1.27)) hide)
    )
    (pin "1" (uuid 49d050fb-595e-45f7-be1b-14868b47a03a))
    (pin "2" (uuid ce285851-d15c-4280-b7df-4807b385b778))
  )

  (symbol (lib_id "power:GND") (at 90.17 175.26 0) (unit 1)
    (in_bom yes) (on_board yes) (fields_autoplaced)
    (uuid 26ea4c84-7a11-436e-8c27-f855f55a0890)
    (property "Reference" "#PWR0107" (id 0) (at 90.17 181.61 0)
      (effects (font (size 1.27 1.27)) hide)
    )
    (property "Value" "GND" (id 1) (at 90.17 180.975 0))
    (property "Footprint" "" (id 2) (at 90.17 175.26 0)
      (effects (font (size 1.27 1.27)) hide)
    )
    (property "Datasheet" "" (id 3) (at 90.17 175.26 0)
      (effects (font (size 1.27 1.27)) hide)
    )
    (pin "1" (uuid 0d00a340-5ea1-4ad9-96a3-8585c4282a9e))
  )

  (symbol (lib_id "Device:C") (at 34.29 71.12 180) (unit 1)
    (in_bom yes) (on_board yes)
    (uuid 2b0c9c83-9215-4ac0-8c87-d863d1bde1a8)
    (property "Reference" "C1" (id 0) (at 25.4 69.85 0)
      (effects (font (size 1.27 1.27)) (justify right))
    )
    (property "Value" "0.1uF" (id 1) (at 25.4 72.39 0)
      (effects (font (size 1.27 1.27)) (justify right))
    )
    (property "Footprint" "Capacitor_SMD:C_0603_1608Metric" (id 2) (at 33.3248 67.31 0)
      (effects (font (size 1.27 1.27)) hide)
    )
    (property "Datasheet" "~" (id 3) (at 34.29 71.12 0)
      (effects (font (size 1.27 1.27)) hide)
    )
    (pin "1" (uuid 5916302b-d0cf-4683-8fb2-2a6154b35275))
    (pin "2" (uuid 4c30642c-4110-454c-89fa-e76666119e17))
  )

  (symbol (lib_id "Device:C") (at 46.99 115.57 0) (unit 1)
    (in_bom yes) (on_board yes) (fields_autoplaced)
    (uuid 2e84ff76-e036-47eb-a94c-ebbc69f91017)
    (property "Reference" "C5" (id 0) (at 50.8 114.2999 0)
      (effects (font (size 1.27 1.27)) (justify left))
    )
    (property "Value" "1uF" (id 1) (at 50.8 116.8399 0)
      (effects (font (size 1.27 1.27)) (justify left))
    )
    (property "Footprint" "Capacitor_SMD:C_0603_1608Metric" (id 2) (at 47.9552 119.38 0)
      (effects (font (size 1.27 1.27)) hide)
    )
    (property "Datasheet" "~" (id 3) (at 46.99 115.57 0)
      (effects (font (size 1.27 1.27)) hide)
    )
    (pin "1" (uuid ea00f013-3908-48bf-9d77-5e8440b0a8f2))
    (pin "2" (uuid 9602ce74-24bc-4e13-a388-a26e48ccf8e0))
  )

  (symbol (lib_id "power:GND") (at 87.63 26.67 180) (unit 1)
    (in_bom yes) (on_board yes) (fields_autoplaced)
    (uuid 30d37047-3218-4186-bf2b-f4bc580d1396)
    (property "Reference" "#PWR0102" (id 0) (at 87.63 20.32 0)
      (effects (font (size 1.27 1.27)) hide)
    )
    (property "Value" "GND" (id 1) (at 87.63 20.955 0))
    (property "Footprint" "" (id 2) (at 87.63 26.67 0)
      (effects (font (size 1.27 1.27)) hide)
    )
    (property "Datasheet" "" (id 3) (at 87.63 26.67 0)
      (effects (font (size 1.27 1.27)) hide)
    )
    (pin "1" (uuid b192b2e0-f689-43a0-9cea-6dfc659f58ea))
  )

  (symbol (lib_id "power:GND") (at 236.22 63.5 0) (unit 1)
    (in_bom yes) (on_board yes) (fields_autoplaced)
    (uuid 3431cdc7-829e-4d60-a0e3-c4fd5ee1ad64)
    (property "Reference" "#PWR0112" (id 0) (at 236.22 69.85 0)
      (effects (font (size 1.27 1.27)) hide)
    )
    (property "Value" "GND" (id 1) (at 236.22 68.58 0))
    (property "Footprint" "" (id 2) (at 236.22 63.5 0)
      (effects (font (size 1.27 1.27)) hide)
    )
    (property "Datasheet" "" (id 3) (at 236.22 63.5 0)
      (effects (font (size 1.27 1.27)) hide)
    )
    (pin "1" (uuid 678307e7-2da9-4eeb-a000-5649f6f8d785))
  )

  (symbol (lib_id "IMU:ICM-20789") (at 59.69 52.07 0) (unit 1)
    (in_bom yes) (on_board yes) (fields_autoplaced)
    (uuid 36069a3b-e6be-44f1-b67b-26f72e06cde8)
    (property "Reference" "U1" (id 0) (at 59.69 26.67 0))
    (property "Value" "ICM-20789" (id 1) (at 59.69 29.21 0))
    (property "Footprint" "IMU1:ICM-20789" (id 2) (at 83.82 78.74 0)
      (effects (font (size 1.27 1.27)) (justify left bottom) hide)
    )
    (property "Datasheet" "" (id 3) (at 59.69 52.07 0)
      (effects (font (size 1.27 1.27)) (justify left bottom) hide)
    )
    (property "DESCRIPTION" "" (id 4) (at 50.8 60.96 0)
      (effects (font (size 1.27 1.27)) (justify left bottom) hide)
    )
    (property "NOTES" "" (id 5) (at 2.54 29.21 0)
      (effects (font (size 1.27 1.27)) (justify left bottom) hide)
    )
    (property "MF" "" (id 6) (at 55.88 55.88 0)
      (effects (font (size 1.27 1.27)) (justify left bottom) hide)
    )
    (property "DIGI-KEY_PURCHASE_URL" "" (id 7) (at 38.1 44.45 0)
      (effects (font (size 1.27 1.27)) (justify left bottom) hide)
    )
    (property "DIGI-KEY_PART_NUMBER" "" (id 8) (at 96.52 67.31 0)
      (effects (font (size 1.27 1.27)) (justify left bottom) hide)
    )
    (property "MP" "" (id 9) (at 54.61 58.42 0)
      (effects (font (size 1.27 1.27)) (justify left bottom) hide)
    )
    (property "PACKAGE" "" (id 10) (at 93.98 60.96 0)
      (effects (font (size 1.27 1.27)) (justify left bottom) hide)
    )
    (pin "10" (uuid 53825c4e-039c-403e-89b9-dc0654df8bfb))
    (pin "11" (uuid 2a041b7f-3e5e-4151-8d76-a88330917069))
    (pin "12" (uuid 1b129b6f-b5fa-49a1-9518-51c7be382a39))
    (pin "13" (uuid 5ab89667-a3f7-4c04-9ea5-5758a36bb704))
    (pin "18" (uuid 5671fde8-0744-4022-a6b7-c9822ccee807))
    (pin "22" (uuid bf87d363-9dca-464a-8790-f3dfd9420f47))
    (pin "23" (uuid 2739af30-ffc6-4cc8-9369-95ffce2208c4))
    (pin "24" (uuid daaeb799-1bac-4107-82fe-0a7430df7130))
    (pin "6" (uuid c1108456-9816-420d-b447-f85e24573f0e))
    (pin "7" (uuid 9250140f-8070-40f1-b736-6486b827b32e))
    (pin "8" (uuid a13f5fe5-aa7d-4dba-ba80-c528209bee28))
    (pin "9" (uuid 2ad22d7a-bed5-4983-b20c-0f1cf3efdd01))
  )

  (symbol (lib_id "power:VDD") (at 102.87 90.17 270) (unit 1)
    (in_bom yes) (on_board yes) (fields_autoplaced)
    (uuid 39eab18d-4bab-4fb8-8fc6-d8fc22d2070a)
    (property "Reference" "#PWR0117" (id 0) (at 99.06 90.17 0)
      (effects (font (size 1.27 1.27)) hide)
    )
    (property "Value" "VDD" (id 1) (at 106.68 90.1699 90)
      (effects (font (size 1.27 1.27)) (justify left))
    )
    (property "Footprint" "" (id 2) (at 102.87 90.17 0)
      (effects (font (size 1.27 1.27)) hide)
    )
    (property "Datasheet" "" (id 3) (at 102.87 90.17 0)
      (effects (font (size 1.27 1.27)) hide)
    )
    (pin "1" (uuid 79c3c85d-805a-4589-a37e-9d304f00b6a2))
  )

  (symbol (lib_id "Device:LED") (at 90.17 171.45 90) (unit 1)
    (in_bom yes) (on_board yes)
    (uuid 3fba8c87-05ba-4d8a-8cfe-bb778a837b11)
    (property "Reference" "D1" (id 0) (at 87.63 173.99 90)
      (effects (font (size 1.27 1.27)) (justify left))
    )
    (property "Value" "LED" (id 1) (at 87.63 171.45 90)
      (effects (font (size 1.27 1.27)) (justify left))
    )
    (property "Footprint" "LED_SMD:LED_0603_1608Metric" (id 2) (at 90.17 171.45 0)
      (effects (font (size 1.27 1.27)) hide)
    )
    (property "Datasheet" "~" (id 3) (at 90.17 171.45 0)
      (effects (font (size 1.27 1.27)) hide)
    )
    (pin "1" (uuid 470702e4-4b06-4b90-acf8-ece9235b2962))
    (pin "2" (uuid d9d534c6-510c-4cb2-9d1a-809c04aa3f1e))
  )

  (symbol (lib_id "power:GND") (at 62.23 119.38 0) (unit 1)
    (in_bom yes) (on_board yes) (fields_autoplaced)
    (uuid 4118e409-398a-420d-8e9c-6bc513d48b27)
    (property "Reference" "#PWR0121" (id 0) (at 62.23 125.73 0)
      (effects (font (size 1.27 1.27)) hide)
    )
    (property "Value" "GND" (id 1) (at 62.23 124.46 0))
    (property "Footprint" "" (id 2) (at 62.23 119.38 0)
      (effects (font (size 1.27 1.27)) hide)
    )
    (property "Datasheet" "" (id 3) (at 62.23 119.38 0)
      (effects (font (size 1.27 1.27)) hide)
    )
    (pin "1" (uuid aba349ba-38e4-4d41-8744-1e9a3745d3fd))
  )

  (symbol (lib_id "power:VDD") (at 34.29 156.21 0) (mirror y) (unit 1)
    (in_bom yes) (on_board yes)
    (uuid 4ba3a6d6-b085-404d-86fa-f3b76fed05ad)
    (property "Reference" "#PWR0108" (id 0) (at 34.29 160.02 0)
      (effects (font (size 1.27 1.27)) hide)
    )
    (property "Value" "VDD" (id 1) (at 34.29 151.13 0))
    (property "Footprint" "" (id 2) (at 34.29 156.21 0)
      (effects (font (size 1.27 1.27)) hide)
    )
    (property "Datasheet" "" (id 3) (at 34.29 156.21 0)
      (effects (font (size 1.27 1.27)) hide)
    )
    (pin "1" (uuid 9a91d26e-4acc-48b4-a75c-2a127473af3f))
  )

  (symbol (lib_id "LSF0204:LSF0204RUTR") (at 236.22 45.72 0) (unit 1)
    (in_bom yes) (on_board yes) (fields_autoplaced)
    (uuid 5c865f26-3286-45d7-9c39-368e6cad6bba)
    (property "Reference" "U4" (id 0) (at 238.2394 63.5 0)
      (effects (font (size 1.27 1.27)) (justify left))
    )
    (property "Value" "LSF0204RUTR" (id 1) (at 238.2394 66.04 0)
      (effects (font (size 1.27 1.27)) (justify left))
    )
    (property "Footprint" "Package_DFN_QFN:Texas_R_PUQFN-N12" (id 2) (at 240.03 45.72 0)
      (effects (font (size 1.27 1.27)) hide)
    )
    (property "Datasheet" "" (id 3) (at 240.03 45.72 0)
      (effects (font (size 1.27 1.27)) hide)
    )
    (pin "1" (uuid 3b0f1f90-5bb2-4cf8-b509-392fc63a8738))
    (pin "10" (uuid 21c34bef-7c18-492c-a027-9157045933e8))
    (pin "11" (uuid 5da30831-37c5-4116-bb3f-33359947b807))
    (pin "12" (uuid 82056de2-7f44-4ea0-adbf-5feb9471fc48))
    (pin "2" (uuid 5bd51baa-f666-4393-b92e-c5bdba539609))
    (pin "3" (uuid 1d912dfd-df4f-4614-883e-786f90239646))
    (pin "4" (uuid f3e36bd0-26ed-4db9-8902-35e551276908))
    (pin "5" (uuid 45e2c799-f531-412e-b5d9-146602334ea3))
    (pin "6" (uuid 713ee2ee-deaa-4be1-9ed0-389d650d427f))
    (pin "7" (uuid e49e7b5b-1507-46d7-a95c-9281f561ab25))
    (pin "8" (uuid 8143a6cf-327d-411c-b669-7679b86940cb))
    (pin "9" (uuid cebdfff0-28b9-4793-9198-acb9dcf1159a))
  )

  (symbol (lib_id "power:GND") (at 152.4 62.23 0) (unit 1)
    (in_bom yes) (on_board yes) (fields_autoplaced)
    (uuid 5c9f26cd-f08a-42e6-ab3b-f56e11d03e7a)
    (property "Reference" "#PWR0125" (id 0) (at 152.4 68.58 0)
      (effects (font (size 1.27 1.27)) hide)
    )
    (property "Value" "GND" (id 1) (at 152.4 67.31 0))
    (property "Footprint" "" (id 2) (at 152.4 62.23 0)
      (effects (font (size 1.27 1.27)) hide)
    )
    (property "Datasheet" "" (id 3) (at 152.4 62.23 0)
      (effects (font (size 1.27 1.27)) hide)
    )
    (pin "1" (uuid a394cb70-adc2-4ba5-9839-44b35d6d3241))
  )

  (symbol (lib_id "power:GND") (at 21.59 46.99 0) (unit 1)
    (in_bom yes) (on_board yes) (fields_autoplaced)
    (uuid 608e1c48-59a3-42f1-89f8-cc802f5b4bf4)
    (property "Reference" "#PWR0109" (id 0) (at 21.59 53.34 0)
      (effects (font (size 1.27 1.27)) hide)
    )
    (property "Value" "GND" (id 1) (at 21.59 52.07 0))
    (property "Footprint" "" (id 2) (at 21.59 46.99 0)
      (effects (font (size 1.27 1.27)) hide)
    )
    (property "Datasheet" "" (id 3) (at 21.59 46.99 0)
      (effects (font (size 1.27 1.27)) hide)
    )
    (pin "1" (uuid fe16f0ad-2683-4724-99bc-fb913de4a268))
  )

  (symbol (lib_id "power:+1V8") (at 92.71 34.29 270) (unit 1)
    (in_bom yes) (on_board yes) (fields_autoplaced)
    (uuid 61ebf869-917e-4fea-a950-8e08534b2897)
    (property "Reference" "#PWR0111" (id 0) (at 88.9 34.29 0)
      (effects (font (size 1.27 1.27)) hide)
    )
    (property "Value" "+1V8" (id 1) (at 96.52 34.2899 90)
      (effects (font (size 1.27 1.27)) (justify left))
    )
    (property "Footprint" "" (id 2) (at 92.71 34.29 0)
      (effects (font (size 1.27 1.27)) hide)
    )
    (property "Datasheet" "" (id 3) (at 92.71 34.29 0)
      (effects (font (size 1.27 1.27)) hide)
    )
    (pin "1" (uuid d3bda8fd-6dbf-4aae-8cab-28e5f1964994))
  )

  (symbol (lib_id "power:PWR_FLAG") (at 102.87 90.17 90) (unit 1)
    (in_bom yes) (on_board yes) (fields_autoplaced)
    (uuid 65e23ca7-ecc2-435a-9f4e-fb691a13bd3e)
    (property "Reference" "#FLG0101" (id 0) (at 100.965 90.17 0)
      (effects (font (size 1.27 1.27)) hide)
    )
    (property "Value" "PWR_FLAG" (id 1) (at 99.06 90.1699 90)
      (effects (font (size 1.27 1.27)) (justify left))
    )
    (property "Footprint" "" (id 2) (at 102.87 90.17 0)
      (effects (font (size 1.27 1.27)) hide)
    )
    (property "Datasheet" "~" (id 3) (at 102.87 90.17 0)
      (effects (font (size 1.27 1.27)) hide)
    )
    (pin "1" (uuid 8bcb068e-bc4a-4af6-8d6b-2231e889d4be))
  )

  (symbol (lib_id "Regulator:NCP161-1.8") (at 62.23 107.95 0) (unit 1)
    (in_bom yes) (on_board yes) (fields_autoplaced)
    (uuid 680ed124-c93d-4e1b-b4a2-eacee0dfebbe)
    (property "Reference" "U2" (id 0) (at 62.23 99.06 0))
    (property "Value" "NCP161-1.8" (id 1) (at 62.23 101.6 0))
    (property "Footprint" "Package_TO_SOT_SMD:SOT-23-5" (id 2) (at 63.5 107.95 0)
      (effects (font (size 1.27 1.27)) hide)
    )
    (property "Datasheet" "" (id 3) (at 63.5 107.95 0)
      (effects (font (size 1.27 1.27)) hide)
    )
    (pin "1" (uuid 0bc8ee3c-def4-4444-8879-111c4c90a3d7))
    (pin "2" (uuid 87e0fc25-b852-43c4-8926-4189c8b808d3))
    (pin "3" (uuid 25f1af8d-ca43-4e5b-ba25-9030c4db16a1))
    (pin "5" (uuid 75eb9cf3-e95b-4c3f-a57a-573fe561801c))
  )

  (symbol (lib_id "power:VDD") (at 153.67 34.29 0) (unit 1)
    (in_bom yes) (on_board yes)
    (uuid 6d6c554c-0306-4700-9807-96446be8b692)
    (property "Reference" "#PWR0124" (id 0) (at 153.67 38.1 0)
      (effects (font (size 1.27 1.27)) hide)
    )
    (property "Value" "VDD" (id 1) (at 154.94 30.48 0))
    (property "Footprint" "" (id 2) (at 153.67 34.29 0)
      (effects (font (size 1.27 1.27)) hide)
    )
    (property "Datasheet" "" (id 3) (at 153.67 34.29 0)
      (effects (font (size 1.27 1.27)) hide)
    )
    (pin "1" (uuid f2eb56ec-7626-4208-b0e5-c406a9bf5112))
  )

  (symbol (lib_id "Device:C") (at 87.63 40.64 0) (unit 1)
    (in_bom yes) (on_board yes)
    (uuid 7951ac84-12a5-404a-8a29-960e9877b214)
    (property "Reference" "C2" (id 0) (at 78.74 39.37 0)
      (effects (font (size 1.27 1.27)) (justify left))
    )
    (property "Value" "0.1uF" (id 1) (at 78.74 41.91 0)
      (effects (font (size 1.27 1.27)) (justify left))
    )
    (property "Footprint" "Capacitor_SMD:C_0603_1608Metric" (id 2) (at 88.5952 44.45 0)
      (effects (font (size 1.27 1.27)) hide)
    )
    (property "Datasheet" "~" (id 3) (at 87.63 40.64 0)
      (effects (font (size 1.27 1.27)) hide)
    )
    (pin "1" (uuid 71892a18-94df-4c20-8859-5cd69ba93a7e))
    (pin "2" (uuid 6ab11f0c-1b0f-4258-b2a8-ad50a2bf5dfe))
  )

  (symbol (lib_id "power:VDD") (at 135.89 55.88 90) (unit 1)
    (in_bom yes) (on_board yes)
    (uuid 84dcb129-51e3-44a6-bcd9-7c40524360bd)
    (property "Reference" "#PWR0127" (id 0) (at 139.7 55.88 0)
      (effects (font (size 1.27 1.27)) hide)
    )
    (property "Value" "VDD" (id 1) (at 130.81 55.88 90))
    (property "Footprint" "" (id 2) (at 135.89 55.88 0)
      (effects (font (size 1.27 1.27)) hide)
    )
    (property "Datasheet" "" (id 3) (at 135.89 55.88 0)
      (effects (font (size 1.27 1.27)) hide)
    )
    (pin "1" (uuid 3fb4c42c-099f-48af-91d6-d377cbfea791))
  )

  (symbol (lib_id "power:VDD") (at 102.87 36.83 270) (unit 1)
    (in_bom yes) (on_board yes) (fields_autoplaced)
    (uuid 85b2a55c-40b8-41fe-bbe4-98743e722990)
    (property "Reference" "#PWR0110" (id 0) (at 99.06 36.83 0)
      (effects (font (size 1.27 1.27)) hide)
    )
    (property "Value" "VDD" (id 1) (at 106.68 36.8299 90)
      (effects (font (size 1.27 1.27)) (justify left))
    )
    (property "Footprint" "" (id 2) (at 102.87 36.83 0)
      (effects (font (size 1.27 1.27)) hide)
    )
    (property "Datasheet" "" (id 3) (at 102.87 36.83 0)
      (effects (font (size 1.27 1.27)) hide)
    )
    (pin "1" (uuid 629280b7-814b-40bd-b512-0fc0991c0ce5))
  )

  (symbol (lib_id "LSF0204:LSF0204RUTR") (at 152.4 44.45 0) (unit 1)
    (in_bom yes) (on_board yes) (fields_autoplaced)
    (uuid 8626ae25-a40d-415f-9d22-64e5f67d3427)
    (property "Reference" "U3" (id 0) (at 154.4194 62.23 0)
      (effects (font (size 1.27 1.27)) (justify left))
    )
    (property "Value" "LSF0204RUTR" (id 1) (at 154.4194 64.77 0)
      (effects (font (size 1.27 1.27)) (justify left))
    )
    (property "Footprint" "Package_DFN_QFN:Texas_R_PUQFN-N12" (id 2) (at 156.21 44.45 0)
      (effects (font (size 1.27 1.27)) hide)
    )
    (property "Datasheet" "" (id 3) (at 156.21 44.45 0)
      (effects (font (size 1.27 1.27)) hide)
    )
    (pin "1" (uuid 1cb33800-21b1-4a43-9f19-78bc13a955f8))
    (pin "10" (uuid 627b0476-c327-4540-bde3-a186bdfb4463))
    (pin "11" (uuid 31618975-92f1-4f73-b03d-01da2daeb149))
    (pin "12" (uuid 9075eadc-d83e-4852-8529-0065a5e4e4e1))
    (pin "2" (uuid ea439f80-fd73-43f2-b3e1-c9285536d07d))
    (pin "3" (uuid 07813137-e216-4c9d-b95b-c1327020f1a4))
    (pin "4" (uuid 34a0c985-6f61-4ea2-92b6-456d76a88cd4))
    (pin "5" (uuid 7c7c801c-1d68-4311-9253-a9b2d36b750f))
    (pin "6" (uuid afec43ee-72f2-400e-bf85-4bdc25b3b247))
    (pin "7" (uuid 068fa5da-b46a-4f22-a58b-b33c1802309c))
    (pin "8" (uuid 568bd582-00a6-4137-8218-118c6fcae365))
    (pin "9" (uuid f1569f16-7d23-450e-92c5-3811c3f4b7f2))
  )

  (symbol (lib_id "Device:C") (at 74.93 115.57 0) (unit 1)
    (in_bom yes) (on_board yes)
    (uuid 8a115450-b1d4-419a-9eb5-01e3d03567fe)
    (property "Reference" "C6" (id 0) (at 68.58 114.3 0)
      (effects (font (size 1.27 1.27)) (justify left))
    )
    (property "Value" "1uF" (id 1) (at 68.58 116.84 0)
      (effects (font (size 1.27 1.27)) (justify left))
    )
    (property "Footprint" "Capacitor_SMD:C_0603_1608Metric" (id 2) (at 75.8952 119.38 0)
      (effects (font (size 1.27 1.27)) hide)
    )
    (property "Datasheet" "~" (id 3) (at 74.93 115.57 0)
      (effects (font (size 1.27 1.27)) hide)
    )
    (pin "1" (uuid 180cae8d-ff08-4a94-96dd-473df3634a1e))
    (pin "2" (uuid 671e6eb7-fa05-4f91-b6c4-a9fb84d7ecfa))
  )

  (symbol (lib_id "Device:R") (at 147.32 107.95 0) (unit 1)
    (in_bom yes) (on_board yes) (fields_autoplaced)
    (uuid 9113b43a-0764-4309-a665-6cca60173ab3)
    (property "Reference" "R5" (id 0) (at 149.86 106.6799 0)
      (effects (font (size 1.27 1.27)) (justify left))
    )
    (property "Value" "2.2K" (id 1) (at 149.86 109.2199 0)
      (effects (font (size 1.27 1.27)) (justify left))
    )
    (property "Footprint" "Resistor_SMD:R_0603_1608Metric" (id 2) (at 145.542 107.95 90)
      (effects (font (size 1.27 1.27)) hide)
    )
    (property "Datasheet" "~" (id 3) (at 147.32 107.95 0)
      (effects (font (size 1.27 1.27)) hide)
    )
    (pin "1" (uuid c7549358-f7d3-4fa4-a0e4-94af08257c01))
    (pin "2" (uuid 93b02a95-2760-4073-a8e0-7ccfaab44e98))
  )

  (symbol (lib_id "power:+1V8") (at 151.13 34.29 0) (unit 1)
    (in_bom yes) (on_board yes)
    (uuid 91667e11-aa76-4e6c-8357-7fcd22f296da)
    (property "Reference" "#PWR0126" (id 0) (at 151.13 38.1 0)
      (effects (font (size 1.27 1.27)) hide)
    )
    (property "Value" "+1V8" (id 1) (at 148.59 30.48 0))
    (property "Footprint" "" (id 2) (at 151.13 34.29 0)
      (effects (font (size 1.27 1.27)) hide)
    )
    (property "Datasheet" "" (id 3) (at 151.13 34.29 0)
      (effects (font (size 1.27 1.27)) hide)
    )
    (pin "1" (uuid 2d78f4a7-2a97-4e09-a7b3-1752a293c9c2))
  )

  (symbol (lib_id "power:GND") (at 34.29 181.61 0) (unit 1)
    (in_bom yes) (on_board yes) (fields_autoplaced)
    (uuid a05fdbc6-9b2f-4bd9-b348-0381169a424c)
    (property "Reference" "#PWR0106" (id 0) (at 34.29 187.96 0)
      (effects (font (size 1.27 1.27)) hide)
    )
    (property "Value" "GND" (id 1) (at 34.29 186.69 0))
    (property "Footprint" "" (id 2) (at 34.29 181.61 0)
      (effects (font (size 1.27 1.27)) hide)
    )
    (property "Datasheet" "" (id 3) (at 34.29 181.61 0)
      (effects (font (size 1.27 1.27)) hide)
    )
    (pin "1" (uuid 8b85a9b9-78e2-49ab-a947-587e03ffe5a3))
  )

  (symbol (lib_id "power:+1V8") (at 152.4 101.6 0) (unit 1)
    (in_bom yes) (on_board yes) (fields_autoplaced)
    (uuid a0901908-e5a4-402e-9337-362fdf34a9c0)
    (property "Reference" "#PWR0114" (id 0) (at 152.4 105.41 0)
      (effects (font (size 1.27 1.27)) hide)
    )
    (property "Value" "+1V8" (id 1) (at 152.4 96.52 0))
    (property "Footprint" "" (id 2) (at 152.4 101.6 0)
      (effects (font (size 1.27 1.27)) hide)
    )
    (property "Datasheet" "" (id 3) (at 152.4 101.6 0)
      (effects (font (size 1.27 1.27)) hide)
    )
    (pin "1" (uuid ec90f920-1c39-46d9-b036-f68c82e647ba))
  )

  (symbol (lib_id "power:+1V8") (at 74.93 104.14 0) (unit 1)
    (in_bom yes) (on_board yes) (fields_autoplaced)
    (uuid b10917bf-e1fd-49e9-8efe-2c55d6cabf2d)
    (property "Reference" "#PWR0123" (id 0) (at 74.93 107.95 0)
      (effects (font (size 1.27 1.27)) hide)
    )
    (property "Value" "+1V8" (id 1) (at 74.93 99.06 0))
    (property "Footprint" "" (id 2) (at 74.93 104.14 0)
      (effects (font (size 1.27 1.27)) hide)
    )
    (property "Datasheet" "" (id 3) (at 74.93 104.14 0)
      (effects (font (size 1.27 1.27)) hide)
    )
    (pin "1" (uuid 26eaa27d-cbed-466d-8e3a-beb80ed1fb31))
  )

  (symbol (lib_id "power:GND") (at 74.93 119.38 0) (unit 1)
    (in_bom yes) (on_board yes) (fields_autoplaced)
    (uuid bc982b93-1bb9-471f-b560-ae42962cf46b)
    (property "Reference" "#PWR0119" (id 0) (at 74.93 125.73 0)
      (effects (font (size 1.27 1.27)) hide)
    )
    (property "Value" "GND" (id 1) (at 74.93 124.46 0))
    (property "Footprint" "" (id 2) (at 74.93 119.38 0)
      (effects (font (size 1.27 1.27)) hide)
    )
    (property "Datasheet" "" (id 3) (at 74.93 119.38 0)
      (effects (font (size 1.27 1.27)) hide)
    )
    (pin "1" (uuid 554dcbc2-11fc-42c6-8b21-7ca1b25b0b1c))
  )

  (symbol (lib_id "power:VDD") (at 90.17 160.02 0) (unit 1)
    (in_bom yes) (on_board yes) (fields_autoplaced)
    (uuid c5d51a54-e4b4-46e2-8477-606b169cf276)
    (property "Reference" "#PWR0103" (id 0) (at 90.17 163.83 0)
      (effects (font (size 1.27 1.27)) hide)
    )
    (property "Value" "VDD" (id 1) (at 90.17 154.94 0))
    (property "Footprint" "" (id 2) (at 90.17 160.02 0)
      (effects (font (size 1.27 1.27)) hide)
    )
    (property "Datasheet" "" (id 3) (at 90.17 160.02 0)
      (effects (font (size 1.27 1.27)) hide)
    )
    (pin "1" (uuid 9137577b-b5f1-49d6-ad89-b2ccd338dfc5))
  )

  (symbol (lib_id "power:GND") (at 102.87 93.98 90) (unit 1)
    (in_bom yes) (on_board yes) (fields_autoplaced)
    (uuid ce54a909-e7d0-4d15-b0b0-ba73798dcf73)
    (property "Reference" "#PWR0118" (id 0) (at 109.22 93.98 0)
      (effects (font (size 1.27 1.27)) hide)
    )
    (property "Value" "GND" (id 1) (at 106.68 93.9799 90)
      (effects (font (size 1.27 1.27)) (justify right))
    )
    (property "Footprint" "" (id 2) (at 102.87 93.98 0)
      (effects (font (size 1.27 1.27)) hide)
    )
    (property "Datasheet" "" (id 3) (at 102.87 93.98 0)
      (effects (font (size 1.27 1.27)) hide)
    )
    (pin "1" (uuid 056d34bd-6e3e-45ca-9d57-62186b24fd37))
  )

  (symbol (lib_id "power:GND") (at 96.52 44.45 0) (unit 1)
    (in_bom yes) (on_board yes) (fields_autoplaced)
    (uuid cecff87f-b58a-4408-a37f-e15bbe2d7f9d)
    (property "Reference" "#PWR0104" (id 0) (at 96.52 50.8 0)
      (effects (font (size 1.27 1.27)) hide)
    )
    (property "Value" "GND" (id 1) (at 96.52 48.895 0))
    (property "Footprint" "" (id 2) (at 96.52 44.45 0)
      (effects (font (size 1.27 1.27)) hide)
    )
    (property "Datasheet" "" (id 3) (at 96.52 44.45 0)
      (effects (font (size 1.27 1.27)) hide)
    )
    (pin "1" (uuid ae035842-7647-4b0f-9014-29e2c175c783))
  )

  (symbol (lib_id "Connector_Generic:Conn_01x09") (at 40.64 168.91 0) (unit 1)
    (in_bom yes) (on_board yes) (fields_autoplaced)
    (uuid dbc9f234-51a1-42b2-b08d-f3b2d1b490a4)
    (property "Reference" "J1" (id 0) (at 43.18 167.6399 0)
      (effects (font (size 1.27 1.27)) (justify left))
    )
    (property "Value" "Conn_01x09" (id 1) (at 43.18 170.1799 0)
      (effects (font (size 1.27 1.27)) (justify left))
    )
    (property "Footprint" "Connector_PinHeader_2.54mm:PinHeader_1x09_P2.54mm_Vertical" (id 2) (at 40.64 168.91 0)
      (effects (font (size 1.27 1.27)) hide)
    )
    (property "Datasheet" "~" (id 3) (at 40.64 168.91 0)
      (effects (font (size 1.27 1.27)) hide)
    )
    (pin "1" (uuid f69a9580-e5a0-43ab-ab26-a823692ba7e8))
    (pin "2" (uuid 4411cded-fb3b-47b1-82a9-2aa03b8d66dd))
    (pin "3" (uuid bf368d12-f9de-48f4-a21d-0c487fda126a))
    (pin "4" (uuid 1bdf2b87-e380-4485-8219-3210fd09433f))
    (pin "5" (uuid 5d77de84-25e6-4d1a-9ad5-3900c8221eca))
    (pin "6" (uuid 3af6383d-47a4-486b-afcc-ecbf4ad64be4))
    (pin "7" (uuid eae9cd7e-b719-48ab-abde-cf5c9a0ad65b))
    (pin "8" (uuid a7510adc-ff5f-41c0-ab2b-39698743af2e))
    (pin "9" (uuid 0ee05390-e3cd-4435-8c86-9abf38a4f281))
  )

  (symbol (lib_id "Device:R") (at 139.7 55.88 270) (unit 1)
    (in_bom yes) (on_board yes)
    (uuid dbfb3d63-335f-4c83-add3-9211902ced14)
    (property "Reference" "R3" (id 0) (at 139.7 58.42 90))
    (property "Value" "10K" (id 1) (at 139.7 55.88 90))
    (property "Footprint" "Resistor_SMD:R_0603_1608Metric" (id 2) (at 139.7 54.102 90)
      (effects (font (size 1.27 1.27)) hide)
    )
    (property "Datasheet" "~" (id 3) (at 139.7 55.88 0)
      (effects (font (size 1.27 1.27)) hide)
    )
    (property "LCSC" "C25744" (id 4) (at 139.7 55.88 0)
      (effects (font (size 1.27 1.27)) hide)
    )
    (pin "1" (uuid 04f07248-d5c6-4cb5-b72d-43aad22e0d8b))
    (pin "2" (uuid cd27cd0e-cd9f-4253-96cf-3ea9edf25832))
  )

  (symbol (lib_id "Device:R") (at 223.52 57.15 90) (unit 1)
    (in_bom yes) (on_board yes)
    (uuid e3229986-4eb9-4390-8d44-89362d391332)
    (property "Reference" "R4" (id 0) (at 223.52 59.69 90))
    (property "Value" "10K" (id 1) (at 223.52 57.15 90))
    (property "Footprint" "Resistor_SMD:R_0603_1608Metric" (id 2) (at 223.52 58.928 90)
      (effects (font (size 1.27 1.27)) hide)
    )
    (property "Datasheet" "~" (id 3) (at 223.52 57.15 0)
      (effects (font (size 1.27 1.27)) hide)
    )
    (property "LCSC" "C25744" (id 4) (at 223.52 57.15 0)
      (effects (font (size 1.27 1.27)) hide)
    )
    (pin "1" (uuid 13deffc9-9698-4bcf-b17e-76dfc214acbe))
    (pin "2" (uuid a07a927e-3fd2-4495-b69d-ca255d33ea65))
  )

  (symbol (lib_id "power:+1V8") (at 234.95 33.02 0) (unit 1)
    (in_bom yes) (on_board yes)
    (uuid e638e632-7595-41a3-80b9-4b9ec5e1b08c)
    (property "Reference" "#PWR0113" (id 0) (at 234.95 36.83 0)
      (effects (font (size 1.27 1.27)) hide)
    )
    (property "Value" "+1V8" (id 1) (at 232.41 29.21 0))
    (property "Footprint" "" (id 2) (at 234.95 33.02 0)
      (effects (font (size 1.27 1.27)) hide)
    )
    (property "Datasheet" "" (id 3) (at 234.95 33.02 0)
      (effects (font (size 1.27 1.27)) hide)
    )
    (pin "1" (uuid a41dd0f3-76a0-42ea-8595-050cbd0d9b26))
  )

  (symbol (lib_id "power:GND") (at 34.29 74.93 0) (unit 1)
    (in_bom yes) (on_board yes) (fields_autoplaced)
    (uuid ea3e5ea3-4325-4b7a-bf85-b096792e0be1)
    (property "Reference" "#PWR0101" (id 0) (at 34.29 81.28 0)
      (effects (font (size 1.27 1.27)) hide)
    )
    (property "Value" "GND" (id 1) (at 34.29 80.01 0))
    (property "Footprint" "" (id 2) (at 34.29 74.93 0)
      (effects (font (size 1.27 1.27)) hide)
    )
    (property "Datasheet" "" (id 3) (at 34.29 74.93 0)
      (effects (font (size 1.27 1.27)) hide)
    )
    (pin "1" (uuid 276c7437-52e5-43cd-ad62-d428055b1676))
  )

  (symbol (lib_id "power:GND") (at 46.99 119.38 0) (unit 1)
    (in_bom yes) (on_board yes) (fields_autoplaced)
    (uuid ebe59324-bd6f-477d-bf75-78a4373252b9)
    (property "Reference" "#PWR0116" (id 0) (at 46.99 125.73 0)
      (effects (font (size 1.27 1.27)) hide)
    )
    (property "Value" "GND" (id 1) (at 46.99 124.46 0))
    (property "Footprint" "" (id 2) (at 46.99 119.38 0)
      (effects (font (size 1.27 1.27)) hide)
    )
    (property "Datasheet" "" (id 3) (at 46.99 119.38 0)
      (effects (font (size 1.27 1.27)) hide)
    )
    (pin "1" (uuid 93543e9a-c377-4325-94f4-a9de5330d52b))
  )

  (symbol (lib_id "Device:C") (at 87.63 30.48 0) (unit 1)
    (in_bom yes) (on_board yes)
    (uuid fa724c30-7eb9-48c8-a419-726b09d5fbbe)
    (property "Reference" "C4" (id 0) (at 91.186 27.94 0)
      (effects (font (size 1.27 1.27)) (justify left))
    )
    (property "Value" "0.1uF" (id 1) (at 91.186 30.48 0)
      (effects (font (size 1.27 1.27)) (justify left))
    )
    (property "Footprint" "Capacitor_SMD:C_0603_1608Metric" (id 2) (at 88.5952 34.29 0)
      (effects (font (size 1.27 1.27)) hide)
    )
    (property "Datasheet" "~" (id 3) (at 87.63 30.48 0)
      (effects (font (size 1.27 1.27)) hide)
    )
    (pin "1" (uuid 492ef180-76a1-499a-9f87-5e075e12bf57))
    (pin "2" (uuid 617ae8b2-a540-43c5-bbcb-a06ea8491e8f))
  )

  (symbol (lib_id "power:VDD") (at 219.71 57.15 90) (unit 1)
    (in_bom yes) (on_board yes)
    (uuid fb148b44-91df-4d09-978c-84c7e783a60c)
    (property "Reference" "#PWR0128" (id 0) (at 223.52 57.15 0)
      (effects (font (size 1.27 1.27)) hide)
    )
    (property "Value" "VDD" (id 1) (at 214.63 57.15 90))
    (property "Footprint" "" (id 2) (at 219.71 57.15 0)
      (effects (font (size 1.27 1.27)) hide)
    )
    (property "Datasheet" "" (id 3) (at 219.71 57.15 0)
      (effects (font (size 1.27 1.27)) hide)
    )
    (pin "1" (uuid 880fd305-de09-49eb-bf6e-4d4b9f2c6c8a))
  )

  (symbol (lib_id "power:VDD") (at 46.99 104.14 0) (unit 1)
    (in_bom yes) (on_board yes) (fields_autoplaced)
    (uuid fe0bfc01-d544-4f5f-afe4-b058fc861cd8)
    (property "Reference" "#PWR0122" (id 0) (at 46.99 107.95 0)
      (effects (font (size 1.27 1.27)) hide)
    )
    (property "Value" "VDD" (id 1) (at 46.99 99.06 0))
    (property "Footprint" "" (id 2) (at 46.99 104.14 0)
      (effects (font (size 1.27 1.27)) hide)
    )
    (property "Datasheet" "" (id 3) (at 46.99 104.14 0)
      (effects (font (size 1.27 1.27)) hide)
    )
    (pin "1" (uuid f2e44b01-f3bb-4ea1-9d19-3b8b3a4444b1))
  )

  (sheet_instances
    (path "/" (page "1"))
  )

  (symbol_instances
    (path "/65e23ca7-ecc2-435a-9f4e-fb691a13bd3e"
      (reference "#FLG0101") (unit 1) (value "PWR_FLAG") (footprint "")
    )
    (path "/03cd7bc6-0ea0-4595-8c74-6e4b3b0aa2f2"
      (reference "#FLG0102") (unit 1) (value "PWR_FLAG") (footprint "")
    )
    (path "/ea3e5ea3-4325-4b7a-bf85-b096792e0be1"
      (reference "#PWR0101") (unit 1) (value "GND") (footprint "")
    )
    (path "/30d37047-3218-4186-bf2b-f4bc580d1396"
      (reference "#PWR0102") (unit 1) (value "GND") (footprint "")
    )
    (path "/c5d51a54-e4b4-46e2-8477-606b169cf276"
      (reference "#PWR0103") (unit 1) (value "VDD") (footprint "")
    )
    (path "/cecff87f-b58a-4408-a37f-e15bbe2d7f9d"
      (reference "#PWR0104") (unit 1) (value "GND") (footprint "")
    )
    (path "/05bba830-30cf-4f82-982f-b6148be45a7d"
      (reference "#PWR0105") (unit 1) (value "GND") (footprint "")
    )
    (path "/a05fdbc6-9b2f-4bd9-b348-0381169a424c"
      (reference "#PWR0106") (unit 1) (value "GND") (footprint "")
    )
    (path "/26ea4c84-7a11-436e-8c27-f855f55a0890"
      (reference "#PWR0107") (unit 1) (value "GND") (footprint "")
    )
    (path "/4ba3a6d6-b085-404d-86fa-f3b76fed05ad"
      (reference "#PWR0108") (unit 1) (value "VDD") (footprint "")
    )
    (path "/608e1c48-59a3-42f1-89f8-cc802f5b4bf4"
      (reference "#PWR0109") (unit 1) (value "GND") (footprint "")
    )
    (path "/85b2a55c-40b8-41fe-bbe4-98743e722990"
      (reference "#PWR0110") (unit 1) (value "VDD") (footprint "")
    )
    (path "/61ebf869-917e-4fea-a950-8e08534b2897"
      (reference "#PWR0111") (unit 1) (value "+1V8") (footprint "")
    )
    (path "/3431cdc7-829e-4d60-a0e3-c4fd5ee1ad64"
      (reference "#PWR0112") (unit 1) (value "GND") (footprint "")
    )
    (path "/e638e632-7595-41a3-80b9-4b9ec5e1b08c"
      (reference "#PWR0113") (unit 1) (value "+1V8") (footprint "")
    )
    (path "/a0901908-e5a4-402e-9337-362fdf34a9c0"
      (reference "#PWR0114") (unit 1) (value "+1V8") (footprint "")
    )
    (path "/1ad733c6-e302-49b3-aa07-8b8101ad5e1e"
      (reference "#PWR0115") (unit 1) (value "VDD") (footprint "")
    )
    (path "/ebe59324-bd6f-477d-bf75-78a4373252b9"
      (reference "#PWR0116") (unit 1) (value "GND") (footprint "")
    )
    (path "/39eab18d-4bab-4fb8-8fc6-d8fc22d2070a"
      (reference "#PWR0117") (unit 1) (value "VDD") (footprint "")
    )
    (path "/ce54a909-e7d0-4d15-b0b0-ba73798dcf73"
      (reference "#PWR0118") (unit 1) (value "GND") (footprint "")
    )
    (path "/bc982b93-1bb9-471f-b560-ae42962cf46b"
      (reference "#PWR0119") (unit 1) (value "GND") (footprint "")
    )
    (path "/4118e409-398a-420d-8e9c-6bc513d48b27"
      (reference "#PWR0121") (unit 1) (value "GND") (footprint "")
    )
    (path "/fe0bfc01-d544-4f5f-afe4-b058fc861cd8"
      (reference "#PWR0122") (unit 1) (value "VDD") (footprint "")
    )
    (path "/b10917bf-e1fd-49e9-8efe-2c55d6cabf2d"
      (reference "#PWR0123") (unit 1) (value "+1V8") (footprint "")
    )
    (path "/6d6c554c-0306-4700-9807-96446be8b692"
      (reference "#PWR0124") (unit 1) (value "VDD") (footprint "")
    )
    (path "/5c9f26cd-f08a-42e6-ab3b-f56e11d03e7a"
      (reference "#PWR0125") (unit 1) (value "GND") (footprint "")
    )
    (path "/91667e11-aa76-4e6c-8357-7fcd22f296da"
      (reference "#PWR0126") (unit 1) (value "+1V8") (footprint "")
    )
    (path "/84dcb129-51e3-44a6-bcd9-7c40524360bd"
      (reference "#PWR0127") (unit 1) (value "VDD") (footprint "")
    )
    (path "/fb148b44-91df-4d09-978c-84c7e783a60c"
      (reference "#PWR0128") (unit 1) (value "VDD") (footprint "")
    )
    (path "/2b0c9c83-9215-4ac0-8c87-d863d1bde1a8"
      (reference "C1") (unit 1) (value "0.1uF") (footprint "Capacitor_SMD:C_0603_1608Metric")
    )
    (path "/7951ac84-12a5-404a-8a29-960e9877b214"
      (reference "C2") (unit 1) (value "0.1uF") (footprint "Capacitor_SMD:C_0603_1608Metric")
    )
    (path "/1c3617f7-6d29-4367-8e24-adf6783a5f1b"
      (reference "C3") (unit 1) (value "2.2uF") (footprint "Capacitor_SMD:C_0603_1608Metric")
    )
    (path "/fa724c30-7eb9-48c8-a419-726b09d5fbbe"
      (reference "C4") (unit 1) (value "0.1uF") (footprint "Capacitor_SMD:C_0603_1608Metric")
    )
    (path "/2e84ff76-e036-47eb-a94c-ebbc69f91017"
      (reference "C5") (unit 1) (value "1uF") (footprint "Capacitor_SMD:C_0603_1608Metric")
    )
    (path "/8a115450-b1d4-419a-9eb5-01e3d03567fe"
      (reference "C6") (unit 1) (value "1uF") (footprint "Capacitor_SMD:C_0603_1608Metric")
    )
    (path "/3fba8c87-05ba-4d8a-8cfe-bb778a837b11"
      (reference "D1") (unit 1) (value "LED") (footprint "LED_SMD:LED_0603_1608Metric")
    )
    (path "/dbc9f234-51a1-42b2-b08d-f3b2d1b490a4"
      (reference "J1") (unit 1) (value "Conn_01x09") (footprint "Connector_PinHeader_2.54mm:PinHeader_1x09_P2.54mm_Vertical")
    )
    (path "/10165703-da8a-4933-bd03-1de83ece570c"
      (reference "R1") (unit 1) (value "2.2K") (footprint "Resistor_SMD:R_0603_1608Metric")
    )
    (path "/0be6725b-8861-44a5-b7f5-f89642463d63"
      (reference "R2") (unit 1) (value "1K") (footprint "Resistor_SMD:R_0603_1608Metric")
    )
    (path "/dbfb3d63-335f-4c83-add3-9211902ced14"
      (reference "R3") (unit 1) (value "10K") (footprint "Resistor_SMD:R_0603_1608Metric")
    )
    (path "/e3229986-4eb9-4390-8d44-89362d391332"
      (reference "R4") (unit 1) (value "10K") (footprint "Resistor_SMD:R_0603_1608Metric")
    )
    (path "/9113b43a-0764-4309-a665-6cca60173ab3"
      (reference "R5") (unit 1) (value "2.2K") (footprint "Resistor_SMD:R_0603_1608Metric")
    )
    (path "/09a84b52-4e71-4e98-a7df-a91449300631"
      (reference "R6") (unit 1) (value "2.2K") (footprint "Resistor_SMD:R_0603_1608Metric")
    )
    (path "/153e33af-5994-45a0-bddf-6f337cf32fb8"
      (reference "R7") (unit 1) (value "2.2K") (footprint "Resistor_SMD:R_0603_1608Metric")
    )
    (path "/36069a3b-e6be-44f1-b67b-26f72e06cde8"
      (reference "U1") (unit 1) (value "ICM-20789") (footprint "IMU1:ICM-20789")
    )
    (path "/680ed124-c93d-4e1b-b4a2-eacee0dfebbe"
      (reference "U2") (unit 1) (value "NCP161-1.8") (footprint "Package_TO_SOT_SMD:SOT-23-5")
    )
    (path "/8626ae25-a40d-415f-9d22-64e5f67d3427"
      (reference "U3") (unit 1) (value "LSF0204RUTR") (footprint "Package_DFN_QFN:Texas_R_PUQFN-N12")
    )
    (path "/5c865f26-3286-45d7-9c39-368e6cad6bba"
      (reference "U4") (unit 1) (value "LSF0204RUTR") (footprint "Package_DFN_QFN:Texas_R_PUQFN-N12")
    )
  )
)
