(kicad_symbol_lib (version 20211014) (generator kicad_symbol_editor)
  (symbol "NCP161-1.8" (in_bom yes) (on_board yes)
    (property "Reference" "U" (id 0) (at 0 10.16 0)
      (effects (font (size 1.27 1.27)))
    )
    (property "Value" "NCP161-1.8" (id 1) (at 0 7.62 0)
      (effects (font (size 1.27 1.27)))
    )
    (property "Footprint" "" (id 2) (at 1.27 0 0)
      (effects (font (size 1.27 1.27)) hide)
    )
    (property "Datasheet" "" (id 3) (at 1.27 0 0)
      (effects (font (size 1.27 1.27)) hide)
    )
    (symbol "NCP161-1.8_0_1"
      (rectangle (start -7.62 3.81) (end 7.62 -5.08)
        (stroke (width 0) (type default) (color 0 0 0 0))
        (fill (type background))
      )
    )
    (symbol "NCP161-1.8_1_1"
      (pin power_in line (at -10.16 1.27 0) (length 2.54)
        (name "IN" (effects (font (size 1.27 1.27))))
        (number "1" (effects (font (size 1.27 1.27))))
      )
      (pin power_in line (at 0 -7.62 90) (length 2.54)
        (name "GND" (effects (font (size 1.27 1.27))))
        (number "2" (effects (font (size 1.27 1.27))))
      )
      (pin input line (at -10.16 -2.54 0) (length 2.54)
        (name "EN" (effects (font (size 1.27 1.27))))
        (number "3" (effects (font (size 1.27 1.27))))
      )
      (pin power_out line (at 10.16 1.27 180) (length 2.54)
        (name "OUT" (effects (font (size 1.27 1.27))))
        (number "5" (effects (font (size 1.27 1.27))))
      )
    )
  )
)
