EESchema Schematic File Version 4
EELAYER 30 0
EELAYER END
$Descr A4 11693 8268
encoding utf-8
Sheet 1 1
Title ""
Date ""
Rev ""
Comp ""
Comment1 ""
Comment2 ""
Comment3 ""
Comment4 ""
$EndDescr
$Comp
L Connector_Generic:Conn_01x20 J?
U 1 1 5F5C9617
P 3700 3050
F 0 "J?" H 3618 4167 50  0000 C CNN
F 1 "Conn_01x20" H 3618 4076 50  0000 C CNN
F 2 "" H 3700 3050 50  0001 C CNN
F 3 "~" H 3700 3050 50  0001 C CNN
	1    3700 3050
	-1   0    0    -1  
$EndComp
$Comp
L Connector_Generic:Conn_01x20 J?
U 1 1 5F5CA2E7
P 2800 3050
F 0 "J?" H 2880 3042 50  0000 L CNN
F 1 "Conn_01x20" H 2880 2951 50  0000 L CNN
F 2 "" H 2800 3050 50  0001 C CNN
F 3 "~" H 2800 3050 50  0001 C CNN
	1    2800 3050
	1    0    0    -1  
$EndComp
$Comp
L Connector_Generic:Conn_01x04 J?
U 1 1 5F5CB1BC
P 3200 4200
F 0 "J?" V 3164 3912 50  0000 R CNN
F 1 "Conn_01x04" V 3073 3912 50  0000 R CNN
F 2 "" H 3200 4200 50  0001 C CNN
F 3 "~" H 3200 4200 50  0001 C CNN
	1    3200 4200
	0    -1   -1   0   
$EndComp
$Comp
L Connector_Generic:Conn_01x12 J?
U 1 1 5F588BE4
P 5400 2800
F 0 "J?" H 5480 2792 50  0000 L CNN
F 1 "Conn_01x12" H 5480 2701 50  0000 L CNN
F 2 "" H 5400 2800 50  0001 C CNN
F 3 "~" H 5400 2800 50  0001 C CNN
	1    5400 2800
	1    0    0    -1  
$EndComp
$Comp
L Connector_Generic:Conn_01x04 J?
U 1 1 5F589B6D
P 6250 3700
F 0 "J?" V 6214 3412 50  0000 R CNN
F 1 "Conn_01x04" V 6123 3412 50  0000 R CNN
F 2 "" H 6250 3700 50  0001 C CNN
F 3 "~" H 6250 3700 50  0001 C CNN
	1    6250 3700
	0    -1   -1   0   
$EndComp
$Comp
L Connector_Generic:Conn_01x08 J?
U 1 1 5F58AACC
P 7250 2800
F 0 "J?" H 7330 2792 50  0000 L CNN
F 1 "Conn_01x08" H 7330 2701 50  0000 L CNN
F 2 "" H 7250 2800 50  0001 C CNN
F 3 "~" H 7250 2800 50  0001 C CNN
	1    7250 2800
	1    0    0    -1  
$EndComp
$Comp
L Connector_Generic:Conn_01x02 J?
U 1 1 5F58BA55
P 6250 2350
F 0 "J?" H 6330 2342 50  0000 L CNN
F 1 "Conn_01x02" H 6330 2251 50  0000 L CNN
F 2 "" H 6250 2350 50  0001 C CNN
F 3 "~" H 6250 2350 50  0001 C CNN
	1    6250 2350
	1    0    0    -1  
$EndComp
Wire Wire Line
	5200 2300 5100 2300
Wire Wire Line
	5100 2300 5100 2400
Wire Wire Line
	5100 2400 5200 2400
Text Label 4000 2850 0    50   ~ 0
MOSI1
Text Label 4000 2950 0    50   ~ 0
MISO1
Text Label 4000 3050 0    50   ~ 0
SCK1
Wire Wire Line
	3900 2850 4000 2850
Wire Wire Line
	4000 2950 3900 2950
Text Label 5100 2800 2    50   ~ 0
MISO1
Text Label 5100 2900 2    50   ~ 0
MOSI1
Text Label 5100 3000 2    50   ~ 0
SCK1
Wire Wire Line
	5200 3000 5100 3000
Wire Wire Line
	5100 2900 5200 2900
Wire Wire Line
	5200 2800 5100 2800
Text Label 4000 3150 0    50   ~ 0
NSS1
Text Label 5100 3100 2    50   ~ 0
NSS1
Wire Wire Line
	5200 3100 5100 3100
Wire Wire Line
	4000 3050 3900 3050
Text Label 2500 2450 2    50   ~ 0
MOSI2
Text Label 2500 2350 2    50   ~ 0
MISO2
Text Label 2500 2250 2    50   ~ 0
SCK2
Text Label 2500 2150 2    50   ~ 0
NSS2
Wire Wire Line
	2600 2150 2500 2150
Wire Wire Line
	2500 2250 2600 2250
Wire Wire Line
	2600 2350 2500 2350
Wire Wire Line
	2500 2450 2600 2450
$Comp
L Connector_Generic:Conn_01x12 J?
U 1 1 5F59DBEC
P 5400 5000
F 0 "J?" H 5480 4992 50  0000 L CNN
F 1 "Conn_01x12" H 5480 4901 50  0000 L CNN
F 2 "" H 5400 5000 50  0001 C CNN
F 3 "~" H 5400 5000 50  0001 C CNN
	1    5400 5000
	1    0    0    -1  
$EndComp
$Comp
L Connector_Generic:Conn_01x04 J?
U 1 1 5F59E7BA
P 6200 5600
F 0 "J?" V 6164 5312 50  0000 R CNN
F 1 "Conn_01x04" V 6073 5312 50  0000 R CNN
F 2 "" H 6200 5600 50  0001 C CNN
F 3 "~" H 6200 5600 50  0001 C CNN
	1    6200 5600
	0    -1   -1   0   
$EndComp
$Comp
L Connector_Generic:Conn_01x08 J?
U 1 1 5F59F213
P 7200 4950
F 0 "J?" H 7280 4942 50  0000 L CNN
F 1 "Conn_01x08" H 7280 4851 50  0000 L CNN
F 2 "" H 7200 4950 50  0001 C CNN
F 3 "~" H 7200 4950 50  0001 C CNN
	1    7200 4950
	1    0    0    -1  
$EndComp
Wire Wire Line
	5200 4500 5100 4500
Wire Wire Line
	5100 4500 5100 4600
Wire Wire Line
	5100 4600 5200 4600
$Comp
L power:GND #PWR?
U 1 1 5F5A1EC6
P 5100 4700
F 0 "#PWR?" H 5100 4450 50  0001 C CNN
F 1 "GND" V 5105 4572 50  0000 R CNN
F 2 "" H 5100 4700 50  0001 C CNN
F 3 "" H 5100 4700 50  0001 C CNN
	1    5100 4700
	0    1    1    0   
$EndComp
Wire Wire Line
	5100 4700 5200 4700
$Comp
L power:GND #PWR?
U 1 1 5F5A2DB3
P 6900 4850
F 0 "#PWR?" H 6900 4600 50  0001 C CNN
F 1 "GND" V 6905 4722 50  0000 R CNN
F 2 "" H 6900 4850 50  0001 C CNN
F 3 "" H 6900 4850 50  0001 C CNN
	1    6900 4850
	0    1    1    0   
$EndComp
Wire Wire Line
	6900 4850 6950 4850
Wire Wire Line
	6950 4850 6950 4950
Wire Wire Line
	6950 4950 7000 4950
Connection ~ 6950 4850
Wire Wire Line
	6950 4850 7000 4850
$Comp
L Connector_Generic:Conn_01x02 J?
U 1 1 5F5A4A02
P 6250 4500
F 0 "J?" H 6330 4492 50  0000 L CNN
F 1 "Conn_01x02" H 6330 4401 50  0000 L CNN
F 2 "" H 6250 4500 50  0001 C CNN
F 3 "~" H 6250 4500 50  0001 C CNN
	1    6250 4500
	1    0    0    -1  
$EndComp
$Comp
L power:GND #PWR?
U 1 1 5F5A50A4
P 5950 4600
F 0 "#PWR?" H 5950 4350 50  0001 C CNN
F 1 "GND" V 5955 4472 50  0000 R CNN
F 2 "" H 5950 4600 50  0001 C CNN
F 3 "" H 5950 4600 50  0001 C CNN
	1    5950 4600
	0    1    1    0   
$EndComp
Wire Wire Line
	5950 4600 6050 4600
$Comp
L power:GND #PWR?
U 1 1 5F5A9701
P 4000 2250
F 0 "#PWR?" H 4000 2000 50  0001 C CNN
F 1 "GND" V 4005 2122 50  0000 R CNN
F 2 "" H 4000 2250 50  0001 C CNN
F 3 "" H 4000 2250 50  0001 C CNN
	1    4000 2250
	0    -1   -1   0   
$EndComp
Wire Wire Line
	4000 2250 3900 2250
$Comp
L power:GND #PWR?
U 1 1 5F5B3397
P 5950 2450
F 0 "#PWR?" H 5950 2200 50  0001 C CNN
F 1 "GND" V 5955 2322 50  0000 R CNN
F 2 "" H 5950 2450 50  0001 C CNN
F 3 "" H 5950 2450 50  0001 C CNN
	1    5950 2450
	0    1    1    0   
$EndComp
Wire Wire Line
	5950 2450 6050 2450
$Comp
L power:GND #PWR?
U 1 1 5F5B3FD9
P 6950 2700
F 0 "#PWR?" H 6950 2450 50  0001 C CNN
F 1 "GND" V 6955 2572 50  0000 R CNN
F 2 "" H 6950 2700 50  0001 C CNN
F 3 "" H 6950 2700 50  0001 C CNN
	1    6950 2700
	0    1    1    0   
$EndComp
Wire Wire Line
	7050 2700 7000 2700
Wire Wire Line
	7050 2800 7000 2800
Wire Wire Line
	7000 2800 7000 2700
Connection ~ 7000 2700
Wire Wire Line
	7000 2700 6950 2700
Text Label 5100 5100 2    50   ~ 0
MOSI2
Text Label 5100 5000 2    50   ~ 0
MISO2
Text Label 5100 5200 2    50   ~ 0
SCK2
Text Label 5100 5300 2    50   ~ 0
NSS2
Wire Wire Line
	5100 5300 5200 5300
Wire Wire Line
	5200 5200 5100 5200
Wire Wire Line
	5100 5100 5200 5100
Wire Wire Line
	5200 5000 5100 5000
$Comp
L power:GND #PWR?
U 1 1 5F5BD9E6
P 5100 2500
F 0 "#PWR?" H 5100 2250 50  0001 C CNN
F 1 "GND" V 5105 2372 50  0000 R CNN
F 2 "" H 5100 2500 50  0001 C CNN
F 3 "" H 5100 2500 50  0001 C CNN
	1    5100 2500
	0    1    1    0   
$EndComp
Wire Wire Line
	5100 2500 5200 2500
NoConn ~ 6100 5800
NoConn ~ 6200 5800
NoConn ~ 6150 3900
NoConn ~ 6250 3900
Text Label 6900 4750 2    50   ~ 0
VIN
Wire Wire Line
	6900 4750 6950 4750
Wire Wire Line
	7000 4650 6950 4650
Wire Wire Line
	6950 4650 6950 4750
Connection ~ 6950 4750
Wire Wire Line
	6950 4750 7000 4750
Text Label 4800 4900 2    50   ~ 0
DIR2
Wire Wire Line
	4800 4900 5200 4900
Text Label 4800 4800 2    50   ~ 0
STEP2
Wire Wire Line
	4800 4800 5200 4800
Text Label 4800 2600 2    50   ~ 0
STEP1
Wire Wire Line
	4800 2600 5200 2600
Text Label 4800 2700 2    50   ~ 0
DIR1
Wire Wire Line
	4800 2700 5200 2700
Text Label 5100 3200 2    50   ~ 0
SLEEP1
Text Label 5100 3300 2    50   ~ 0
RESET1
Wire Wire Line
	5200 3300 5100 3300
Wire Wire Line
	5100 3200 5200 3200
Text Label 5100 3400 2    50   ~ 0
FAULT1
Wire Wire Line
	5200 3400 5100 3400
Text Label 5100 5400 2    50   ~ 0
SLEEP2
Text Label 5100 5500 2    50   ~ 0
RESET2
Text Label 5100 5600 2    50   ~ 0
FAULT2
Wire Wire Line
	5100 5600 5200 5600
Wire Wire Line
	5200 5500 5100 5500
Wire Wire Line
	5100 5400 5200 5400
Text Label 6300 5950 2    50   ~ 0
BEMFV2
Text Label 6300 6050 2    50   ~ 0
BEMF2
Wire Wire Line
	6300 5800 6300 5950
Wire Wire Line
	6400 5800 6400 6050
Wire Wire Line
	6400 6050 6300 6050
Text Label 6350 4050 2    50   ~ 0
BEMFV1
Text Label 6350 4150 2    50   ~ 0
BEMF1
Wire Wire Line
	6350 4150 6450 4150
Wire Wire Line
	6450 4150 6450 3900
Wire Wire Line
	6350 3900 6350 4050
Text Label 6950 2600 2    50   ~ 0
VIN
Wire Wire Line
	6950 2600 7000 2600
Wire Wire Line
	7000 2600 7000 2500
Wire Wire Line
	7000 2500 7050 2500
Connection ~ 7000 2600
Wire Wire Line
	7000 2600 7050 2600
Text Label 4000 3250 0    50   ~ 0
RX2
Wire Wire Line
	4000 3150 3900 3150
Text Label 4000 3350 0    50   ~ 0
TX2
Wire Wire Line
	3900 3250 4000 3250
Wire Wire Line
	4000 3350 3900 3350
Text Label 4000 2750 0    50   ~ 0
BEMF1
Text Label 4000 2650 0    50   ~ 0
BEMF2
Wire Wire Line
	4000 2650 3900 2650
Wire Wire Line
	3900 2750 4000 2750
Text Label 2500 2850 2    50   ~ 0
SLEEP1
Wire Wire Line
	2500 2850 2600 2850
Text Label 2500 2950 2    50   ~ 0
FAULT1
Wire Wire Line
	2500 2950 2600 2950
Wire Wire Line
	2500 3050 2600 3050
Text Label 2500 3050 2    50   ~ 0
SLEEP2
Text Label 2500 3150 2    50   ~ 0
FAULT2
Wire Wire Line
	2500 3150 2600 3150
Text Label 4000 3850 0    50   ~ 0
BEMFV1
Text Label 4000 3750 0    50   ~ 0
BEMFV2
Wire Wire Line
	4000 3750 3900 3750
Wire Wire Line
	3900 3850 4000 3850
NoConn ~ 3900 3650
NoConn ~ 3900 3950
NoConn ~ 3900 4050
$EndSCHEMATC
