(module LOGO (layer F.Cu)
  (at 0 0)
(attr board_only exclude_from_pos_files exclude_from_bom)
 (fp_text reference "G***" (at 0 0) (layer F.SilkS)
  (effects (font (thickness 0.3)))
  )
  (fp_text value "LOGO" (at 0.75 0) (layer F.SilkS) hide
  (effects (font (thickness 0.3)))
  )
  (fp_poly (pts (xy -1.849860 1.165056) (xy -1.858753 1.173950) (xy -1.867647 1.165056) (xy -1.858753 1.156163) )(layer F.SilkS) (width  0.000000)
  )
  (fp_poly (pts (xy -1.814285 1.147269) (xy -1.823179 1.156163) (xy -1.832072 1.147269) (xy -1.823179 1.138376) )(layer F.SilkS) (width  0.000000)
  )
  (fp_poly (pts (xy -1.778711 1.129482) (xy -1.787605 1.138376) (xy -1.796498 1.129482) (xy -1.787605 1.120589) )(layer F.SilkS) (width  0.000000)
  )
  (fp_poly (pts (xy 1.698882 -1.173949) (xy 1.682349 -1.147585) (xy 1.651545 -1.100300) (xy 1.612078 -1.040675) (xy 1.596193 -1.016889) (xy 1.535377 -0.921891) (xy 1.494479 -0.846525) (xy 1.470325 -0.783365)
     (xy 1.459740 -0.724984) (xy 1.458544 -0.694861) (xy 1.463938 -0.644227) (xy 1.484912 -0.602170) (xy 1.523707 -0.558571) (xy 1.579260 -0.512635) (xy 1.647945 -0.468442) (xy 1.683791 -0.449952)
     (xy 1.734461 -0.425845) (xy 1.768899 -0.407721) (xy 1.778712 -0.400647) (xy 1.763605 -0.401828) (xy 1.725010 -0.411766) (xy 1.673011 -0.427456) (xy 1.617693 -0.445894) (xy 1.579274 -0.460040)
     (xy 1.499633 -0.499938) (xy 1.430282 -0.550805) (xy 1.380879 -0.604873) (xy 1.366465 -0.631204) (xy 1.342926 -0.690219) (xy 1.120588 -0.511338) (xy 0.988839 -0.406976) (xy 0.839334 -0.291310)
     (xy 0.679642 -0.169999) (xy 0.517331 -0.048699) (xy 0.359970 0.066932) (xy 0.215129 0.171237) (xy 0.092378 0.257185) (xy 0.019851 0.307650) (xy -0.040175 0.350719) (xy -0.082564 0.382605)
     (xy -0.102180 0.399521) (xy -0.102844 0.401124) (xy -0.083284 0.402884) (xy -0.033303 0.403003) (xy 0.041993 0.401683) (xy 0.137498 0.399126) (xy 0.248108 0.395536) (xy 0.368716 0.391113)
     (xy 0.494218 0.386060) (xy 0.619506 0.380580) (xy 0.739476 0.374874) (xy 0.849022 0.369145) (xy 0.943039 0.363594) (xy 1.016421 0.358425) (xy 1.049440 0.355488) (xy 1.158364 0.343014)
     (xy 1.278456 0.326935) (xy 1.401536 0.308572) (xy 1.519426 0.289247) (xy 1.623946 0.270280) (xy 1.706919 0.252993) (xy 1.747258 0.242756) (xy 1.823046 0.220814) (xy 1.747229 0.190477)
     (xy 1.684023 0.170726) (xy 1.596836 0.150700) (xy 1.497193 0.132371) (xy 1.396615 0.117712) (xy 1.306626 0.108696) (xy 1.258439 0.106795) (xy 1.206319 0.109046) (xy 1.181025 0.118131)
     (xy 1.173982 0.137374) (xy 1.173950 0.139540) (xy 1.157979 0.183067) (xy 1.117238 0.216378) (xy 1.062488 0.231048) (xy 1.056933 0.231166) (xy 0.995861 0.220084) (xy 0.940807 0.191677)
     (xy 0.901984 0.152971) (xy 0.889356 0.115878) (xy 0.888744 0.109623) (xy 0.961812 0.109623) (xy 0.977977 0.139761) (xy 1.000526 0.156162) (xy 1.042999 0.173597) (xy 1.065825 0.171356)
     (xy 1.079569 0.148619) (xy 1.075562 0.116540) (xy 1.047125 0.087843) (xy 1.004879 0.071996) (xy 0.992679 0.071149) (xy 0.966344 0.082762) (xy 0.961812 0.109623) (xy 0.888744 0.109623)
     (xy 0.886851 0.090264) (xy 0.873529 0.076927) (xy 0.840683 0.071885) (xy 0.791527 0.071149) (xy 0.731122 0.067378) (xy 0.699745 0.057752) (xy 0.699254 0.044799) (xy 0.731509 0.031048)
     (xy 0.757726 0.025175) (xy 0.806453 0.020484) (xy 0.883751 0.018301) (xy 0.982724 0.018370) (xy 1.096479 0.020434) (xy 1.218117 0.024237) (xy 1.340746 0.029523) (xy 1.457468 0.036035)
     (xy 1.561389 0.043518) (xy 1.645613 0.051715) (xy 1.702921 0.060302) (xy 1.823063 0.091364) (xy 1.909967 0.127206) (xy 1.963232 0.167056) (xy 1.982457 0.210146) (xy 1.967239 0.255703)
     (xy 1.917180 0.302958) (xy 1.849860 0.342428) (xy 1.782621 0.372186) (xy 1.708540 0.396474) (xy 1.622590 0.416113) (xy 1.519739 0.431921) (xy 1.394959 0.444718) (xy 1.243220 0.455324)
     (xy 1.116142 0.461984) (xy 0.968598 0.468946) (xy 0.800063 0.476890) (xy 0.625081 0.485131) (xy 0.458198 0.492985) (xy 0.336452 0.498708) (xy 0.153618 0.508615) (xy -0.000130 0.520188)
     (xy -0.131273 0.534334) (xy -0.246289 0.551957) (xy -0.351660 0.573961) (xy -0.453865 0.601253) (xy -0.501079 0.615666) (xy -0.569443 0.639006) (xy -0.664381 0.673900) (xy -0.779765 0.717907)
     (xy -0.909463 0.768584) (xy -1.047348 0.823489) (xy -1.187288 0.880179) (xy -1.323154 0.936212) (xy -1.448816 0.989146) (xy -1.558145 1.036538) (xy -1.565056 1.039598) (xy -1.653843 1.078599)
     (xy -1.713973 1.104006) (xy -1.749063 1.117187) (xy -1.762730 1.119509) (xy -1.759290 1.113026) (xy -1.741940 1.103759) (xy -1.696443 1.081144) (xy -1.626776 1.047113) (xy -1.536918 1.003596)
     (xy -1.430848 0.952525) (xy -1.312544 0.895829) (xy -1.262733 0.872030) (xy -1.077346 0.783472) (xy -0.920719 0.708436) (xy -0.789484 0.645174) (xy -0.680270 0.591941) (xy -0.589707 0.546991)
     (xy -0.514425 0.508577) (xy -0.451053 0.474955) (xy -0.396221 0.444377) (xy -0.346560 0.415098) (xy -0.298699 0.385372) (xy -0.249267 0.353452) (xy -0.203245 0.323124) (xy -0.119435 0.265935)
     (xy -0.012626 0.190405) (xy 0.112247 0.100219) (xy 0.250251 -0.000934) (xy 0.396451 -0.109368) (xy 0.545913 -0.221396) (xy 0.693704 -0.333331) (xy 0.834888 -0.441485) (xy 0.964532 -0.542172)
     (xy 1.077701 -0.631705) (xy 1.118085 -0.664245) (xy 1.214719 -0.744583) (xy 1.321231 -0.836312) (xy 1.425525 -0.928838) (xy 1.515505 -1.011567) (xy 1.526100 -1.021601) (xy 1.590677 -1.082280)
     (xy 1.643618 -1.130560) (xy 1.680929 -1.162920) (xy 1.698620 -1.175839) )(layer F.SilkS) (width  0.000000)
  )
)
