EESchema Schematic File Version 4
EELAYER 30 0
EELAYER END
$Descr A4 11693 8268
encoding utf-8
Sheet 1 1
Title "JST-GH CAN Transceiver Breakout Board"
Date ""
Rev "v0.1"
Comp "AmadorUAVs"
Comment1 ""
Comment2 "NXP TJA-1051/TK-3,118 CAN Transceiver (Supports CAN and CAN-FD)"
Comment3 "JST-GH 4 Pin CAN Terminal"
Comment4 "Designed by Kalyan Sriram"
$EndDescr
$Comp
L Interface_CAN_LIN:TJA1051TK-3 U1
U 1 1 6047BE32
P 2950 2250
F 0 "U1" H 2700 2600 50  0000 C CNN
F 1 "TJA1051TK-3" H 3250 2600 50  0000 C CNN
F 2 "Package_DFN_QFN:DFN-8-1EP_3x3mm_P0.65mm_EP1.55x2.4mm" H 2950 1750 50  0001 C CIN
F 3 "http://www.nxp.com/documents/data_sheet/TJA1051.pdf" H 2950 2250 50  0001 C CNN
	1    2950 2250
	1    0    0    -1  
$EndComp
Text Label 4000 2150 0    50   ~ 0
CAN_H
Text Label 4000 2350 0    50   ~ 0
CAN_L
$Comp
L power:+5V #PWR05
U 1 1 6047D5A1
P 2950 1550
F 0 "#PWR05" H 2950 1400 50  0001 C CNN
F 1 "+5V" H 2965 1723 50  0000 C CNN
F 2 "" H 2950 1550 50  0001 C CNN
F 3 "" H 2950 1550 50  0001 C CNN
	1    2950 1550
	1    0    0    -1  
$EndComp
Wire Wire Line
	2950 1650 2950 1750
Wire Wire Line
	4000 2150 3900 2150
Wire Wire Line
	3900 2350 4000 2350
$Comp
L Device:C C2
U 1 1 6047E386
P 3200 1750
F 0 "C2" V 2948 1750 50  0000 C CNN
F 1 "47nF" V 3039 1750 50  0000 C CNN
F 2 "Capacitor_SMD:C_0603_1608Metric" H 3238 1600 50  0001 C CNN
F 3 "~" H 3200 1750 50  0001 C CNN
	1    3200 1750
	0    1    1    0   
$EndComp
Wire Wire Line
	3050 1750 2950 1750
Connection ~ 2950 1750
Wire Wire Line
	2950 1750 2950 1850
$Comp
L power:GND #PWR07
U 1 1 6047EE87
P 3450 1750
F 0 "#PWR07" H 3450 1500 50  0001 C CNN
F 1 "GND" V 3455 1622 50  0000 R CNN
F 2 "" H 3450 1750 50  0001 C CNN
F 3 "" H 3450 1750 50  0001 C CNN
	1    3450 1750
	0    -1   -1   0   
$EndComp
Wire Wire Line
	3450 1750 3350 1750
Text Label 2350 2050 2    50   ~ 0
CAN_TX
Text Label 2350 2150 2    50   ~ 0
CAN_RX
$Comp
L power:GND #PWR06
U 1 1 6047F6FC
P 3150 2750
F 0 "#PWR06" H 3150 2500 50  0001 C CNN
F 1 "GND" V 3155 2622 50  0000 R CNN
F 2 "" H 3150 2750 50  0001 C CNN
F 3 "" H 3150 2750 50  0001 C CNN
	1    3150 2750
	0    -1   -1   0   
$EndComp
Wire Wire Line
	3150 2750 3050 2750
Wire Wire Line
	3050 2750 3050 2650
Wire Wire Line
	3050 2750 2950 2750
Wire Wire Line
	2950 2750 2950 2650
Connection ~ 3050 2750
$Comp
L Device:R R1
U 1 1 6047D82C
P 2350 2700
F 0 "R1" H 2420 2746 50  0000 L CNN
F 1 "100K" H 2420 2655 50  0000 L CNN
F 2 "Resistor_SMD:R_0603_1608Metric" V 2280 2700 50  0001 C CNN
F 3 "~" H 2350 2700 50  0001 C CNN
	1    2350 2700
	1    0    0    -1  
$EndComp
Wire Wire Line
	2350 2550 2350 2450
Wire Wire Line
	2350 2450 2450 2450
Wire Wire Line
	2350 2950 2350 2850
Wire Wire Line
	1550 2350 1650 2350
Connection ~ 1650 2350
Text Label 2250 2450 2    50   ~ 0
CAN_SILENT
Wire Wire Line
	2250 2450 2350 2450
Connection ~ 2350 2450
Wire Wire Line
	1650 2350 2450 2350
Wire Wire Line
	2350 2050 2450 2050
Wire Wire Line
	2450 2150 2350 2150
$Comp
L Connector_Generic:Conn_01x04 J3
U 1 1 60489D33
P 3900 5500
F 0 "J3" H 3980 5492 50  0000 L CNN
F 1 "Conn_01x04" H 3980 5401 50  0000 L CNN
F 2 "Connector_JST:JST_GH_SM04B-GHS-TB_1x04-1MP_P1.25mm_Horizontal" H 3900 5500 50  0001 C CNN
F 3 "~" H 3900 5500 50  0001 C CNN
	1    3900 5500
	1    0    0    -1  
$EndComp
$Comp
L Device:C C7
U 1 1 604A55CB
P 3500 5200
F 0 "C7" V 3248 5200 50  0000 C CNN
F 1 "2.2uF" V 3339 5200 50  0000 C CNN
F 2 "Capacitor_SMD:C_0603_1608Metric" H 3538 5050 50  0001 C CNN
F 3 "~" H 3500 5200 50  0001 C CNN
	1    3500 5200
	0    -1   1    0   
$EndComp
$Comp
L power:GND #PWR015
U 1 1 604A5DDF
P 3750 5200
F 0 "#PWR015" H 3750 4950 50  0001 C CNN
F 1 "GND" V 3755 5072 50  0000 R CNN
F 2 "" H 3750 5200 50  0001 C CNN
F 3 "" H 3750 5200 50  0001 C CNN
	1    3750 5200
	0    -1   1    0   
$EndComp
Wire Wire Line
	3650 5200 3750 5200
Connection ~ 2700 4750
Connection ~ 2800 4650
Wire Wire Line
	2800 4650 2000 4650
$Comp
L dk_TVS-Diodes:PESD1CAN-UX D1
U 1 1 604B93CC
P 2000 6300
F 0 "D1" V 1854 6528 60  0000 L CNN
F 1 "PESD1CAN-UX" V 1960 6528 60  0000 L CNN
F 2 "digikey-footprints:SOT-323" H 2200 6500 60  0001 L CNN
F 3 "https://assets.nexperia.com/documents/data-sheet/PESD1CAN-U.pdf" H 2200 6600 60  0001 L CNN
F 4 "1727-1306-1-ND" H 2200 6700 60  0001 L CNN "Digi-Key_PN"
F 5 "PESD1CAN-UX" H 2200 6800 60  0001 L CNN "MPN"
F 6 "Circuit Protection" H 2200 6900 60  0001 L CNN "Category"
F 7 "TVS - Diodes" H 2200 7000 60  0001 L CNN "Family"
F 8 "https://assets.nexperia.com/documents/data-sheet/PESD1CAN-U.pdf" H 2200 7100 60  0001 L CNN "DK_Datasheet_Link"
F 9 "/product-detail/en/nexperia-usa-inc/PESD1CAN-UX/1727-1306-1-ND/4386316" H 2200 7200 60  0001 L CNN "DK_Detail_Page"
F 10 "TVS DIODE 24V 50V SOT323-3" H 2200 7300 60  0001 L CNN "Description"
F 11 "Nexperia USA Inc." H 2200 7400 60  0001 L CNN "Manufacturer"
F 12 "Active" H 2200 7500 60  0001 L CNN "Status"
	1    2000 6300
	0    1    1    0   
$EndComp
Wire Wire Line
	2950 5800 2950 5700
Wire Wire Line
	2600 5700 2950 5700
Wire Wire Line
	2600 4850 2600 5700
Wire Wire Line
	2700 4750 2700 5600
Wire Wire Line
	2800 4650 2800 5500
Connection ~ 3050 4550
Wire Wire Line
	2900 4550 2900 5400
Wire Wire Line
	3050 4550 2900 4550
Connection ~ 3050 5200
Wire Wire Line
	3050 5200 3350 5200
Wire Wire Line
	3050 5100 3050 5200
Wire Wire Line
	2550 4450 2650 4450
$Comp
L power:GND #PWR013
U 1 1 604A3085
P 2550 4450
F 0 "#PWR013" H 2550 4200 50  0001 C CNN
F 1 "GND" V 2555 4322 50  0000 R CNN
F 2 "" H 2550 4450 50  0001 C CNN
F 3 "" H 2550 4450 50  0001 C CNN
	1    2550 4450
	0    1    1    0   
$EndComp
Wire Wire Line
	3050 4450 3050 4350
Connection ~ 3050 4450
Wire Wire Line
	3050 4450 2950 4450
Wire Wire Line
	3050 4550 3050 4450
$Comp
L Device:C C6
U 1 1 604A17F4
P 2800 4450
F 0 "C6" V 2548 4450 50  0000 C CNN
F 1 "2.2uF" V 2639 4450 50  0000 C CNN
F 2 "Capacitor_SMD:C_0603_1608Metric" H 2838 4300 50  0001 C CNN
F 3 "~" H 2800 4450 50  0001 C CNN
	1    2800 4450
	0    1    1    0   
$EndComp
$Comp
L power:GND #PWR014
U 1 1 6049F10F
P 2950 5800
F 0 "#PWR014" H 2950 5550 50  0001 C CNN
F 1 "GND" H 2955 5627 50  0000 C CNN
F 2 "" H 2950 5800 50  0001 C CNN
F 3 "" H 2950 5800 50  0001 C CNN
	1    2950 5800
	1    0    0    -1  
$EndComp
$Comp
L power:GND #PWR011
U 1 1 604C006F
P 2000 6750
F 0 "#PWR011" H 2000 6500 50  0001 C CNN
F 1 "GND" H 2005 6577 50  0000 C CNN
F 2 "" H 2000 6750 50  0001 C CNN
F 3 "" H 2000 6750 50  0001 C CNN
	1    2000 6750
	1    0    0    -1  
$EndComp
Text Label 1800 4650 2    50   ~ 0
CAN_H
Wire Wire Line
	1800 4650 1900 4650
Connection ~ 1900 4650
Text Label 1800 4750 2    50   ~ 0
CAN_L
Wire Wire Line
	1800 4750 2100 4750
Connection ~ 2100 4750
$Comp
L power:+5V #PWR02
U 1 1 604F3C88
P 6500 4750
F 0 "#PWR02" H 6500 4600 50  0001 C CNN
F 1 "+5V" V 6515 4878 50  0000 L CNN
F 2 "" H 6500 4750 50  0001 C CNN
F 3 "" H 6500 4750 50  0001 C CNN
	1    6500 4750
	0    -1   -1   0   
$EndComp
$Comp
L power:GND #PWR03
U 1 1 604F44B8
P 6500 4850
F 0 "#PWR03" H 6500 4600 50  0001 C CNN
F 1 "GND" V 6505 4722 50  0000 R CNN
F 2 "" H 6500 4850 50  0001 C CNN
F 3 "" H 6500 4850 50  0001 C CNN
	1    6500 4850
	0    1    1    0   
$EndComp
Text Label 7000 4950 2    50   ~ 0
CAN_TX
Text Label 7000 5050 2    50   ~ 0
CAN_RX
Wire Wire Line
	7000 4950 7100 4950
Wire Wire Line
	7100 5050 7000 5050
Wire Wire Line
	7000 5150 7100 5150
$Comp
L Connector_Generic:Conn_01x04 J2
U 1 1 6050B5E2
P 3900 4650
F 0 "J2" H 3980 4642 50  0000 L CNN
F 1 "Conn_01x04" H 3980 4551 50  0000 L CNN
F 2 "Connector_JST:JST_GH_SM04B-GHS-TB_1x04-1MP_P1.25mm_Horizontal" H 3900 4650 50  0001 C CNN
F 3 "~" H 3900 4650 50  0001 C CNN
	1    3900 4650
	1    0    0    -1  
$EndComp
Wire Wire Line
	1900 4650 1900 5800
Wire Wire Line
	2100 4750 2100 5800
Wire Wire Line
	2900 5400 3050 5400
Wire Wire Line
	3050 5200 3050 5400
Connection ~ 3050 5400
Connection ~ 2950 5700
Wire Wire Line
	2000 6750 2000 6650
Wire Wire Line
	3050 4550 3500 4550
Wire Wire Line
	2800 4650 3700 4650
Wire Wire Line
	2700 4750 3700 4750
Wire Wire Line
	2600 4850 3700 4850
Wire Wire Line
	2700 5600 3700 5600
Wire Wire Line
	2950 5700 3500 5700
Wire Wire Line
	2800 5500 3700 5500
Wire Wire Line
	3050 5400 3700 5400
Text Label 7000 5150 2    50   ~ 0
CAN_SILENT
$Comp
L Connector_Generic:Conn_01x06 J1
U 1 1 604F2E73
P 7300 4950
F 0 "J1" H 7380 4992 50  0000 L CNN
F 1 "Conn_01x06" H 7380 4901 50  0000 L CNN
F 2 "Connector_PinHeader_2.54mm:PinHeader_1x06_P2.54mm_Vertical" H 7300 4950 50  0001 C CNN
F 3 "~" H 7300 4950 50  0001 C CNN
	1    7300 4950
	1    0    0    -1  
$EndComp
$Comp
L Jumper:SolderJumper_2_Bridged JP1
U 1 1 604DC2F9
P 6450 2450
F 0 "JP1" H 6450 2225 50  0000 C CNN
F 1 "CAN_TERM" H 6450 2550 50  0000 C CNN
F 2 "Jumper:SolderJumper-2_P1.3mm_Open_Pad1.0x1.5mm" H 6450 2450 50  0001 C CNN
F 3 "~" H 6450 2450 50  0001 C CNN
	1    6450 2450
	-1   0    0    1   
$EndComp
$Comp
L Device:C C1
U 1 1 604E6CD3
P 2200 1650
F 0 "C1" V 1948 1650 50  0000 C CNN
F 1 "100nF" V 2039 1650 50  0000 C CNN
F 2 "Capacitor_SMD:C_0603_1608Metric" H 2238 1500 50  0001 C CNN
F 3 "~" H 2200 1650 50  0001 C CNN
	1    2200 1650
	0    1    1    0   
$EndComp
Wire Wire Line
	1650 2350 1650 1650
Wire Wire Line
	1650 1650 2050 1650
Wire Wire Line
	2350 1650 2950 1650
Wire Wire Line
	2950 1550 2950 1650
Connection ~ 2950 1650
$Comp
L power:+3V3 #PWR01
U 1 1 604EE53B
P 2350 2950
F 0 "#PWR01" H 2350 2800 50  0001 C CNN
F 1 "+3V3" H 2365 3123 50  0000 C CNN
F 2 "" H 2350 2950 50  0001 C CNN
F 3 "" H 2350 2950 50  0001 C CNN
	1    2350 2950
	-1   0    0    1   
$EndComp
$Comp
L Device:C C3
U 1 1 604F8EA6
P 3900 1900
F 0 "C3" H 4015 1946 50  0000 L CNN
F 1 "100pF" H 4015 1855 50  0000 L CNN
F 2 "Capacitor_SMD:C_0603_1608Metric" H 3938 1750 50  0001 C CNN
F 3 "~" H 3900 1900 50  0001 C CNN
	1    3900 1900
	1    0    0    -1  
$EndComp
Wire Wire Line
	3450 2150 3900 2150
Wire Wire Line
	3900 2150 3900 2050
$Comp
L Device:C C4
U 1 1 604FB85C
P 3900 2600
F 0 "C4" H 4015 2646 50  0000 L CNN
F 1 "100pF" H 4015 2555 50  0000 L CNN
F 2 "Capacitor_SMD:C_0603_1608Metric" H 3938 2450 50  0001 C CNN
F 3 "~" H 3900 2600 50  0001 C CNN
	1    3900 2600
	1    0    0    -1  
$EndComp
Wire Wire Line
	3900 2450 3900 2350
Wire Wire Line
	3900 2350 3450 2350
$Comp
L power:GND #PWR08
U 1 1 604FEF3D
P 3900 1650
F 0 "#PWR08" H 3900 1400 50  0001 C CNN
F 1 "GND" H 3905 1477 50  0000 C CNN
F 2 "" H 3900 1650 50  0001 C CNN
F 3 "" H 3900 1650 50  0001 C CNN
	1    3900 1650
	-1   0    0    1   
$EndComp
Wire Wire Line
	3900 1650 3900 1750
$Comp
L power:GND #PWR09
U 1 1 605013E1
P 3900 2850
F 0 "#PWR09" H 3900 2600 50  0001 C CNN
F 1 "GND" H 3905 2677 50  0000 C CNN
F 2 "" H 3900 2850 50  0001 C CNN
F 3 "" H 3900 2850 50  0001 C CNN
	1    3900 2850
	1    0    0    -1  
$EndComp
Wire Wire Line
	3900 2850 3900 2750
Connection ~ 3900 2150
Connection ~ 3900 2350
Text Label 6200 2450 2    50   ~ 0
CAN_H
Wire Wire Line
	6200 2450 6300 2450
$Comp
L Device:R R2
U 1 1 60518220
P 6850 2450
F 0 "R2" V 6643 2450 50  0000 C CNN
F 1 "60" V 6734 2450 50  0000 C CNN
F 2 "Resistor_SMD:R_0603_1608Metric" V 6780 2450 50  0001 C CNN
F 3 "~" H 6850 2450 50  0001 C CNN
	1    6850 2450
	0    1    1    0   
$EndComp
Wire Wire Line
	6700 2450 6600 2450
$Comp
L Device:R R3
U 1 1 6051C632
P 7350 2450
F 0 "R3" V 7143 2450 50  0000 C CNN
F 1 "60" V 7234 2450 50  0000 C CNN
F 2 "Resistor_SMD:R_0603_1608Metric" V 7280 2450 50  0001 C CNN
F 3 "~" H 7350 2450 50  0001 C CNN
	1    7350 2450
	0    1    1    0   
$EndComp
$Comp
L Device:C C5
U 1 1 6051CEC1
P 7100 2100
F 0 "C5" H 7215 2146 50  0000 L CNN
F 1 "4.7nF" H 7215 2055 50  0000 L CNN
F 2 "Capacitor_SMD:C_0603_1608Metric" H 7138 1950 50  0001 C CNN
F 3 "~" H 7100 2100 50  0001 C CNN
	1    7100 2100
	1    0    0    -1  
$EndComp
Wire Wire Line
	7100 2250 7100 2450
Wire Wire Line
	7100 2450 7200 2450
Wire Wire Line
	7000 2450 7100 2450
Connection ~ 7100 2450
$Comp
L power:GND #PWR010
U 1 1 60521B17
P 7100 1850
F 0 "#PWR010" H 7100 1600 50  0001 C CNN
F 1 "GND" H 7105 1677 50  0000 C CNN
F 2 "" H 7100 1850 50  0001 C CNN
F 3 "" H 7100 1850 50  0001 C CNN
	1    7100 1850
	-1   0    0    1   
$EndComp
Wire Wire Line
	7100 1850 7100 1950
Text Label 7600 2450 0    50   ~ 0
CAN_L
Wire Wire Line
	7600 2450 7500 2450
$Comp
L power:+3V3 #PWR04
U 1 1 6053C53D
P 6500 5250
F 0 "#PWR04" H 6500 5100 50  0001 C CNN
F 1 "+3V3" V 6515 5378 50  0000 L CNN
F 2 "" H 6500 5250 50  0001 C CNN
F 3 "" H 6500 5250 50  0001 C CNN
	1    6500 5250
	0    -1   -1   0   
$EndComp
Wire Wire Line
	6500 5250 6600 5250
Wire Wire Line
	6500 4750 7000 4750
Wire Wire Line
	6500 4850 6600 4850
$Comp
L Jumper:SolderJumper_2_Bridged JP2
U 1 1 60546107
P 9700 1850
F 0 "JP2" H 9700 2055 50  0000 C CNN
F 1 "SolderJumper_2_Bridged" H 9700 1964 50  0000 C CNN
F 2 "Jumper:SolderJumper-2_P1.3mm_Open_Pad1.0x1.5mm" H 9700 1850 50  0001 C CNN
F 3 "~" H 9700 1850 50  0001 C CNN
	1    9700 1850
	1    0    0    -1  
$EndComp
$Comp
L power:+5V #PWR012
U 1 1 605474F8
P 9450 1850
F 0 "#PWR012" H 9450 1700 50  0001 C CNN
F 1 "+5V" V 9465 1978 50  0000 L CNN
F 2 "" H 9450 1850 50  0001 C CNN
F 3 "" H 9450 1850 50  0001 C CNN
	1    9450 1850
	0    -1   -1   0   
$EndComp
Wire Wire Line
	9450 1850 9550 1850
Text Label 9950 1850 0    50   ~ 0
5V_CAN
Wire Wire Line
	9950 1850 9850 1850
Text Label 3050 4350 0    50   ~ 0
5V_CAN
Text Label 3050 5100 0    50   ~ 0
5V_CAN
$Comp
L power:PWR_FLAG #FLG0101
U 1 1 605506E1
P 7000 4650
F 0 "#FLG0101" H 7000 4725 50  0001 C CNN
F 1 "PWR_FLAG" H 7000 4823 50  0000 C CNN
F 2 "" H 7000 4650 50  0001 C CNN
F 3 "~" H 7000 4650 50  0001 C CNN
	1    7000 4650
	1    0    0    -1  
$EndComp
$Comp
L power:PWR_FLAG #FLG0102
U 1 1 60550A8B
P 6600 4650
F 0 "#FLG0102" H 6600 4725 50  0001 C CNN
F 1 "PWR_FLAG" H 6600 4823 50  0000 C CNN
F 2 "" H 6600 4650 50  0001 C CNN
F 3 "~" H 6600 4650 50  0001 C CNN
	1    6600 4650
	1    0    0    -1  
$EndComp
Wire Wire Line
	6600 4650 6600 4850
Connection ~ 6600 4850
Wire Wire Line
	6600 4850 7100 4850
Wire Wire Line
	7000 4650 7000 4750
Connection ~ 7000 4750
Wire Wire Line
	7000 4750 7100 4750
$Comp
L power:PWR_FLAG #FLG0103
U 1 1 60556E2C
P 6600 5350
F 0 "#FLG0103" H 6600 5425 50  0001 C CNN
F 1 "PWR_FLAG" H 6600 5523 50  0000 C CNN
F 2 "" H 6600 5350 50  0001 C CNN
F 3 "~" H 6600 5350 50  0001 C CNN
	1    6600 5350
	-1   0    0    1   
$EndComp
Wire Wire Line
	6600 5350 6600 5250
Connection ~ 6600 5250
Wire Wire Line
	6600 5250 7100 5250
$Comp
L power:+3V3 #PWR0101
U 1 1 6055ADC7
P 1550 2350
F 0 "#PWR0101" H 1550 2200 50  0001 C CNN
F 1 "+3V3" V 1565 2478 50  0000 L CNN
F 2 "" H 1550 2350 50  0001 C CNN
F 3 "" H 1550 2350 50  0001 C CNN
	1    1550 2350
	0    -1   -1   0   
$EndComp
Wire Notes Line
	900  1050 4850 1050
Wire Notes Line
	4850 1050 4850 3500
Wire Notes Line
	4850 3500 900  3500
Wire Notes Line
	900  3500 900  1050
Text Notes 900  1000 0    50   ~ 0
TJA1051-TK/3,118 Transceiver
Wire Notes Line
	4850 3850 4850 7250
Wire Notes Line
	4850 7250 900  7250
Wire Notes Line
	900  7250 900  3850
Wire Notes Line
	900  3850 4850 3850
Text Notes 900  3800 0    50   ~ 0
JST-GH CAN Terminal
Wire Notes Line
	5450 1050 8350 1050
Wire Notes Line
	8350 1050 8350 3500
Wire Notes Line
	8350 3500 5450 3500
Wire Notes Line
	5450 3500 5450 1050
Text Notes 5450 1000 0    50   ~ 0
Terminator
Wire Notes Line
	10750 1050 10750 3500
Wire Notes Line
	10750 3500 8750 3500
Wire Notes Line
	8750 3500 8750 1050
Wire Notes Line
	8750 1050 10750 1050
Text Notes 8750 1000 0    50   ~ 0
5V CAN Power Enable
Wire Notes Line
	5450 3850 8350 3850
Wire Notes Line
	8350 3850 8350 6000
Wire Notes Line
	8350 6000 5450 6000
Wire Notes Line
	5450 6000 5450 3850
Text Notes 5450 3800 0    50   ~ 0
Pin Breakout
$Comp
L Connector:TestPoint TP1
U 1 1 60792F6B
P 2000 4650
F 0 "TP1" H 2058 4722 50  0000 L CNN
F 1 "TestPoint" H 2058 4677 50  0001 L CNN
F 2 "TestPoint:TestPoint_Pad_D1.5mm" H 2200 4650 50  0001 C CNN
F 3 "~" H 2200 4650 50  0001 C CNN
	1    2000 4650
	1    0    0    -1  
$EndComp
Connection ~ 2000 4650
Wire Wire Line
	2000 4650 1900 4650
$Comp
L Connector:TestPoint TP2
U 1 1 607938AC
P 2200 4750
F 0 "TP2" H 2142 4822 50  0000 R CNN
F 1 "TestPoint" H 2258 4777 50  0001 L CNN
F 2 "TestPoint:TestPoint_Pad_D1.5mm" H 2400 4750 50  0001 C CNN
F 3 "~" H 2400 4750 50  0001 C CNN
	1    2200 4750
	-1   0    0    1   
$EndComp
Connection ~ 2200 4750
Wire Wire Line
	2200 4750 2100 4750
Wire Wire Line
	2200 4750 2700 4750
$Comp
L Connector:TestPoint TP3
U 1 1 60794E0F
P 3500 4550
F 0 "TP3" H 3558 4622 50  0000 L CNN
F 1 "TestPoint" H 3558 4577 50  0001 L CNN
F 2 "TestPoint:TestPoint_Pad_D1.5mm" H 3700 4550 50  0001 C CNN
F 3 "~" H 3700 4550 50  0001 C CNN
	1    3500 4550
	1    0    0    -1  
$EndComp
Connection ~ 3500 4550
Wire Wire Line
	3500 4550 3700 4550
$Comp
L Connector:TestPoint TP4
U 1 1 607953E5
P 3500 5700
F 0 "TP4" H 3442 5772 50  0000 R CNN
F 1 "TestPoint" H 3558 5727 50  0001 L CNN
F 2 "TestPoint:TestPoint_Pad_D1.5mm" H 3700 5700 50  0001 C CNN
F 3 "~" H 3700 5700 50  0001 C CNN
	1    3500 5700
	-1   0    0    1   
$EndComp
Connection ~ 3500 5700
Wire Wire Line
	3500 5700 3700 5700
$Comp
L power:GND #PWR016
U 1 1 607B2738
P 9450 2700
F 0 "#PWR016" H 9450 2450 50  0001 C CNN
F 1 "GND" V 9455 2572 50  0000 R CNN
F 2 "" H 9450 2700 50  0001 C CNN
F 3 "" H 9450 2700 50  0001 C CNN
	1    9450 2700
	0    1    1    0   
$EndComp
Wire Wire Line
	9450 2700 9550 2700
Wire Wire Line
	9950 2700 9850 2700
$Comp
L Device:D_Schottky D2
U 1 1 607B1AAB
P 9700 2700
F 0 "D2" H 9700 2483 50  0000 C CNN
F 1 "D_Schottky" H 9700 2574 50  0000 C CNN
F 2 "SOD2513X120N:SOD2513X120N" H 9700 2700 50  0001 C CNN
F 3 "~" H 9700 2700 50  0001 C CNN
	1    9700 2700
	-1   0    0    1   
$EndComp
$Comp
L power:+5V #PWR?
U 1 1 607CBF44
P 9950 2700
F 0 "#PWR?" H 9950 2550 50  0001 C CNN
F 1 "+5V" V 9965 2828 50  0000 L CNN
F 2 "" H 9950 2700 50  0001 C CNN
F 3 "" H 9950 2700 50  0001 C CNN
	1    9950 2700
	0    1    1    0   
$EndComp
$EndSCHEMATC
