(kicad_symbol_lib (version 20201005) (generator kicad_symbol_editor)
  (symbol "ICM_20689:ICM20689" (in_bom yes) (on_board yes)
    (property "Reference" "U" (id 0) (at -7.62 8.89 0)
      (effects (font (size 1.27 1.27)))
    )
    (property "Value" "ICM20689" (id 1) (at 7.62 8.89 0)
      (effects (font (size 1.27 1.27)))
    )
    (property "Footprint" "" (id 2) (at -21.59 31.75 0)
      (effects (font (size 1.27 1.27)) hide)
    )
    (property "Datasheet" "" (id 3) (at -21.59 31.75 0)
      (effects (font (size 1.27 1.27)) hide)
    )
    (symbol "ICM20689_0_1"
      (rectangle (start -12.7 7.62) (end 12.7 -7.62)
        (stroke (width 0.1524)) (fill (type background))
      )
    )
    (symbol "ICM20689_1_1"
      (pin passive line (at 15.24 -1.27 180) (length 2.54)
        (name "REGOUT" (effects (font (size 1.27 1.27))))
        (number "10" (effects (font (size 1.27 1.27))))
      )
      (pin input line (at 15.24 1.27 180) (length 2.54)
        (name "FSYNC" (effects (font (size 1.27 1.27))))
        (number "11" (effects (font (size 1.27 1.27))))
      )
      (pin output line (at -15.24 -5.08 0) (length 2.54)
        (name "INT" (effects (font (size 1.27 1.27))))
        (number "12" (effects (font (size 1.27 1.27))))
      )
      (pin power_in line (at -1.27 10.16 270) (length 2.54)
        (name "VDD" (effects (font (size 1.27 1.27))))
        (number "13" (effects (font (size 1.27 1.27))))
      )
      (pin power_in line (at 0 -10.16 90) (length 2.54)
        (name "GND" (effects (font (size 1.27 1.27))))
        (number "18" (effects (font (size 1.27 1.27))))
      )
      (pin input line (at -15.24 -2.54 0) (length 2.54)
        (name "nCS" (effects (font (size 1.27 1.27))))
        (number "22" (effects (font (size 1.27 1.27))))
      )
      (pin input line (at -15.24 5.08 0) (length 2.54)
        (name "SCL/SCLK" (effects (font (size 1.27 1.27))))
        (number "23" (effects (font (size 1.27 1.27))))
      )
      (pin bidirectional line (at -15.24 2.54 0) (length 2.54)
        (name "SDA/SDI" (effects (font (size 1.27 1.27))))
        (number "24" (effects (font (size 1.27 1.27))))
      )
      (pin power_in line (at 1.27 10.16 270) (length 2.54)
        (name "VDDIO" (effects (font (size 1.27 1.27))))
        (number "8" (effects (font (size 1.27 1.27))))
      )
      (pin bidirectional line (at -15.24 0 0) (length 2.54)
        (name "AD0/SDO" (effects (font (size 1.27 1.27))))
        (number "9" (effects (font (size 1.27 1.27))))
      )
    )
  )
)
