(footprint "TS-1088R-02026" (version 20210606) (generator pcbnew) (layer "F.Cu")
  (tedit 60D292C8)
  (fp_text reference "REF**" (at -22.4 -16.6 unlocked) (layer "F.SilkS")
    (effects (font (size 1 1) (thickness 0.15)))
    (tstamp 816f48e7-0fb5-481a-8cec-79fd74654d55)
  )
  (fp_text value "TS-1088R-02026" (at -22.4 -15.1 unlocked) (layer "F.Fab")
    (effects (font (size 1 1) (thickness 0.15)))
    (tstamp 72aac8bb-1b7b-4bce-93fa-5b822780cd96)
  )
  (fp_text user "${REFERENCE}" (at -22.4 -13.6 unlocked) (layer "F.Fab")
    (effects (font (size 1 1) (thickness 0.15)))
    (tstamp 7816c836-f4d5-4d9e-a4ab-5de9631201a7)
  )
  (fp_rect (start -3 -1.6) (end 3 1.6) (layer "F.CrtYd") (width 0.12) (fill none) (tstamp 70b75504-07b5-43c1-ab81-7d199b620b38))
  (pad "1" smd rect (at -2.225 0) (size 1.05 2) (layers "F.Cu" "F.Paste" "F.Mask") (tstamp 544e517a-6e54-4987-a023-cf0a6ba7bcd7))
  (pad "2" smd rect (at 2.225 0) (size 1.05 2) (layers "F.Cu" "F.Paste" "F.Mask") (tstamp 07d169e7-60ba-4699-b9e4-86f8b6ce8a24))
)
