(kicad_sch (version 20211123) (generator eeschema)

  (uuid 146e3ec4-be57-4ef5-9e3b-05ddec1dff1f)

  (paper "A4")

  (lib_symbols
    (symbol "Connector_Generic:Conn_01x06" (pin_names (offset 1.016) hide) (in_bom yes) (on_board yes)
      (property "Reference" "J" (id 0) (at 0 7.62 0)
        (effects (font (size 1.27 1.27)))
      )
      (property "Value" "Conn_01x06" (id 1) (at 0 -10.16 0)
        (effects (font (size 1.27 1.27)))
      )
      (property "Footprint" "" (id 2) (at 0 0 0)
        (effects (font (size 1.27 1.27)) hide)
      )
      (property "Datasheet" "~" (id 3) (at 0 0 0)
        (effects (font (size 1.27 1.27)) hide)
      )
      (property "ki_keywords" "connector" (id 4) (at 0 0 0)
        (effects (font (size 1.27 1.27)) hide)
      )
      (property "ki_description" "Generic connector, single row, 01x06, script generated (kicad-library-utils/schlib/autogen/connector/)" (id 5) (at 0 0 0)
        (effects (font (size 1.27 1.27)) hide)
      )
      (property "ki_fp_filters" "Connector*:*_1x??_*" (id 6) (at 0 0 0)
        (effects (font (size 1.27 1.27)) hide)
      )
      (symbol "Conn_01x06_1_1"
        (rectangle (start -1.27 -7.493) (end 0 -7.747)
          (stroke (width 0.1524) (type default) (color 0 0 0 0))
          (fill (type none))
        )
        (rectangle (start -1.27 -4.953) (end 0 -5.207)
          (stroke (width 0.1524) (type default) (color 0 0 0 0))
          (fill (type none))
        )
        (rectangle (start -1.27 -2.413) (end 0 -2.667)
          (stroke (width 0.1524) (type default) (color 0 0 0 0))
          (fill (type none))
        )
        (rectangle (start -1.27 0.127) (end 0 -0.127)
          (stroke (width 0.1524) (type default) (color 0 0 0 0))
          (fill (type none))
        )
        (rectangle (start -1.27 2.667) (end 0 2.413)
          (stroke (width 0.1524) (type default) (color 0 0 0 0))
          (fill (type none))
        )
        (rectangle (start -1.27 5.207) (end 0 4.953)
          (stroke (width 0.1524) (type default) (color 0 0 0 0))
          (fill (type none))
        )
        (rectangle (start -1.27 6.35) (end 1.27 -8.89)
          (stroke (width 0.254) (type default) (color 0 0 0 0))
          (fill (type background))
        )
        (pin passive line (at -5.08 5.08 0) (length 3.81)
          (name "Pin_1" (effects (font (size 1.27 1.27))))
          (number "1" (effects (font (size 1.27 1.27))))
        )
        (pin passive line (at -5.08 2.54 0) (length 3.81)
          (name "Pin_2" (effects (font (size 1.27 1.27))))
          (number "2" (effects (font (size 1.27 1.27))))
        )
        (pin passive line (at -5.08 0 0) (length 3.81)
          (name "Pin_3" (effects (font (size 1.27 1.27))))
          (number "3" (effects (font (size 1.27 1.27))))
        )
        (pin passive line (at -5.08 -2.54 0) (length 3.81)
          (name "Pin_4" (effects (font (size 1.27 1.27))))
          (number "4" (effects (font (size 1.27 1.27))))
        )
        (pin passive line (at -5.08 -5.08 0) (length 3.81)
          (name "Pin_5" (effects (font (size 1.27 1.27))))
          (number "5" (effects (font (size 1.27 1.27))))
        )
        (pin passive line (at -5.08 -7.62 0) (length 3.81)
          (name "Pin_6" (effects (font (size 1.27 1.27))))
          (number "6" (effects (font (size 1.27 1.27))))
        )
      )
    )
    (symbol "Connector_Generic:Conn_02x10_Odd_Even" (pin_names (offset 1.016) hide) (in_bom yes) (on_board yes)
      (property "Reference" "J" (id 0) (at 1.27 12.7 0)
        (effects (font (size 1.27 1.27)))
      )
      (property "Value" "Conn_02x10_Odd_Even" (id 1) (at 1.27 -15.24 0)
        (effects (font (size 1.27 1.27)))
      )
      (property "Footprint" "" (id 2) (at 0 0 0)
        (effects (font (size 1.27 1.27)) hide)
      )
      (property "Datasheet" "~" (id 3) (at 0 0 0)
        (effects (font (size 1.27 1.27)) hide)
      )
      (property "ki_keywords" "connector" (id 4) (at 0 0 0)
        (effects (font (size 1.27 1.27)) hide)
      )
      (property "ki_description" "Generic connector, double row, 02x10, odd/even pin numbering scheme (row 1 odd numbers, row 2 even numbers), script generated (kicad-library-utils/schlib/autogen/connector/)" (id 5) (at 0 0 0)
        (effects (font (size 1.27 1.27)) hide)
      )
      (property "ki_fp_filters" "Connector*:*_2x??_*" (id 6) (at 0 0 0)
        (effects (font (size 1.27 1.27)) hide)
      )
      (symbol "Conn_02x10_Odd_Even_1_1"
        (rectangle (start -1.27 -12.573) (end 0 -12.827)
          (stroke (width 0.1524) (type default) (color 0 0 0 0))
          (fill (type none))
        )
        (rectangle (start -1.27 -10.033) (end 0 -10.287)
          (stroke (width 0.1524) (type default) (color 0 0 0 0))
          (fill (type none))
        )
        (rectangle (start -1.27 -7.493) (end 0 -7.747)
          (stroke (width 0.1524) (type default) (color 0 0 0 0))
          (fill (type none))
        )
        (rectangle (start -1.27 -4.953) (end 0 -5.207)
          (stroke (width 0.1524) (type default) (color 0 0 0 0))
          (fill (type none))
        )
        (rectangle (start -1.27 -2.413) (end 0 -2.667)
          (stroke (width 0.1524) (type default) (color 0 0 0 0))
          (fill (type none))
        )
        (rectangle (start -1.27 0.127) (end 0 -0.127)
          (stroke (width 0.1524) (type default) (color 0 0 0 0))
          (fill (type none))
        )
        (rectangle (start -1.27 2.667) (end 0 2.413)
          (stroke (width 0.1524) (type default) (color 0 0 0 0))
          (fill (type none))
        )
        (rectangle (start -1.27 5.207) (end 0 4.953)
          (stroke (width 0.1524) (type default) (color 0 0 0 0))
          (fill (type none))
        )
        (rectangle (start -1.27 7.747) (end 0 7.493)
          (stroke (width 0.1524) (type default) (color 0 0 0 0))
          (fill (type none))
        )
        (rectangle (start -1.27 10.287) (end 0 10.033)
          (stroke (width 0.1524) (type default) (color 0 0 0 0))
          (fill (type none))
        )
        (rectangle (start -1.27 11.43) (end 3.81 -13.97)
          (stroke (width 0.254) (type default) (color 0 0 0 0))
          (fill (type background))
        )
        (rectangle (start 3.81 -12.573) (end 2.54 -12.827)
          (stroke (width 0.1524) (type default) (color 0 0 0 0))
          (fill (type none))
        )
        (rectangle (start 3.81 -10.033) (end 2.54 -10.287)
          (stroke (width 0.1524) (type default) (color 0 0 0 0))
          (fill (type none))
        )
        (rectangle (start 3.81 -7.493) (end 2.54 -7.747)
          (stroke (width 0.1524) (type default) (color 0 0 0 0))
          (fill (type none))
        )
        (rectangle (start 3.81 -4.953) (end 2.54 -5.207)
          (stroke (width 0.1524) (type default) (color 0 0 0 0))
          (fill (type none))
        )
        (rectangle (start 3.81 -2.413) (end 2.54 -2.667)
          (stroke (width 0.1524) (type default) (color 0 0 0 0))
          (fill (type none))
        )
        (rectangle (start 3.81 0.127) (end 2.54 -0.127)
          (stroke (width 0.1524) (type default) (color 0 0 0 0))
          (fill (type none))
        )
        (rectangle (start 3.81 2.667) (end 2.54 2.413)
          (stroke (width 0.1524) (type default) (color 0 0 0 0))
          (fill (type none))
        )
        (rectangle (start 3.81 5.207) (end 2.54 4.953)
          (stroke (width 0.1524) (type default) (color 0 0 0 0))
          (fill (type none))
        )
        (rectangle (start 3.81 7.747) (end 2.54 7.493)
          (stroke (width 0.1524) (type default) (color 0 0 0 0))
          (fill (type none))
        )
        (rectangle (start 3.81 10.287) (end 2.54 10.033)
          (stroke (width 0.1524) (type default) (color 0 0 0 0))
          (fill (type none))
        )
        (pin passive line (at -5.08 10.16 0) (length 3.81)
          (name "Pin_1" (effects (font (size 1.27 1.27))))
          (number "1" (effects (font (size 1.27 1.27))))
        )
        (pin passive line (at 7.62 0 180) (length 3.81)
          (name "Pin_10" (effects (font (size 1.27 1.27))))
          (number "10" (effects (font (size 1.27 1.27))))
        )
        (pin passive line (at -5.08 -2.54 0) (length 3.81)
          (name "Pin_11" (effects (font (size 1.27 1.27))))
          (number "11" (effects (font (size 1.27 1.27))))
        )
        (pin passive line (at 7.62 -2.54 180) (length 3.81)
          (name "Pin_12" (effects (font (size 1.27 1.27))))
          (number "12" (effects (font (size 1.27 1.27))))
        )
        (pin passive line (at -5.08 -5.08 0) (length 3.81)
          (name "Pin_13" (effects (font (size 1.27 1.27))))
          (number "13" (effects (font (size 1.27 1.27))))
        )
        (pin passive line (at 7.62 -5.08 180) (length 3.81)
          (name "Pin_14" (effects (font (size 1.27 1.27))))
          (number "14" (effects (font (size 1.27 1.27))))
        )
        (pin passive line (at -5.08 -7.62 0) (length 3.81)
          (name "Pin_15" (effects (font (size 1.27 1.27))))
          (number "15" (effects (font (size 1.27 1.27))))
        )
        (pin passive line (at 7.62 -7.62 180) (length 3.81)
          (name "Pin_16" (effects (font (size 1.27 1.27))))
          (number "16" (effects (font (size 1.27 1.27))))
        )
        (pin passive line (at -5.08 -10.16 0) (length 3.81)
          (name "Pin_17" (effects (font (size 1.27 1.27))))
          (number "17" (effects (font (size 1.27 1.27))))
        )
        (pin passive line (at 7.62 -10.16 180) (length 3.81)
          (name "Pin_18" (effects (font (size 1.27 1.27))))
          (number "18" (effects (font (size 1.27 1.27))))
        )
        (pin passive line (at -5.08 -12.7 0) (length 3.81)
          (name "Pin_19" (effects (font (size 1.27 1.27))))
          (number "19" (effects (font (size 1.27 1.27))))
        )
        (pin passive line (at 7.62 10.16 180) (length 3.81)
          (name "Pin_2" (effects (font (size 1.27 1.27))))
          (number "2" (effects (font (size 1.27 1.27))))
        )
        (pin passive line (at 7.62 -12.7 180) (length 3.81)
          (name "Pin_20" (effects (font (size 1.27 1.27))))
          (number "20" (effects (font (size 1.27 1.27))))
        )
        (pin passive line (at -5.08 7.62 0) (length 3.81)
          (name "Pin_3" (effects (font (size 1.27 1.27))))
          (number "3" (effects (font (size 1.27 1.27))))
        )
        (pin passive line (at 7.62 7.62 180) (length 3.81)
          (name "Pin_4" (effects (font (size 1.27 1.27))))
          (number "4" (effects (font (size 1.27 1.27))))
        )
        (pin passive line (at -5.08 5.08 0) (length 3.81)
          (name "Pin_5" (effects (font (size 1.27 1.27))))
          (number "5" (effects (font (size 1.27 1.27))))
        )
        (pin passive line (at 7.62 5.08 180) (length 3.81)
          (name "Pin_6" (effects (font (size 1.27 1.27))))
          (number "6" (effects (font (size 1.27 1.27))))
        )
        (pin passive line (at -5.08 2.54 0) (length 3.81)
          (name "Pin_7" (effects (font (size 1.27 1.27))))
          (number "7" (effects (font (size 1.27 1.27))))
        )
        (pin passive line (at 7.62 2.54 180) (length 3.81)
          (name "Pin_8" (effects (font (size 1.27 1.27))))
          (number "8" (effects (font (size 1.27 1.27))))
        )
        (pin passive line (at -5.08 0 0) (length 3.81)
          (name "Pin_9" (effects (font (size 1.27 1.27))))
          (number "9" (effects (font (size 1.27 1.27))))
        )
      )
    )
    (symbol "Device:R" (pin_numbers hide) (pin_names (offset 0)) (in_bom yes) (on_board yes)
      (property "Reference" "R" (id 0) (at 2.032 0 90)
        (effects (font (size 1.27 1.27)))
      )
      (property "Value" "R" (id 1) (at 0 0 90)
        (effects (font (size 1.27 1.27)))
      )
      (property "Footprint" "" (id 2) (at -1.778 0 90)
        (effects (font (size 1.27 1.27)) hide)
      )
      (property "Datasheet" "~" (id 3) (at 0 0 0)
        (effects (font (size 1.27 1.27)) hide)
      )
      (property "ki_keywords" "R res resistor" (id 4) (at 0 0 0)
        (effects (font (size 1.27 1.27)) hide)
      )
      (property "ki_description" "Resistor" (id 5) (at 0 0 0)
        (effects (font (size 1.27 1.27)) hide)
      )
      (property "ki_fp_filters" "R_*" (id 6) (at 0 0 0)
        (effects (font (size 1.27 1.27)) hide)
      )
      (symbol "R_0_1"
        (rectangle (start -1.016 -2.54) (end 1.016 2.54)
          (stroke (width 0.254) (type default) (color 0 0 0 0))
          (fill (type none))
        )
      )
      (symbol "R_1_1"
        (pin passive line (at 0 3.81 270) (length 1.27)
          (name "~" (effects (font (size 1.27 1.27))))
          (number "1" (effects (font (size 1.27 1.27))))
        )
        (pin passive line (at 0 -3.81 90) (length 1.27)
          (name "~" (effects (font (size 1.27 1.27))))
          (number "2" (effects (font (size 1.27 1.27))))
        )
      )
    )
    (symbol "power:+3V3" (power) (pin_names (offset 0)) (in_bom yes) (on_board yes)
      (property "Reference" "#PWR" (id 0) (at 0 -3.81 0)
        (effects (font (size 1.27 1.27)) hide)
      )
      (property "Value" "+3V3" (id 1) (at 0 3.556 0)
        (effects (font (size 1.27 1.27)))
      )
      (property "Footprint" "" (id 2) (at 0 0 0)
        (effects (font (size 1.27 1.27)) hide)
      )
      (property "Datasheet" "" (id 3) (at 0 0 0)
        (effects (font (size 1.27 1.27)) hide)
      )
      (property "ki_keywords" "power-flag" (id 4) (at 0 0 0)
        (effects (font (size 1.27 1.27)) hide)
      )
      (property "ki_description" "Power symbol creates a global label with name \"+3V3\"" (id 5) (at 0 0 0)
        (effects (font (size 1.27 1.27)) hide)
      )
      (symbol "+3V3_0_1"
        (polyline
          (pts
            (xy -0.762 1.27)
            (xy 0 2.54)
          )
          (stroke (width 0) (type default) (color 0 0 0 0))
          (fill (type none))
        )
        (polyline
          (pts
            (xy 0 0)
            (xy 0 2.54)
          )
          (stroke (width 0) (type default) (color 0 0 0 0))
          (fill (type none))
        )
        (polyline
          (pts
            (xy 0 2.54)
            (xy 0.762 1.27)
          )
          (stroke (width 0) (type default) (color 0 0 0 0))
          (fill (type none))
        )
      )
      (symbol "+3V3_1_1"
        (pin power_in line (at 0 0 90) (length 0) hide
          (name "+3V3" (effects (font (size 1.27 1.27))))
          (number "1" (effects (font (size 1.27 1.27))))
        )
      )
    )
    (symbol "power:+5V" (power) (pin_names (offset 0)) (in_bom yes) (on_board yes)
      (property "Reference" "#PWR" (id 0) (at 0 -3.81 0)
        (effects (font (size 1.27 1.27)) hide)
      )
      (property "Value" "+5V" (id 1) (at 0 3.556 0)
        (effects (font (size 1.27 1.27)))
      )
      (property "Footprint" "" (id 2) (at 0 0 0)
        (effects (font (size 1.27 1.27)) hide)
      )
      (property "Datasheet" "" (id 3) (at 0 0 0)
        (effects (font (size 1.27 1.27)) hide)
      )
      (property "ki_keywords" "power-flag" (id 4) (at 0 0 0)
        (effects (font (size 1.27 1.27)) hide)
      )
      (property "ki_description" "Power symbol creates a global label with name \"+5V\"" (id 5) (at 0 0 0)
        (effects (font (size 1.27 1.27)) hide)
      )
      (symbol "+5V_0_1"
        (polyline
          (pts
            (xy -0.762 1.27)
            (xy 0 2.54)
          )
          (stroke (width 0) (type default) (color 0 0 0 0))
          (fill (type none))
        )
        (polyline
          (pts
            (xy 0 0)
            (xy 0 2.54)
          )
          (stroke (width 0) (type default) (color 0 0 0 0))
          (fill (type none))
        )
        (polyline
          (pts
            (xy 0 2.54)
            (xy 0.762 1.27)
          )
          (stroke (width 0) (type default) (color 0 0 0 0))
          (fill (type none))
        )
      )
      (symbol "+5V_1_1"
        (pin power_in line (at 0 0 90) (length 0) hide
          (name "+5V" (effects (font (size 1.27 1.27))))
          (number "1" (effects (font (size 1.27 1.27))))
        )
      )
    )
    (symbol "power:+BATT" (power) (pin_names (offset 0)) (in_bom yes) (on_board yes)
      (property "Reference" "#PWR" (id 0) (at 0 -3.81 0)
        (effects (font (size 1.27 1.27)) hide)
      )
      (property "Value" "+BATT" (id 1) (at 0 3.556 0)
        (effects (font (size 1.27 1.27)))
      )
      (property "Footprint" "" (id 2) (at 0 0 0)
        (effects (font (size 1.27 1.27)) hide)
      )
      (property "Datasheet" "" (id 3) (at 0 0 0)
        (effects (font (size 1.27 1.27)) hide)
      )
      (property "ki_keywords" "power-flag battery" (id 4) (at 0 0 0)
        (effects (font (size 1.27 1.27)) hide)
      )
      (property "ki_description" "Power symbol creates a global label with name \"+BATT\"" (id 5) (at 0 0 0)
        (effects (font (size 1.27 1.27)) hide)
      )
      (symbol "+BATT_0_1"
        (polyline
          (pts
            (xy -0.762 1.27)
            (xy 0 2.54)
          )
          (stroke (width 0) (type default) (color 0 0 0 0))
          (fill (type none))
        )
        (polyline
          (pts
            (xy 0 0)
            (xy 0 2.54)
          )
          (stroke (width 0) (type default) (color 0 0 0 0))
          (fill (type none))
        )
        (polyline
          (pts
            (xy 0 2.54)
            (xy 0.762 1.27)
          )
          (stroke (width 0) (type default) (color 0 0 0 0))
          (fill (type none))
        )
      )
      (symbol "+BATT_1_1"
        (pin power_in line (at 0 0 90) (length 0) hide
          (name "+BATT" (effects (font (size 1.27 1.27))))
          (number "1" (effects (font (size 1.27 1.27))))
        )
      )
    )
    (symbol "power:GND" (power) (pin_names (offset 0)) (in_bom yes) (on_board yes)
      (property "Reference" "#PWR" (id 0) (at 0 -6.35 0)
        (effects (font (size 1.27 1.27)) hide)
      )
      (property "Value" "GND" (id 1) (at 0 -3.81 0)
        (effects (font (size 1.27 1.27)))
      )
      (property "Footprint" "" (id 2) (at 0 0 0)
        (effects (font (size 1.27 1.27)) hide)
      )
      (property "Datasheet" "" (id 3) (at 0 0 0)
        (effects (font (size 1.27 1.27)) hide)
      )
      (property "ki_keywords" "power-flag" (id 4) (at 0 0 0)
        (effects (font (size 1.27 1.27)) hide)
      )
      (property "ki_description" "Power symbol creates a global label with name \"GND\" , ground" (id 5) (at 0 0 0)
        (effects (font (size 1.27 1.27)) hide)
      )
      (symbol "GND_0_1"
        (polyline
          (pts
            (xy 0 0)
            (xy 0 -1.27)
            (xy 1.27 -1.27)
            (xy 0 -2.54)
            (xy -1.27 -1.27)
            (xy 0 -1.27)
          )
          (stroke (width 0) (type default) (color 0 0 0 0))
          (fill (type none))
        )
      )
      (symbol "GND_1_1"
        (pin power_in line (at 0 0 270) (length 0) hide
          (name "GND" (effects (font (size 1.27 1.27))))
          (number "1" (effects (font (size 1.27 1.27))))
        )
      )
    )
  )

  (junction (at 33.02 93.98) (diameter 0) (color 0 0 0 0)
    (uuid 0c258a38-e71c-4400-a4cf-fd0d0c5de2e2)
  )
  (junction (at 54.61 94.2131) (diameter 0) (color 0 0 0 0)
    (uuid 2d8d5c87-b17e-4cf4-9d7d-b8a950d8ea47)
  )
  (junction (at 114.3 93.98) (diameter 0) (color 0 0 0 0)
    (uuid 3922b435-0671-4a18-97e0-a65ca7bd0b16)
  )
  (junction (at 58.42 57.15) (diameter 0) (color 0 0 0 0)
    (uuid 6514ce19-8b0d-43b9-a151-91c9b3437382)
  )
  (junction (at 60.96 39.37) (diameter 0) (color 0 0 0 0)
    (uuid 679c8fff-3a31-4c18-a667-c20ee20e81b7)
  )
  (junction (at 135.89 93.98) (diameter 0) (color 0 0 0 0)
    (uuid 6e357537-b2e7-431c-95e4-4271791168cb)
  )
  (junction (at 54.61 127) (diameter 0) (color 0 0 0 0)
    (uuid 71160038-c1b9-45dd-81c4-2f095abe5054)
  )
  (junction (at 60.96 36.83) (diameter 0) (color 0 0 0 0)
    (uuid 719ca6c7-a39b-48da-b1ee-bd8ff5722dba)
  )
  (junction (at 58.42 54.61) (diameter 0) (color 0 0 0 0)
    (uuid 750c2be1-5be7-4048-b917-983ddcfd3756)
  )
  (junction (at 33.02 127) (diameter 0) (color 0 0 0 0)
    (uuid 77a5f98b-393d-48ef-9486-c0cbc6d5296b)
  )
  (junction (at 95.25 93.98) (diameter 0) (color 0 0 0 0)
    (uuid a1bc24ca-6831-4326-835a-6a788564b344)
  )
  (junction (at 95.25 127) (diameter 0) (color 0 0 0 0)
    (uuid a58f8a3f-61d1-4a4a-b268-fda1a58b7c16)
  )
  (junction (at 95.25 39.37) (diameter 0) (color 0 0 0 0)
    (uuid bc07be15-32b3-4b5c-8acd-7e95a0e4e63d)
  )
  (junction (at 74.93 93.98) (diameter 0) (color 0 0 0 0)
    (uuid c4cf9b22-8362-4df5-88de-8b7b6007f43b)
  )
  (junction (at 74.93 127) (diameter 0) (color 0 0 0 0)
    (uuid c6293e67-6cdd-4536-b65b-5a293d877bc4)
  )
  (junction (at 95.25 36.83) (diameter 0) (color 0 0 0 0)
    (uuid d75f9e48-0f30-4712-8488-3c0fd7b41ca3)
  )
  (junction (at 95.25 59.69) (diameter 0) (color 0 0 0 0)
    (uuid f035491d-5812-4b2c-9316-c483f80632b2)
  )
  (junction (at 58.42 59.69) (diameter 0) (color 0 0 0 0)
    (uuid fa3fd016-006f-41cc-9edc-3e0a89cfadc4)
  )

  (wire (pts (xy 137.16 39.37) (xy 114.3 39.37))
    (stroke (width 0) (type default) (color 0 0 0 0))
    (uuid 003768fc-8a05-4527-9ec8-3a481dc802b4)
  )
  (wire (pts (xy 74.93 125.73) (xy 74.93 127))
    (stroke (width 0) (type default) (color 0 0 0 0))
    (uuid 00501238-424b-4595-ba29-bf18fb648fc2)
  )
  (wire (pts (xy 58.42 54.61) (xy 54.61 54.61))
    (stroke (width 0) (type default) (color 0 0 0 0))
    (uuid 03c3c28b-8c0b-48b4-ae32-c3e6315b7264)
  )
  (wire (pts (xy 33.02 93.98) (xy 33.02 95.25))
    (stroke (width 0) (type default) (color 0 0 0 0))
    (uuid 04afe24b-2d7a-496f-bfc5-a1657c436f87)
  )
  (wire (pts (xy 33.02 57.15) (xy 41.91 57.15))
    (stroke (width 0) (type default) (color 0 0 0 0))
    (uuid 0631901d-a336-4735-a184-18b67459826d)
  )
  (wire (pts (xy 33.02 127) (xy 33.02 128.27))
    (stroke (width 0) (type default) (color 0 0 0 0))
    (uuid 06b04851-5dd0-4c18-8801-12171f80b29c)
  )
  (wire (pts (xy 158.75 35.56) (xy 163.83 35.56))
    (stroke (width 0) (type default) (color 0 0 0 0))
    (uuid 08128ed2-8115-4c0a-b90a-71bc2e5d2ca6)
  )
  (wire (pts (xy 158.75 46.99) (xy 158.75 45.72))
    (stroke (width 0) (type default) (color 0 0 0 0))
    (uuid 08895082-be0e-4ce0-9f04-c00b1e12d9aa)
  )
  (wire (pts (xy 41.91 54.61) (xy 35.56 54.61))
    (stroke (width 0) (type solid) (color 0 0 0 0))
    (uuid 0a895522-4daa-411e-92ca-ee9b26cfcdc2)
  )
  (wire (pts (xy 111.76 93.98) (xy 95.25 93.98))
    (stroke (width 0) (type default) (color 0 0 0 0))
    (uuid 1093e73b-6d4f-4fb7-84b0-81b1f05198e9)
  )
  (wire (pts (xy 135.89 93.98) (xy 135.89 95.25))
    (stroke (width 0) (type default) (color 0 0 0 0))
    (uuid 114a1561-88a6-4d3d-b4bc-854252d665d4)
  )
  (wire (pts (xy 95.25 125.73) (xy 95.25 127))
    (stroke (width 0) (type default) (color 0 0 0 0))
    (uuid 120bcd20-afcc-4e7d-a265-456d995c612d)
  )
  (wire (pts (xy 95.25 80.01) (xy 95.25 85.09))
    (stroke (width 0) (type default) (color 0 0 0 0))
    (uuid 16d6d767-f2a0-4008-b0f5-1bece3a431a9)
  )
  (wire (pts (xy 54.61 113.03) (xy 54.61 118.11))
    (stroke (width 0) (type default) (color 0 0 0 0))
    (uuid 1a349412-c58c-4d9f-bc2c-36b75f43ac3c)
  )
  (wire (pts (xy 49.53 93.98) (xy 33.02 93.98))
    (stroke (width 0) (type default) (color 0 0 0 0))
    (uuid 1e9d279c-44bc-4bbd-b6f8-82c78e42db1e)
  )
  (wire (pts (xy 95.25 113.03) (xy 95.25 118.11))
    (stroke (width 0) (type default) (color 0 0 0 0))
    (uuid 1ea51e6f-4be7-49c8-8b72-667f805f4d14)
  )
  (wire (pts (xy 130.81 93.98) (xy 114.3 93.98))
    (stroke (width 0) (type default) (color 0 0 0 0))
    (uuid 1f94fd82-f364-4b70-8e2d-4a451548765c)
  )
  (wire (pts (xy 152.4 93.98) (xy 135.89 93.98))
    (stroke (width 0) (type default) (color 0 0 0 0))
    (uuid 23e4c63f-beaa-4f22-853d-018c531133fb)
  )
  (wire (pts (xy 95.25 35.56) (xy 95.25 36.83))
    (stroke (width 0) (type default) (color 0 0 0 0))
    (uuid 26cac52f-ed93-41be-aefe-88151935a583)
  )
  (wire (pts (xy 91.44 54.61) (xy 101.6 54.61))
    (stroke (width 0) (type default) (color 0 0 0 0))
    (uuid 2c2fbbb6-a06f-460b-84d9-f8bce8ee1f96)
  )
  (wire (pts (xy 54.61 39.37) (xy 60.96 39.37))
    (stroke (width 0) (type default) (color 0 0 0 0))
    (uuid 36e221b4-d0b8-4f46-8441-44a1f7a2e93f)
  )
  (wire (pts (xy 158.75 45.72) (xy 163.83 45.72))
    (stroke (width 0) (type default) (color 0 0 0 0))
    (uuid 3b15197f-dd89-4eb0-8f79-e8f0f4471b82)
  )
  (wire (pts (xy 158.75 43.18) (xy 163.83 43.18))
    (stroke (width 0) (type default) (color 0 0 0 0))
    (uuid 3c2a2cc6-611e-4e17-95a6-27839c9ff630)
  )
  (wire (pts (xy 185.42 40.64) (xy 190.5 40.64))
    (stroke (width 0) (type default) (color 0 0 0 0))
    (uuid 3ee598dd-b155-4c51-93d6-60a14a0d4e9e)
  )
  (wire (pts (xy 41.91 44.45) (xy 25.4 44.45))
    (stroke (width 0) (type default) (color 0 0 0 0))
    (uuid 3f45756d-66d1-4f85-b697-7310e820557f)
  )
  (wire (pts (xy 60.96 39.37) (xy 60.96 36.83))
    (stroke (width 0) (type default) (color 0 0 0 0))
    (uuid 48177282-5db4-4b6c-a363-09562826a087)
  )
  (wire (pts (xy 185.42 46.99) (xy 185.42 45.72))
    (stroke (width 0) (type default) (color 0 0 0 0))
    (uuid 4f2ee73c-69ae-45fb-b2ce-4bf20e11aae3)
  )
  (wire (pts (xy 91.44 49.53) (xy 101.6 49.53))
    (stroke (width 0) (type default) (color 0 0 0 0))
    (uuid 53b263da-d0a7-4074-ba12-fe13d4b68de6)
  )
  (wire (pts (xy 33.02 113.03) (xy 33.02 118.11))
    (stroke (width 0) (type default) (color 0 0 0 0))
    (uuid 540a175c-091d-46c1-81d5-dcb568ab5759)
  )
  (wire (pts (xy 74.93 113.03) (xy 74.93 118.11))
    (stroke (width 0) (type default) (color 0 0 0 0))
    (uuid 57168f67-e416-47b1-92cb-07abed0a7f94)
  )
  (wire (pts (xy 95.25 59.69) (xy 95.25 64.77))
    (stroke (width 0) (type default) (color 0 0 0 0))
    (uuid 6221738b-bb7b-4da4-a07e-2defc466eebf)
  )
  (wire (pts (xy 95.25 39.37) (xy 95.25 41.91))
    (stroke (width 0) (type default) (color 0 0 0 0))
    (uuid 62d8dfd5-3127-4ab4-ae58-232aec5e54aa)
  )
  (wire (pts (xy 91.44 52.07) (xy 101.6 52.07))
    (stroke (width 0) (type default) (color 0 0 0 0))
    (uuid 679f6180-2833-4511-b1fe-73c40fc79ed2)
  )
  (wire (pts (xy 111.76 127) (xy 95.25 127))
    (stroke (width 0) (type default) (color 0 0 0 0))
    (uuid 691045fb-9749-4a1d-983f-44fadb5c11a4)
  )
  (wire (pts (xy 101.6 57.15) (xy 95.25 57.15))
    (stroke (width 0) (type default) (color 0 0 0 0))
    (uuid 696ee1fd-7356-4c96-a6ef-6789d7506638)
  )
  (wire (pts (xy 95.25 92.71) (xy 95.25 93.98))
    (stroke (width 0) (type default) (color 0 0 0 0))
    (uuid 69e83a7f-ee15-4c60-a910-e827faddb63b)
  )
  (wire (pts (xy 21.59 52.07) (xy 41.91 52.07))
    (stroke (width 0) (type solid) (color 0 0 0 0))
    (uuid 6f17e24d-a6af-4576-b54c-294a98f7f3ba)
  )
  (wire (pts (xy 114.3 57.15) (xy 120.65 57.15))
    (stroke (width 0) (type solid) (color 0 0 0 0))
    (uuid 709f658b-c1d0-446a-9bca-9e7d58b3f720)
  )
  (wire (pts (xy 71.12 127) (xy 54.61 127))
    (stroke (width 0) (type default) (color 0 0 0 0))
    (uuid 722964f7-b03b-45fb-a1d7-70b7dc5b11ba)
  )
  (wire (pts (xy 54.61 57.15) (xy 58.42 57.15))
    (stroke (width 0) (type default) (color 0 0 0 0))
    (uuid 72b84c29-5ff5-4c3b-8b7a-f637e7f9b8da)
  )
  (wire (pts (xy 114.3 93.98) (xy 114.3 95.25))
    (stroke (width 0) (type default) (color 0 0 0 0))
    (uuid 7ac86d2f-2ee6-4989-b64e-a35484133bf0)
  )
  (wire (pts (xy 123.19 59.69) (xy 114.3 59.69))
    (stroke (width 0) (type solid) (color 0 0 0 0))
    (uuid 7b50f552-d968-4564-bd0f-798623397d93)
  )
  (wire (pts (xy 137.16 36.83) (xy 114.3 36.83))
    (stroke (width 0) (type default) (color 0 0 0 0))
    (uuid 7c716d99-c0f2-4832-a3d1-0af9f5926fdf)
  )
  (wire (pts (xy 114.3 41.91) (xy 135.89 41.91))
    (stroke (width 0) (type solid) (color 0 0 0 0))
    (uuid 7d34ba80-532d-414a-8f8e-f749f7e03e9a)
  )
  (wire (pts (xy 74.93 93.98) (xy 74.93 95.25))
    (stroke (width 0) (type default) (color 0 0 0 0))
    (uuid 7dce513f-d729-4c97-8537-d114ce632d4a)
  )
  (wire (pts (xy 95.25 93.98) (xy 95.25 95.25))
    (stroke (width 0) (type default) (color 0 0 0 0))
    (uuid 7e0c680f-4f05-44ea-b6f2-5f434666763a)
  )
  (wire (pts (xy 185.42 33.02) (xy 190.5 33.02))
    (stroke (width 0) (type default) (color 0 0 0 0))
    (uuid 7f031e38-6fbc-411c-9ed7-4d6d096749ae)
  )
  (wire (pts (xy 41.91 46.99) (xy 25.4 46.99))
    (stroke (width 0) (type solid) (color 0 0 0 0))
    (uuid 8307b0ae-1ec2-4e89-b397-35780b77c107)
  )
  (wire (pts (xy 91.44 127) (xy 74.93 127))
    (stroke (width 0) (type default) (color 0 0 0 0))
    (uuid 83342646-358c-4db8-9f65-c9b09af144f9)
  )
  (wire (pts (xy 54.61 92.71) (xy 54.61 94.2131))
    (stroke (width 0) (type default) (color 0 0 0 0))
    (uuid 83e17341-42fa-4c7a-b150-b24bd95fe3e0)
  )
  (wire (pts (xy 114.3 92.71) (xy 114.3 93.98))
    (stroke (width 0) (type default) (color 0 0 0 0))
    (uuid 8654f301-0505-48d7-8fe0-0ffca3176b11)
  )
  (wire (pts (xy 95.25 36.83) (xy 95.25 39.37))
    (stroke (width 0) (type default) (color 0 0 0 0))
    (uuid 8a1f2e52-4508-4643-9f97-16b6021eb1de)
  )
  (wire (pts (xy 158.75 33.02) (xy 158.75 31.75))
    (stroke (width 0) (type default) (color 0 0 0 0))
    (uuid 8be06d76-7a15-44be-b777-f74576b8a833)
  )
  (wire (pts (xy 41.91 36.83) (xy 35.56 36.83))
    (stroke (width 0) (type solid) (color 0 0 0 0))
    (uuid 8c0324d5-e07e-441e-89d8-baf9bb054821)
  )
  (wire (pts (xy 41.91 39.37) (xy 21.59 39.37))
    (stroke (width 0) (type solid) (color 0 0 0 0))
    (uuid 8e42aa5d-631a-4f40-baca-b5e7e1b6125f)
  )
  (wire (pts (xy 60.96 41.91) (xy 54.61 41.91))
    (stroke (width 0) (type default) (color 0 0 0 0))
    (uuid 935b046d-9f58-40d9-8e22-6239022d747b)
  )
  (wire (pts (xy 95.25 57.15) (xy 95.25 59.69))
    (stroke (width 0) (type default) (color 0 0 0 0))
    (uuid 9535e617-f166-4d01-80fa-a4d8abe47570)
  )
  (wire (pts (xy 95.25 59.69) (xy 101.6 59.69))
    (stroke (width 0) (type default) (color 0 0 0 0))
    (uuid 965d884b-1739-401c-a32b-b300a25f2037)
  )
  (wire (pts (xy 54.61 127) (xy 54.61 128.27))
    (stroke (width 0) (type default) (color 0 0 0 0))
    (uuid 98932d02-9973-49dd-bf25-5e62d7b0f6b1)
  )
  (wire (pts (xy 58.42 57.15) (xy 58.42 59.69))
    (stroke (width 0) (type default) (color 0 0 0 0))
    (uuid 9b7c5860-8927-413c-8b2b-592867381897)
  )
  (wire (pts (xy 58.42 52.07) (xy 58.42 54.61))
    (stroke (width 0) (type default) (color 0 0 0 0))
    (uuid a17b90de-9090-4b70-8d15-d3898d2e13be)
  )
  (wire (pts (xy 21.59 49.53) (xy 41.91 49.53))
    (stroke (width 0) (type default) (color 0 0 0 0))
    (uuid a19b2a6c-a090-4128-989f-b88aaf679e63)
  )
  (wire (pts (xy 114.3 49.53) (xy 120.65 49.53))
    (stroke (width 0) (type default) (color 0 0 0 0))
    (uuid a1b6f5cd-7b66-4746-9cb9-31fd712171d0)
  )
  (wire (pts (xy 54.61 59.69) (xy 58.42 59.69))
    (stroke (width 0) (type default) (color 0 0 0 0))
    (uuid a254d15a-9ab0-4954-a737-6bd2ba8198a3)
  )
  (wire (pts (xy 185.42 43.18) (xy 190.5 43.18))
    (stroke (width 0) (type default) (color 0 0 0 0))
    (uuid a39f6b2f-76ff-47b1-a7bc-375de2303866)
  )
  (wire (pts (xy 185.42 35.56) (xy 190.5 35.56))
    (stroke (width 0) (type default) (color 0 0 0 0))
    (uuid a3c38e75-35fb-41d7-b946-3e8c7dc113e3)
  )
  (wire (pts (xy 101.6 41.91) (xy 95.25 41.91))
    (stroke (width 0) (type default) (color 0 0 0 0))
    (uuid a49a1c9d-4774-40cf-8bfc-0b620f9a7cc8)
  )
  (wire (pts (xy 74.93 80.01) (xy 74.93 85.09))
    (stroke (width 0) (type default) (color 0 0 0 0))
    (uuid a79eccbe-627c-4fbf-bb88-2fbf3afbfe9c)
  )
  (wire (pts (xy 158.75 40.64) (xy 163.83 40.64))
    (stroke (width 0) (type default) (color 0 0 0 0))
    (uuid a817b976-7b09-46e4-b1a0-c52e5d53fd2d)
  )
  (wire (pts (xy 135.89 92.71) (xy 135.89 93.98))
    (stroke (width 0) (type default) (color 0 0 0 0))
    (uuid b0daaf53-e643-4604-bb9e-b21a59ee6b19)
  )
  (wire (pts (xy 71.12 94.2131) (xy 54.61 94.2131))
    (stroke (width 0) (type default) (color 0 0 0 0))
    (uuid b1e453de-de6e-42f3-9829-44643f416e9b)
  )
  (wire (pts (xy 91.44 93.98) (xy 74.93 93.98))
    (stroke (width 0) (type default) (color 0 0 0 0))
    (uuid b3a7ce5f-13f1-496a-8849-1307b9629c87)
  )
  (wire (pts (xy 33.02 59.69) (xy 41.91 59.69))
    (stroke (width 0) (type solid) (color 0 0 0 0))
    (uuid b53aae5f-5a9f-4223-b3de-a7cdc77308d6)
  )
  (wire (pts (xy 185.42 38.1) (xy 190.5 38.1))
    (stroke (width 0) (type default) (color 0 0 0 0))
    (uuid b5d0055e-88b2-4764-8c83-0ccb9caee826)
  )
  (wire (pts (xy 81.28 44.45) (xy 101.6 44.45))
    (stroke (width 0) (type solid) (color 0 0 0 0))
    (uuid b9637706-0142-4de8-91b0-1b4b16662bc2)
  )
  (wire (pts (xy 91.44 46.99) (xy 101.6 46.99))
    (stroke (width 0) (type default) (color 0 0 0 0))
    (uuid bae5c7f5-e963-4574-93b3-c581b6400446)
  )
  (wire (pts (xy 33.02 92.71) (xy 33.02 93.98))
    (stroke (width 0) (type default) (color 0 0 0 0))
    (uuid c31bcf1c-e3c0-4b13-8b99-e257fd6b3c72)
  )
  (wire (pts (xy 54.61 94.2131) (xy 54.61 95.25))
    (stroke (width 0) (type default) (color 0 0 0 0))
    (uuid c70d4a0e-bb51-4e17-a1d2-3cd3b5b1a7bd)
  )
  (wire (pts (xy 185.42 45.72) (xy 190.5 45.72))
    (stroke (width 0) (type default) (color 0 0 0 0))
    (uuid c8aa8b9c-e178-4141-b5b5-cd55440cf0b8)
  )
  (wire (pts (xy 33.02 125.73) (xy 33.02 127))
    (stroke (width 0) (type default) (color 0 0 0 0))
    (uuid d09fbfc8-3c11-467f-9f61-2492be30ca6e)
  )
  (wire (pts (xy 163.83 33.02) (xy 158.75 33.02))
    (stroke (width 0) (type default) (color 0 0 0 0))
    (uuid d0a5440f-6298-45bc-b15f-05962cdee431)
  )
  (wire (pts (xy 74.93 127) (xy 74.93 128.27))
    (stroke (width 0) (type default) (color 0 0 0 0))
    (uuid d263c2c8-f2f9-4a65-8044-eea960e7cce6)
  )
  (wire (pts (xy 54.61 49.53) (xy 71.12 49.53))
    (stroke (width 0) (type solid) (color 0 0 0 0))
    (uuid d3b44c91-8042-45d7-8ff9-a0427cc8acda)
  )
  (wire (pts (xy 49.53 127) (xy 33.02 127))
    (stroke (width 0) (type default) (color 0 0 0 0))
    (uuid d4397202-f6be-4f82-9e03-fc601288bf06)
  )
  (wire (pts (xy 54.61 80.01) (xy 54.61 85.09))
    (stroke (width 0) (type default) (color 0 0 0 0))
    (uuid d4c7928a-04e6-4f5b-bef8-26623a15940b)
  )
  (wire (pts (xy 114.3 52.07) (xy 120.65 52.07))
    (stroke (width 0) (type solid) (color 0 0 0 0))
    (uuid d63c9266-0d6e-4d3e-91fa-592c478384ca)
  )
  (wire (pts (xy 158.75 38.1) (xy 163.83 38.1))
    (stroke (width 0) (type default) (color 0 0 0 0))
    (uuid dab82d55-2360-4a7f-bb0a-5f7bbd277685)
  )
  (wire (pts (xy 54.61 44.45) (xy 74.93 44.45))
    (stroke (width 0) (type solid) (color 0 0 0 0))
    (uuid daf06042-9c8c-4d94-b0fd-652e239648c8)
  )
  (wire (pts (xy 60.96 39.37) (xy 60.96 41.91))
    (stroke (width 0) (type default) (color 0 0 0 0))
    (uuid db6be2be-b504-4fad-9a74-5385d9c6c932)
  )
  (wire (pts (xy 74.93 92.71) (xy 74.93 93.98))
    (stroke (width 0) (type default) (color 0 0 0 0))
    (uuid dba0c173-2f6b-4685-aa0f-789a3ea78149)
  )
  (wire (pts (xy 54.61 125.73) (xy 54.61 127))
    (stroke (width 0) (type default) (color 0 0 0 0))
    (uuid e120f01c-e7f5-4217-a2db-9d338fc352a8)
  )
  (wire (pts (xy 54.61 46.99) (xy 76.2 46.99))
    (stroke (width 0) (type solid) (color 0 0 0 0))
    (uuid e58627f2-db7a-49bb-8f49-d9b4ae9eb91a)
  )
  (wire (pts (xy 114.3 46.99) (xy 120.65 46.99))
    (stroke (width 0) (type default) (color 0 0 0 0))
    (uuid e77f0f88-b3b5-43fc-a54a-79f9d0c81ef1)
  )
  (wire (pts (xy 135.89 80.01) (xy 135.89 85.09))
    (stroke (width 0) (type default) (color 0 0 0 0))
    (uuid e7e8a66c-7978-4b70-8eb4-0002017b22d6)
  )
  (wire (pts (xy 95.25 36.83) (xy 101.6 36.83))
    (stroke (width 0) (type default) (color 0 0 0 0))
    (uuid e7fc9a33-2b20-4d84-8ed2-0ac2ee291bfd)
  )
  (wire (pts (xy 58.42 59.69) (xy 58.42 62.23))
    (stroke (width 0) (type default) (color 0 0 0 0))
    (uuid e8167d41-a3a6-4522-8c26-25dde026be11)
  )
  (wire (pts (xy 60.96 35.56) (xy 60.96 36.83))
    (stroke (width 0) (type default) (color 0 0 0 0))
    (uuid ea308e30-4209-47bb-87d9-efdc283e5f2e)
  )
  (wire (pts (xy 114.3 80.01) (xy 114.3 85.09))
    (stroke (width 0) (type default) (color 0 0 0 0))
    (uuid eb75af3c-d6a8-44e9-8b80-3434b533692e)
  )
  (wire (pts (xy 114.3 44.45) (xy 135.89 44.45))
    (stroke (width 0) (type default) (color 0 0 0 0))
    (uuid ed92a873-2fef-4627-a2e4-aede8dd4261a)
  )
  (wire (pts (xy 114.3 54.61) (xy 129.54 54.61))
    (stroke (width 0) (type default) (color 0 0 0 0))
    (uuid ef0f7804-42e2-4a66-97a9-fa3ac853c38a)
  )
  (wire (pts (xy 54.61 52.07) (xy 58.42 52.07))
    (stroke (width 0) (type default) (color 0 0 0 0))
    (uuid f08c809d-0016-4595-abd6-7cb14460dedf)
  )
  (wire (pts (xy 54.61 36.83) (xy 60.96 36.83))
    (stroke (width 0) (type default) (color 0 0 0 0))
    (uuid f1fe3c33-0889-4f52-a440-3bb66e512eb6)
  )
  (wire (pts (xy 58.42 54.61) (xy 58.42 57.15))
    (stroke (width 0) (type default) (color 0 0 0 0))
    (uuid f6baefa4-2e66-4675-a7fe-70912fb3537e)
  )
  (wire (pts (xy 95.25 127) (xy 95.25 128.27))
    (stroke (width 0) (type default) (color 0 0 0 0))
    (uuid fb2918dc-c576-467e-b6c2-f2db3d7e3f4a)
  )
  (wire (pts (xy 95.25 39.37) (xy 101.6 39.37))
    (stroke (width 0) (type default) (color 0 0 0 0))
    (uuid fbb2fcde-9bd1-40ee-887e-79d82667b91b)
  )
  (wire (pts (xy 41.91 41.91) (xy 35.56 41.91))
    (stroke (width 0) (type default) (color 0 0 0 0))
    (uuid fe42af22-3ab5-4b90-a291-a4803ea17918)
  )

  (label "PC15" (at 130.81 93.98 180)
    (effects (font (size 1.27 1.27)) (justify right bottom))
    (uuid 008d243e-e8ca-4b8a-a5cd-cb5d1fd57ecd)
  )
  (label "ICM20789_INT" (at 129.54 54.61 180)
    (effects (font (size 1.27 1.27)) (justify right bottom))
    (uuid 0e3f7e05-25ab-410e-b7ef-4a2e876e49e8)
  )
  (label "PB9" (at 71.12 94.2131 180)
    (effects (font (size 1.27 1.27)) (justify right bottom))
    (uuid 0f3b1c8f-9d90-427d-8e9c-ac8971b29f38)
  )
  (label "SPI1_SDI" (at 91.44 46.99 0)
    (effects (font (size 1.27 1.27)) (justify left bottom))
    (uuid 0fb00d06-1116-4d31-b897-5fef058321fc)
  )
  (label "IN9" (at 74.93 113.03 270)
    (effects (font (size 1.27 1.27)) (justify right bottom))
    (uuid 1223201a-3cff-49a4-8a97-0baab91d5eb9)
  )
  (label "IN8" (at 54.61 113.03 270)
    (effects (font (size 1.27 1.27)) (justify right bottom))
    (uuid 15d857eb-2ac2-4106-8be3-fcfddeb2a2f1)
  )
  (label "IN5" (at 114.3 80.01 270)
    (effects (font (size 1.27 1.27)) (justify right bottom))
    (uuid 15f380c6-c1f2-423c-a5ed-3013822b4fbf)
  )
  (label "PB2" (at 120.65 46.99 180)
    (effects (font (size 1.27 1.27)) (justify right bottom))
    (uuid 15f4b9bf-5faf-4bac-aca4-f9137aea3203)
  )
  (label "IN4" (at 158.75 40.64 0)
    (effects (font (size 1.27 1.27)) (justify left bottom))
    (uuid 1893b25c-93b8-4f15-8b12-11a6db501d8a)
  )
  (label "USART3_TX_CONSOLE" (at 135.89 44.45 180)
    (effects (font (size 1.27 1.27)) (justify right bottom))
    (uuid 1c684c6e-af07-4dc2-99df-095ff7983e4a)
  )
  (label "IN4" (at 95.25 80.01 270)
    (effects (font (size 1.27 1.27)) (justify right bottom))
    (uuid 1e2f0bf8-e60d-43ef-9a14-a8c8ed49c2b8)
  )
  (label "I2C2_SCL_MMC5603NJ" (at 137.16 36.83 180)
    (effects (font (size 1.27 1.27)) (justify right bottom))
    (uuid 22d7e9e4-13ad-4155-a896-7dc3c6234c6b)
  )
  (label "SPI1_nCS" (at 91.44 54.61 0)
    (effects (font (size 1.27 1.27)) (justify left bottom))
    (uuid 24b07bd6-7b31-4a76-a979-9dec76836984)
  )
  (label "RS232_STATUS" (at 25.4 44.45 0)
    (effects (font (size 1.27 1.27)) (justify left bottom))
    (uuid 27693a09-0da3-487e-be20-7f0c66719572)
  )
  (label "ADC1" (at 120.65 52.07 180)
    (effects (font (size 1.27 1.27)) (justify right bottom))
    (uuid 2cf4f415-29de-4300-b512-5eb9cb40347b)
  )
  (label "IN7" (at 33.02 113.03 270)
    (effects (font (size 1.27 1.27)) (justify right bottom))
    (uuid 2ecbb096-e6f0-4088-8801-1c2c23fc0650)
  )
  (label "IN6" (at 185.42 33.02 0)
    (effects (font (size 1.27 1.27)) (justify left bottom))
    (uuid 34e94c32-4c65-4242-872f-eddbf97f6a96)
  )
  (label "IN10" (at 185.42 43.18 0)
    (effects (font (size 1.27 1.27)) (justify left bottom))
    (uuid 369df606-e095-4c6e-ade6-6acbc93b748e)
  )
  (label "ADC1" (at 71.12 127 180)
    (effects (font (size 1.27 1.27)) (justify right bottom))
    (uuid 3c1bc581-8607-4ac1-b0f0-44dca2a76e3f)
  )
  (label "IN2" (at 158.75 35.56 0)
    (effects (font (size 1.27 1.27)) (justify left bottom))
    (uuid 3d632b6c-bd3d-4474-92a9-e037dcd48f9d)
  )
  (label "ICM20789_INT" (at 49.53 127 180)
    (effects (font (size 1.27 1.27)) (justify right bottom))
    (uuid 4d6a0eea-6043-41ab-a744-abc0e027150f)
  )
  (label "USART2_RTS_MAX3485" (at 76.2 46.99 180)
    (effects (font (size 1.27 1.27)) (justify right bottom))
    (uuid 58fa03c3-9dfa-452f-8a7b-3f90eab225f6)
  )
  (label "FDCAN2_STATUS" (at 81.28 44.45 0)
    (effects (font (size 1.27 1.27)) (justify left bottom))
    (uuid 5f329bcb-12a6-46d8-a5e7-d1636d6449f8)
  )
  (label "PA0" (at 120.65 57.15 180)
    (effects (font (size 1.27 1.27)) (justify right bottom))
    (uuid 60c6fc32-1b46-48cf-8611-9a7556f01621)
  )
  (label "PA10" (at 111.76 93.98 180)
    (effects (font (size 1.27 1.27)) (justify right bottom))
    (uuid 7175dfa3-6c6f-44e9-9906-d21372b81dd0)
  )
  (label "PB2" (at 111.76 127 180)
    (effects (font (size 1.27 1.27)) (justify right bottom))
    (uuid 72c9de66-7edd-4616-8c6a-fde0ec6c6bb8)
  )
  (label "USART1_TX_MAX3232" (at 21.59 49.53 0)
    (effects (font (size 1.27 1.27)) (justify left bottom))
    (uuid 742403da-72f0-4302-8177-04c1303d22ac)
  )
  (label "IN2" (at 54.61 80.01 270)
    (effects (font (size 1.27 1.27)) (justify right bottom))
    (uuid 74fca8f1-7324-45a1-b972-025958e51dd5)
  )
  (label "PB3" (at 35.56 41.91 0)
    (effects (font (size 1.27 1.27)) (justify left bottom))
    (uuid 769d78a3-e76a-4280-b9f9-605e20b88234)
  )
  (label "USART2_TX_MAX3485" (at 74.93 44.45 180)
    (effects (font (size 1.27 1.27)) (justify right bottom))
    (uuid 7b49766a-c700-4184-86c9-8374e767a598)
  )
  (label "PB9" (at 35.56 54.61 0)
    (effects (font (size 1.27 1.27)) (justify left bottom))
    (uuid 7cb42a87-b313-42a8-b694-e7eab4e076a6)
  )
  (label "IN3" (at 158.75 38.1 0)
    (effects (font (size 1.27 1.27)) (justify left bottom))
    (uuid 7d154f90-f50d-4aa5-918d-34cc2eecf59b)
  )
  (label "IN9" (at 185.42 40.64 0)
    (effects (font (size 1.27 1.27)) (justify left bottom))
    (uuid 800fb7b3-63bf-44aa-8ef9-129c45131e64)
  )
  (label "RS485_STATUS" (at 25.4 46.99 0)
    (effects (font (size 1.27 1.27)) (justify left bottom))
    (uuid 812d1173-7fe7-48b4-a91c-0deea7a8d5b1)
  )
  (label "PB1" (at 91.44 127 180)
    (effects (font (size 1.27 1.27)) (justify right bottom))
    (uuid 88c48abc-3f68-4a9a-a995-af11415b4902)
  )
  (label "FDCAN1_STATUS" (at 71.12 49.53 180)
    (effects (font (size 1.27 1.27)) (justify right bottom))
    (uuid 89c3aa50-ab6d-44a9-8681-2ed341d21e06)
  )
  (label "PC14" (at 33.02 59.69 0)
    (effects (font (size 1.27 1.27)) (justify left bottom))
    (uuid 8bdba65a-c69f-4b59-9e18-d61b8a9de425)
  )
  (label "IN3" (at 74.93 80.01 270)
    (effects (font (size 1.27 1.27)) (justify right bottom))
    (uuid 93fbd7d1-4ef2-499c-af3e-3228c921ae6c)
  )
  (label "USART2_RX_MAX3485" (at 21.59 39.37 0)
    (effects (font (size 1.27 1.27)) (justify left bottom))
    (uuid 9aefe91e-a9db-4232-a976-c4d49f29fcbe)
  )
  (label "USART3_RX_CONSOLE" (at 135.89 41.91 180)
    (effects (font (size 1.27 1.27)) (justify right bottom))
    (uuid 9f56350c-1b7b-492f-ac5b-940dd6713cb7)
  )
  (label "PC15" (at 123.19 59.69 180)
    (effects (font (size 1.27 1.27)) (justify right bottom))
    (uuid a25ed553-81af-49f5-a388-4f7c851f3d96)
  )
  (label "I2C2_SDA_MMC5603NJ" (at 137.16 39.37 180)
    (effects (font (size 1.27 1.27)) (justify right bottom))
    (uuid b30dba60-975f-4d69-94f8-917a9085158b)
  )
  (label "SPI1_SCLK" (at 91.44 52.07 0)
    (effects (font (size 1.27 1.27)) (justify left bottom))
    (uuid b3570166-1eb5-47cc-bda3-0335e70196b1)
  )
  (label "IN10" (at 95.25 113.03 270)
    (effects (font (size 1.27 1.27)) (justify right bottom))
    (uuid b40bb0a1-cd95-49f9-8d7e-6eac55677292)
  )
  (label "USART1_RX_MAX3232" (at 21.59 52.07 0)
    (effects (font (size 1.27 1.27)) (justify left bottom))
    (uuid b5f274f0-ce5f-4fc8-a28f-e87baf87e63c)
  )
  (label "STATUS" (at 33.02 57.15 0)
    (effects (font (size 1.27 1.27)) (justify left bottom))
    (uuid bb34fb7a-6a43-4b73-b6a0-26b0e85a7c6c)
  )
  (label "PB1" (at 120.65 49.53 180)
    (effects (font (size 1.27 1.27)) (justify right bottom))
    (uuid c3c7a420-d41d-4091-bec0-fd121b50a1ab)
  )
  (label "PC14" (at 49.53 93.98 180)
    (effects (font (size 1.27 1.27)) (justify right bottom))
    (uuid c4fa5d41-49cf-4348-89ba-60556eef4eab)
  )
  (label "IN7" (at 185.42 35.56 0)
    (effects (font (size 1.27 1.27)) (justify left bottom))
    (uuid da87bd09-0172-4d30-8c09-3fee10290361)
  )
  (label "PA10" (at 35.56 36.83 0)
    (effects (font (size 1.27 1.27)) (justify left bottom))
    (uuid da9119c2-264e-4018-bbb0-18c2caf823f5)
  )
  (label "IN5" (at 158.75 43.18 0)
    (effects (font (size 1.27 1.27)) (justify left bottom))
    (uuid de568af2-d74c-4fce-9ed0-59cd254dfc5a)
  )
  (label "PA0" (at 152.4 93.98 180)
    (effects (font (size 1.27 1.27)) (justify right bottom))
    (uuid e205d52e-ebcf-488e-b7f9-e9e42a692180)
  )
  (label "IN6" (at 135.89 80.01 270)
    (effects (font (size 1.27 1.27)) (justify right bottom))
    (uuid e582fd5a-8f1e-4885-939e-2dce2d59d3e7)
  )
  (label "SPI1_SDO" (at 91.44 49.53 0)
    (effects (font (size 1.27 1.27)) (justify left bottom))
    (uuid e5d27ff7-c13f-448d-b409-571fceb0409a)
  )
  (label "IN8" (at 185.42 38.1 0)
    (effects (font (size 1.27 1.27)) (justify left bottom))
    (uuid f490990f-e8af-40d7-8ec2-1d368e49b257)
  )
  (label "PB3" (at 91.44 93.98 180)
    (effects (font (size 1.27 1.27)) (justify right bottom))
    (uuid ff3dcd72-f1e7-4a38-8a31-19ef96520505)
  )

  (symbol (lib_id "power:GND") (at 114.3 102.87 0) (unit 1)
    (in_bom yes) (on_board yes) (fields_autoplaced)
    (uuid 071cb745-1ebb-4324-8463-54216feb753b)
    (property "Reference" "#PWR0107" (id 0) (at 114.3 109.22 0)
      (effects (font (size 1.27 1.27)) hide)
    )
    (property "Value" "GND" (id 1) (at 114.3 107.95 0))
    (property "Footprint" "" (id 2) (at 114.3 102.87 0)
      (effects (font (size 1.27 1.27)) hide)
    )
    (property "Datasheet" "" (id 3) (at 114.3 102.87 0)
      (effects (font (size 1.27 1.27)) hide)
    )
    (pin "1" (uuid d8e19509-a3e0-4d60-acb9-d56d373ed0dc))
  )

  (symbol (lib_id "Device:R") (at 74.93 132.08 0) (unit 1)
    (in_bom yes) (on_board yes) (fields_autoplaced)
    (uuid 0e359ad9-ba74-4f3d-aa62-fd2550c64a99)
    (property "Reference" "R12" (id 0) (at 77.47 130.8099 0)
      (effects (font (size 1.27 1.27)) (justify left))
    )
    (property "Value" "R" (id 1) (at 77.47 133.3499 0)
      (effects (font (size 1.27 1.27)) (justify left))
    )
    (property "Footprint" "Resistor_SMD:R_0805_2012Metric" (id 2) (at 73.152 132.08 90)
      (effects (font (size 1.27 1.27)) hide)
    )
    (property "Datasheet" "~" (id 3) (at 74.93 132.08 0)
      (effects (font (size 1.27 1.27)) hide)
    )
    (pin "1" (uuid 9cdf143b-9426-4e30-aa2f-6eae8139d23d))
    (pin "2" (uuid 8ed82cbc-dd8b-4418-9927-9d26611c168c))
  )

  (symbol (lib_id "Device:R") (at 54.61 99.06 0) (unit 1)
    (in_bom yes) (on_board yes) (fields_autoplaced)
    (uuid 16b015e8-f8f0-4c3e-b5be-ce2284478a48)
    (property "Reference" "R6" (id 0) (at 57.15 97.7899 0)
      (effects (font (size 1.27 1.27)) (justify left))
    )
    (property "Value" "R" (id 1) (at 57.15 100.3299 0)
      (effects (font (size 1.27 1.27)) (justify left))
    )
    (property "Footprint" "Resistor_SMD:R_0805_2012Metric" (id 2) (at 52.832 99.06 90)
      (effects (font (size 1.27 1.27)) hide)
    )
    (property "Datasheet" "~" (id 3) (at 54.61 99.06 0)
      (effects (font (size 1.27 1.27)) hide)
    )
    (pin "1" (uuid 0fe58ae4-741e-4d74-a65e-2aa25142bb80))
    (pin "2" (uuid e548d07e-835c-4e14-ac9c-0ccdcd1d28e7))
  )

  (symbol (lib_id "Device:R") (at 33.02 121.92 0) (unit 1)
    (in_bom yes) (on_board yes) (fields_autoplaced)
    (uuid 198c1eee-887a-4a0e-afe8-c95d3824b10a)
    (property "Reference" "R3" (id 0) (at 35.56 120.6499 0)
      (effects (font (size 1.27 1.27)) (justify left))
    )
    (property "Value" "R" (id 1) (at 35.56 123.1899 0)
      (effects (font (size 1.27 1.27)) (justify left))
    )
    (property "Footprint" "Resistor_SMD:R_0805_2012Metric" (id 2) (at 31.242 121.92 90)
      (effects (font (size 1.27 1.27)) hide)
    )
    (property "Datasheet" "~" (id 3) (at 33.02 121.92 0)
      (effects (font (size 1.27 1.27)) hide)
    )
    (pin "1" (uuid 49c07e00-4058-4649-8f1b-95ff70a08067))
    (pin "2" (uuid 4f0c6486-5f55-4678-a797-47d7d0fd404f))
  )

  (symbol (lib_id "power:GND") (at 54.61 102.87 0) (unit 1)
    (in_bom yes) (on_board yes) (fields_autoplaced)
    (uuid 2013c523-60bd-4d96-b97e-8e5be5679c9b)
    (property "Reference" "#PWR0111" (id 0) (at 54.61 109.22 0)
      (effects (font (size 1.27 1.27)) hide)
    )
    (property "Value" "GND" (id 1) (at 54.61 107.95 0))
    (property "Footprint" "" (id 2) (at 54.61 102.87 0)
      (effects (font (size 1.27 1.27)) hide)
    )
    (property "Datasheet" "" (id 3) (at 54.61 102.87 0)
      (effects (font (size 1.27 1.27)) hide)
    )
    (pin "1" (uuid 37805910-e198-48fa-ad9b-540e881c9410))
  )

  (symbol (lib_id "power:GND") (at 95.25 135.89 0) (unit 1)
    (in_bom yes) (on_board yes) (fields_autoplaced)
    (uuid 2a3dfe45-4b9b-45d5-93dd-97b5d7637976)
    (property "Reference" "#PWR0115" (id 0) (at 95.25 142.24 0)
      (effects (font (size 1.27 1.27)) hide)
    )
    (property "Value" "GND" (id 1) (at 95.25 140.97 0))
    (property "Footprint" "" (id 2) (at 95.25 135.89 0)
      (effects (font (size 1.27 1.27)) hide)
    )
    (property "Datasheet" "" (id 3) (at 95.25 135.89 0)
      (effects (font (size 1.27 1.27)) hide)
    )
    (pin "1" (uuid 3635bcae-a0b8-442d-9bc9-6b7f8eb3be80))
  )

  (symbol (lib_id "Device:R") (at 33.02 88.9 0) (unit 1)
    (in_bom yes) (on_board yes) (fields_autoplaced)
    (uuid 318cabd1-21a6-4adf-a422-848153f95040)
    (property "Reference" "R1" (id 0) (at 35.56 87.6299 0)
      (effects (font (size 1.27 1.27)) (justify left))
    )
    (property "Value" "R" (id 1) (at 35.56 90.1699 0)
      (effects (font (size 1.27 1.27)) (justify left))
    )
    (property "Footprint" "Resistor_SMD:R_0805_2012Metric" (id 2) (at 31.242 88.9 90)
      (effects (font (size 1.27 1.27)) hide)
    )
    (property "Datasheet" "~" (id 3) (at 33.02 88.9 0)
      (effects (font (size 1.27 1.27)) hide)
    )
    (pin "1" (uuid 6af50391-ed82-42cb-b54b-751e9be741c8))
    (pin "2" (uuid 2c0ca772-b928-44f9-ae27-4e49dc1c9c76))
  )

  (symbol (lib_id "Connector_Generic:Conn_02x10_Odd_Even") (at 46.99 46.99 0) (unit 1)
    (in_bom yes) (on_board yes) (fields_autoplaced)
    (uuid 328e85c9-86ec-4e4a-b7cb-b3eaccdaebda)
    (property "Reference" "MZ1" (id 0) (at 48.26 30.48 0))
    (property "Value" "Conn_02x10_Odd_Even" (id 1) (at 48.26 33.02 0))
    (property "Footprint" "Mezzanine:533072071" (id 2) (at 46.99 46.99 0)
      (effects (font (size 1.27 1.27)) hide)
    )
    (property "Datasheet" "~" (id 3) (at 46.99 46.99 0)
      (effects (font (size 1.27 1.27)) hide)
    )
    (pin "1" (uuid fb3761c2-b8c0-4057-9b2c-d8cbcc29d97c))
    (pin "10" (uuid 5f29e267-9089-4a37-ad4c-d48c4d8699fd))
    (pin "11" (uuid 1eb4d433-2cf8-4a48-bbbd-e666683d9a14))
    (pin "12" (uuid 99e313b7-aafc-4475-bc34-030cc6e7a52e))
    (pin "13" (uuid 003c5171-155a-40d4-86ac-504fe08a00ff))
    (pin "14" (uuid 581bffa7-3f4e-4756-8af6-0e3c447807cc))
    (pin "15" (uuid 7fafad82-49d5-40b5-b1c4-d99bcf720a01))
    (pin "16" (uuid 1ffea039-975a-468e-abc9-b4393ed5fd16))
    (pin "17" (uuid 02174d2f-516f-41c6-929f-ca3963eaf931))
    (pin "18" (uuid 4ae372a4-0638-4409-97fe-b67a7be5fcdb))
    (pin "19" (uuid 4240089b-9f32-47ab-b691-857b3f69fa5a))
    (pin "2" (uuid 5c60ab64-80db-43a6-8cac-afebce6a2361))
    (pin "20" (uuid 212d1a50-e2d0-4490-b2ad-bfafbd74d1b1))
    (pin "3" (uuid 18c4be8b-cd58-447e-b3a1-b03ca056d227))
    (pin "4" (uuid ae9a0f75-3a3c-400a-b605-aede2c888902))
    (pin "5" (uuid 63077d18-4dff-4766-b86b-733322058c35))
    (pin "6" (uuid 7b818112-f1a7-47c9-a57b-a124b74ac153))
    (pin "7" (uuid f24d350d-311e-4dc6-8382-8eebdbee6f3e))
    (pin "8" (uuid a889a7d3-865d-42c1-b273-09062a2de9fa))
    (pin "9" (uuid 7a227ee8-bd86-4d25-98aa-30242094cc80))
  )

  (symbol (lib_id "power:GND") (at 74.93 102.87 0) (unit 1)
    (in_bom yes) (on_board yes) (fields_autoplaced)
    (uuid 43894cdd-4751-49a6-b1d4-a84749a5ec7d)
    (property "Reference" "#PWR0106" (id 0) (at 74.93 109.22 0)
      (effects (font (size 1.27 1.27)) hide)
    )
    (property "Value" "GND" (id 1) (at 74.93 107.95 0))
    (property "Footprint" "" (id 2) (at 74.93 102.87 0)
      (effects (font (size 1.27 1.27)) hide)
    )
    (property "Datasheet" "" (id 3) (at 74.93 102.87 0)
      (effects (font (size 1.27 1.27)) hide)
    )
    (pin "1" (uuid e4612aaf-ae50-4d62-abe6-9391634918a6))
  )

  (symbol (lib_id "Device:R") (at 135.89 88.9 0) (unit 1)
    (in_bom yes) (on_board yes) (fields_autoplaced)
    (uuid 4d007882-e467-4dd1-94a7-1dcd20de2ef2)
    (property "Reference" "R19" (id 0) (at 138.43 87.6299 0)
      (effects (font (size 1.27 1.27)) (justify left))
    )
    (property "Value" "R" (id 1) (at 138.43 90.1699 0)
      (effects (font (size 1.27 1.27)) (justify left))
    )
    (property "Footprint" "Resistor_SMD:R_0805_2012Metric" (id 2) (at 134.112 88.9 90)
      (effects (font (size 1.27 1.27)) hide)
    )
    (property "Datasheet" "~" (id 3) (at 135.89 88.9 0)
      (effects (font (size 1.27 1.27)) hide)
    )
    (pin "1" (uuid 96b68f59-d48e-4fb0-a30b-6f835982007a))
    (pin "2" (uuid cbb8a262-53aa-44c7-9d82-5a90dbf9a21f))
  )

  (symbol (lib_id "power:GND") (at 135.89 102.87 0) (unit 1)
    (in_bom yes) (on_board yes) (fields_autoplaced)
    (uuid 61e38bc1-274c-44ac-9a9e-fc6e30db4dd2)
    (property "Reference" "#PWR0104" (id 0) (at 135.89 109.22 0)
      (effects (font (size 1.27 1.27)) hide)
    )
    (property "Value" "GND" (id 1) (at 135.89 107.95 0))
    (property "Footprint" "" (id 2) (at 135.89 102.87 0)
      (effects (font (size 1.27 1.27)) hide)
    )
    (property "Datasheet" "" (id 3) (at 135.89 102.87 0)
      (effects (font (size 1.27 1.27)) hide)
    )
    (pin "1" (uuid 97e4c037-167a-4c86-9b2c-695486dad482))
  )

  (symbol (lib_id "Device:R") (at 114.3 99.06 0) (unit 1)
    (in_bom yes) (on_board yes) (fields_autoplaced)
    (uuid 6810a9cc-aa21-4206-bfaf-0c42ca8e8bc8)
    (property "Reference" "R18" (id 0) (at 116.84 97.7899 0)
      (effects (font (size 1.27 1.27)) (justify left))
    )
    (property "Value" "R" (id 1) (at 116.84 100.3299 0)
      (effects (font (size 1.27 1.27)) (justify left))
    )
    (property "Footprint" "Resistor_SMD:R_0805_2012Metric" (id 2) (at 112.522 99.06 90)
      (effects (font (size 1.27 1.27)) hide)
    )
    (property "Datasheet" "~" (id 3) (at 114.3 99.06 0)
      (effects (font (size 1.27 1.27)) hide)
    )
    (pin "1" (uuid c1ec9cc7-b43d-416d-b3d3-a30185e9b109))
    (pin "2" (uuid b19510df-cd83-4ce2-ac5c-4b8103fa2d95))
  )

  (symbol (lib_id "power:GND") (at 158.75 46.99 0) (unit 1)
    (in_bom yes) (on_board yes) (fields_autoplaced)
    (uuid 6aa910e7-c152-4dcb-9b63-b10cd5e480a4)
    (property "Reference" "#PWR0116" (id 0) (at 158.75 53.34 0)
      (effects (font (size 1.27 1.27)) hide)
    )
    (property "Value" "GND" (id 1) (at 158.75 52.07 0))
    (property "Footprint" "" (id 2) (at 158.75 46.99 0)
      (effects (font (size 1.27 1.27)) hide)
    )
    (property "Datasheet" "" (id 3) (at 158.75 46.99 0)
      (effects (font (size 1.27 1.27)) hide)
    )
    (pin "1" (uuid 0179fee3-af4b-442d-9ee0-66fa832332f9))
  )

  (symbol (lib_id "Device:R") (at 54.61 132.08 0) (unit 1)
    (in_bom yes) (on_board yes) (fields_autoplaced)
    (uuid 6f38080b-fb04-433f-a0dc-4b5abf75dff7)
    (property "Reference" "R8" (id 0) (at 57.15 130.8099 0)
      (effects (font (size 1.27 1.27)) (justify left))
    )
    (property "Value" "R" (id 1) (at 57.15 133.3499 0)
      (effects (font (size 1.27 1.27)) (justify left))
    )
    (property "Footprint" "Resistor_SMD:R_0805_2012Metric" (id 2) (at 52.832 132.08 90)
      (effects (font (size 1.27 1.27)) hide)
    )
    (property "Datasheet" "~" (id 3) (at 54.61 132.08 0)
      (effects (font (size 1.27 1.27)) hide)
    )
    (pin "1" (uuid 509e6b55-ba1f-4111-9fcc-ba51ca46f938))
    (pin "2" (uuid a6f5b4d8-e689-4620-ab87-4fac23feb39a))
  )

  (symbol (lib_id "power:GND") (at 95.25 64.77 0) (unit 1)
    (in_bom yes) (on_board yes) (fields_autoplaced)
    (uuid 74bf09c0-2f62-4d4e-b41b-96487b1f5f59)
    (property "Reference" "#PWR0103" (id 0) (at 95.25 71.12 0)
      (effects (font (size 1.27 1.27)) hide)
    )
    (property "Value" "GND" (id 1) (at 95.25 69.85 0))
    (property "Footprint" "" (id 2) (at 95.25 64.77 0)
      (effects (font (size 1.27 1.27)) hide)
    )
    (property "Datasheet" "" (id 3) (at 95.25 64.77 0)
      (effects (font (size 1.27 1.27)) hide)
    )
    (pin "1" (uuid 2a22deb8-165c-4a42-a21d-8e3a1ca13088))
  )

  (symbol (lib_id "Device:R") (at 114.3 88.9 0) (unit 1)
    (in_bom yes) (on_board yes) (fields_autoplaced)
    (uuid 7a498cc3-e373-4a5d-8a6a-4b9bc5f6e918)
    (property "Reference" "R17" (id 0) (at 116.84 87.6299 0)
      (effects (font (size 1.27 1.27)) (justify left))
    )
    (property "Value" "R" (id 1) (at 116.84 90.1699 0)
      (effects (font (size 1.27 1.27)) (justify left))
    )
    (property "Footprint" "Resistor_SMD:R_0805_2012Metric" (id 2) (at 112.522 88.9 90)
      (effects (font (size 1.27 1.27)) hide)
    )
    (property "Datasheet" "~" (id 3) (at 114.3 88.9 0)
      (effects (font (size 1.27 1.27)) hide)
    )
    (pin "1" (uuid e6c98091-187d-43e8-9f51-86acf0806629))
    (pin "2" (uuid 35eccfc4-4d0d-4af3-9fd6-aa9a31df02ec))
  )

  (symbol (lib_id "Device:R") (at 95.25 132.08 0) (unit 1)
    (in_bom yes) (on_board yes) (fields_autoplaced)
    (uuid 7a81fe17-6c38-4dd7-baf9-0c5c1879b9ae)
    (property "Reference" "R16" (id 0) (at 97.79 130.8099 0)
      (effects (font (size 1.27 1.27)) (justify left))
    )
    (property "Value" "R" (id 1) (at 97.79 133.3499 0)
      (effects (font (size 1.27 1.27)) (justify left))
    )
    (property "Footprint" "Resistor_SMD:R_0805_2012Metric" (id 2) (at 93.472 132.08 90)
      (effects (font (size 1.27 1.27)) hide)
    )
    (property "Datasheet" "~" (id 3) (at 95.25 132.08 0)
      (effects (font (size 1.27 1.27)) hide)
    )
    (pin "1" (uuid 6f410a0b-bf38-4f44-b924-19960235998f))
    (pin "2" (uuid a5a88c09-0a7c-4817-9768-d1af4055eb3d))
  )

  (symbol (lib_id "Device:R") (at 74.93 121.92 0) (unit 1)
    (in_bom yes) (on_board yes) (fields_autoplaced)
    (uuid 7c01e0c7-70c2-4bcf-b985-2f09ce10cff8)
    (property "Reference" "R11" (id 0) (at 77.47 120.6499 0)
      (effects (font (size 1.27 1.27)) (justify left))
    )
    (property "Value" "R" (id 1) (at 77.47 123.1899 0)
      (effects (font (size 1.27 1.27)) (justify left))
    )
    (property "Footprint" "Resistor_SMD:R_0805_2012Metric" (id 2) (at 73.152 121.92 90)
      (effects (font (size 1.27 1.27)) hide)
    )
    (property "Datasheet" "~" (id 3) (at 74.93 121.92 0)
      (effects (font (size 1.27 1.27)) hide)
    )
    (pin "1" (uuid fb7e7706-06fd-4a79-a89e-0cc522d07814))
    (pin "2" (uuid 859c17ec-9bd9-4f21-9b4c-376bcfa445fb))
  )

  (symbol (lib_id "Device:R") (at 95.25 88.9 0) (unit 1)
    (in_bom yes) (on_board yes) (fields_autoplaced)
    (uuid 7c535447-7743-4e89-87a4-1283b2b16bdd)
    (property "Reference" "R13" (id 0) (at 97.79 87.6299 0)
      (effects (font (size 1.27 1.27)) (justify left))
    )
    (property "Value" "R" (id 1) (at 97.79 90.1699 0)
      (effects (font (size 1.27 1.27)) (justify left))
    )
    (property "Footprint" "Resistor_SMD:R_0805_2012Metric" (id 2) (at 93.472 88.9 90)
      (effects (font (size 1.27 1.27)) hide)
    )
    (property "Datasheet" "~" (id 3) (at 95.25 88.9 0)
      (effects (font (size 1.27 1.27)) hide)
    )
    (pin "1" (uuid cb1dba77-08e1-4f3a-a82a-637416c8ba63))
    (pin "2" (uuid 4bd454d4-74bd-45d1-a303-2adcbcc412e3))
  )

  (symbol (lib_id "Connector_Generic:Conn_01x06") (at 195.58 38.1 0) (unit 1)
    (in_bom yes) (on_board yes) (fields_autoplaced)
    (uuid 8181c3ac-f27a-44c9-bf07-a46efc39f757)
    (property "Reference" "J2" (id 0) (at 198.12 38.0999 0)
      (effects (font (size 1.27 1.27)) (justify left))
    )
    (property "Value" "Conn_01x06" (id 1) (at 198.12 40.6399 0)
      (effects (font (size 1.27 1.27)) (justify left))
    )
    (property "Footprint" "TerminalBlock_Phoenix:TerminalBlock_Phoenix_MKDS-3-6-5.08_1x06_P5.08mm_Horizontal" (id 2) (at 195.58 38.1 0)
      (effects (font (size 1.27 1.27)) hide)
    )
    (property "Datasheet" "~" (id 3) (at 195.58 38.1 0)
      (effects (font (size 1.27 1.27)) hide)
    )
    (pin "1" (uuid 46d842d7-b243-43d4-bef9-6a1d21bf25a0))
    (pin "2" (uuid c6d61938-1c90-4467-b4e6-c521acc993fb))
    (pin "3" (uuid e5571dfe-a734-4733-be1a-0e779fa81e5f))
    (pin "4" (uuid eba196bd-4b6f-4add-926d-c3571d4d5c21))
    (pin "5" (uuid d11b40be-05ab-4b9e-b631-410f543bdb97))
    (pin "6" (uuid 26307cbe-69b3-4577-8cdc-0c6b262fd97c))
  )

  (symbol (lib_id "power:+3V3") (at 95.25 35.56 0) (unit 1)
    (in_bom yes) (on_board yes) (fields_autoplaced)
    (uuid 84cf6df3-9c11-4185-ad8b-e8c9ebcf5a27)
    (property "Reference" "#PWR0102" (id 0) (at 95.25 39.37 0)
      (effects (font (size 1.27 1.27)) hide)
    )
    (property "Value" "+3V3" (id 1) (at 95.25 30.48 0))
    (property "Footprint" "" (id 2) (at 95.25 35.56 0)
      (effects (font (size 1.27 1.27)) hide)
    )
    (property "Datasheet" "" (id 3) (at 95.25 35.56 0)
      (effects (font (size 1.27 1.27)) hide)
    )
    (pin "1" (uuid e60ededd-3b37-43a8-8751-e3ac36a30b32))
  )

  (symbol (lib_id "Device:R") (at 95.25 121.92 0) (unit 1)
    (in_bom yes) (on_board yes) (fields_autoplaced)
    (uuid 960ab6bc-18e6-42b3-a3c4-7231f2d590d5)
    (property "Reference" "R15" (id 0) (at 97.79 120.6499 0)
      (effects (font (size 1.27 1.27)) (justify left))
    )
    (property "Value" "R" (id 1) (at 97.79 123.1899 0)
      (effects (font (size 1.27 1.27)) (justify left))
    )
    (property "Footprint" "Resistor_SMD:R_0805_2012Metric" (id 2) (at 93.472 121.92 90)
      (effects (font (size 1.27 1.27)) hide)
    )
    (property "Datasheet" "~" (id 3) (at 95.25 121.92 0)
      (effects (font (size 1.27 1.27)) hide)
    )
    (pin "1" (uuid 525a2fb2-bba6-4b72-b56a-4fa60b09b220))
    (pin "2" (uuid fedcfc60-5853-4235-a055-66d95b47969c))
  )

  (symbol (lib_id "power:GND") (at 54.61 135.89 0) (unit 1)
    (in_bom yes) (on_board yes) (fields_autoplaced)
    (uuid 9e467e4e-263b-4994-a7d5-323d8e60ff72)
    (property "Reference" "#PWR0113" (id 0) (at 54.61 142.24 0)
      (effects (font (size 1.27 1.27)) hide)
    )
    (property "Value" "GND" (id 1) (at 54.61 140.97 0))
    (property "Footprint" "" (id 2) (at 54.61 135.89 0)
      (effects (font (size 1.27 1.27)) hide)
    )
    (property "Datasheet" "" (id 3) (at 54.61 135.89 0)
      (effects (font (size 1.27 1.27)) hide)
    )
    (pin "1" (uuid 4e139fb7-6bbc-45a9-ad98-3bfa1341ede6))
  )

  (symbol (lib_id "Device:R") (at 33.02 132.08 0) (unit 1)
    (in_bom yes) (on_board yes) (fields_autoplaced)
    (uuid a2e6028a-ab8e-441c-9b94-5abb5de42a7a)
    (property "Reference" "R4" (id 0) (at 35.56 130.8099 0)
      (effects (font (size 1.27 1.27)) (justify left))
    )
    (property "Value" "R" (id 1) (at 35.56 133.3499 0)
      (effects (font (size 1.27 1.27)) (justify left))
    )
    (property "Footprint" "Resistor_SMD:R_0805_2012Metric" (id 2) (at 31.242 132.08 90)
      (effects (font (size 1.27 1.27)) hide)
    )
    (property "Datasheet" "~" (id 3) (at 33.02 132.08 0)
      (effects (font (size 1.27 1.27)) hide)
    )
    (pin "1" (uuid d2194385-17ba-4367-9051-9dc1fff78862))
    (pin "2" (uuid a91a01eb-a4da-4dc2-be29-21db7a161010))
  )

  (symbol (lib_id "Device:R") (at 54.61 88.9 0) (unit 1)
    (in_bom yes) (on_board yes) (fields_autoplaced)
    (uuid a6cad0c5-b73e-49ed-828b-b0c086d3bd08)
    (property "Reference" "R5" (id 0) (at 57.15 87.6299 0)
      (effects (font (size 1.27 1.27)) (justify left))
    )
    (property "Value" "R" (id 1) (at 57.15 90.1699 0)
      (effects (font (size 1.27 1.27)) (justify left))
    )
    (property "Footprint" "Resistor_SMD:R_0805_2012Metric" (id 2) (at 52.832 88.9 90)
      (effects (font (size 1.27 1.27)) hide)
    )
    (property "Datasheet" "~" (id 3) (at 54.61 88.9 0)
      (effects (font (size 1.27 1.27)) hide)
    )
    (pin "1" (uuid b6a79f97-e6c2-47fa-9213-84abd85a9895))
    (pin "2" (uuid 01a1fee0-7734-4ea2-98b3-7691ab3b4901))
  )

  (symbol (lib_id "Device:R") (at 54.61 121.92 0) (unit 1)
    (in_bom yes) (on_board yes) (fields_autoplaced)
    (uuid adb82922-0f5e-49ba-a548-4e585ef09c23)
    (property "Reference" "R7" (id 0) (at 57.15 120.6499 0)
      (effects (font (size 1.27 1.27)) (justify left))
    )
    (property "Value" "R" (id 1) (at 57.15 123.1899 0)
      (effects (font (size 1.27 1.27)) (justify left))
    )
    (property "Footprint" "Resistor_SMD:R_0805_2012Metric" (id 2) (at 52.832 121.92 90)
      (effects (font (size 1.27 1.27)) hide)
    )
    (property "Datasheet" "~" (id 3) (at 54.61 121.92 0)
      (effects (font (size 1.27 1.27)) hide)
    )
    (pin "1" (uuid 3ee1e3a8-6b71-4503-b529-f58368ed14d6))
    (pin "2" (uuid 3eabe1f2-9341-42b6-b2da-fd63d2e3507d))
  )

  (symbol (lib_id "power:+5V") (at 60.96 35.56 0) (mirror y) (unit 1)
    (in_bom yes) (on_board yes) (fields_autoplaced)
    (uuid b03c2972-ff06-4251-9c69-cc947baf9f74)
    (property "Reference" "#PWR0101" (id 0) (at 60.96 39.37 0)
      (effects (font (size 1.27 1.27)) hide)
    )
    (property "Value" "+5V" (id 1) (at 60.96 30.48 0))
    (property "Footprint" "" (id 2) (at 60.96 35.56 0)
      (effects (font (size 1.27 1.27)) hide)
    )
    (property "Datasheet" "" (id 3) (at 60.96 35.56 0)
      (effects (font (size 1.27 1.27)) hide)
    )
    (pin "1" (uuid 0f1fad00-a1d0-4d4f-ba99-1b75367f3142))
  )

  (symbol (lib_id "power:GND") (at 33.02 102.87 0) (unit 1)
    (in_bom yes) (on_board yes) (fields_autoplaced)
    (uuid b6cfd8d5-69e9-4a4c-8433-3def68277ff4)
    (property "Reference" "#PWR0110" (id 0) (at 33.02 109.22 0)
      (effects (font (size 1.27 1.27)) hide)
    )
    (property "Value" "GND" (id 1) (at 33.02 107.95 0))
    (property "Footprint" "" (id 2) (at 33.02 102.87 0)
      (effects (font (size 1.27 1.27)) hide)
    )
    (property "Datasheet" "" (id 3) (at 33.02 102.87 0)
      (effects (font (size 1.27 1.27)) hide)
    )
    (pin "1" (uuid d8eb6966-e021-4ce1-b691-a766f728e89b))
  )

  (symbol (lib_id "Device:R") (at 95.25 99.06 0) (unit 1)
    (in_bom yes) (on_board yes) (fields_autoplaced)
    (uuid b8cb1ab9-ee60-4186-a8c7-6e5eb5780a5d)
    (property "Reference" "R14" (id 0) (at 97.79 97.7899 0)
      (effects (font (size 1.27 1.27)) (justify left))
    )
    (property "Value" "R" (id 1) (at 97.79 100.3299 0)
      (effects (font (size 1.27 1.27)) (justify left))
    )
    (property "Footprint" "Resistor_SMD:R_0805_2012Metric" (id 2) (at 93.472 99.06 90)
      (effects (font (size 1.27 1.27)) hide)
    )
    (property "Datasheet" "~" (id 3) (at 95.25 99.06 0)
      (effects (font (size 1.27 1.27)) hide)
    )
    (pin "1" (uuid 46b67dac-7e02-4292-a6c2-1e553ece4a05))
    (pin "2" (uuid ef9aa53b-c9b8-4f19-a854-e5c692591a30))
  )

  (symbol (lib_id "power:GND") (at 185.42 46.99 0) (unit 1)
    (in_bom yes) (on_board yes) (fields_autoplaced)
    (uuid bccac380-d775-48e5-8d0d-54c3ac7c0ccb)
    (property "Reference" "#PWR0118" (id 0) (at 185.42 53.34 0)
      (effects (font (size 1.27 1.27)) hide)
    )
    (property "Value" "GND" (id 1) (at 185.42 52.07 0))
    (property "Footprint" "" (id 2) (at 185.42 46.99 0)
      (effects (font (size 1.27 1.27)) hide)
    )
    (property "Datasheet" "" (id 3) (at 185.42 46.99 0)
      (effects (font (size 1.27 1.27)) hide)
    )
    (pin "1" (uuid ea0239b4-d046-4656-a339-368c6a04d8ba))
  )

  (symbol (lib_id "Connector_Generic:Conn_01x06") (at 168.91 38.1 0) (unit 1)
    (in_bom yes) (on_board yes) (fields_autoplaced)
    (uuid be65c98f-b09d-4723-bbbb-ce00209b0bf1)
    (property "Reference" "J1" (id 0) (at 171.45 38.0999 0)
      (effects (font (size 1.27 1.27)) (justify left))
    )
    (property "Value" "Conn_01x06" (id 1) (at 171.45 40.6399 0)
      (effects (font (size 1.27 1.27)) (justify left))
    )
    (property "Footprint" "TerminalBlock_Phoenix:TerminalBlock_Phoenix_MKDS-3-6-5.08_1x06_P5.08mm_Horizontal" (id 2) (at 168.91 38.1 0)
      (effects (font (size 1.27 1.27)) hide)
    )
    (property "Datasheet" "~" (id 3) (at 168.91 38.1 0)
      (effects (font (size 1.27 1.27)) hide)
    )
    (pin "1" (uuid a0bfe968-a3db-44f8-aaab-e6ceb915f1b8))
    (pin "2" (uuid 0e3af4a0-3390-4159-beb3-ea802b50d01c))
    (pin "3" (uuid abd91c48-df6d-426d-a196-4272a41d48fe))
    (pin "4" (uuid 00d3769f-0dba-4313-a512-32f766438a48))
    (pin "5" (uuid 4f879b14-d772-43ac-896e-420b3a4dff03))
    (pin "6" (uuid 460a2200-6253-460e-b669-acd663326ef4))
  )

  (symbol (lib_id "power:GND") (at 74.93 135.89 0) (unit 1)
    (in_bom yes) (on_board yes) (fields_autoplaced)
    (uuid d38f906d-9947-42b8-b1c7-0c931efff2fe)
    (property "Reference" "#PWR0114" (id 0) (at 74.93 142.24 0)
      (effects (font (size 1.27 1.27)) hide)
    )
    (property "Value" "GND" (id 1) (at 74.93 140.97 0))
    (property "Footprint" "" (id 2) (at 74.93 135.89 0)
      (effects (font (size 1.27 1.27)) hide)
    )
    (property "Datasheet" "" (id 3) (at 74.93 135.89 0)
      (effects (font (size 1.27 1.27)) hide)
    )
    (pin "1" (uuid 200aab3c-94f2-4db8-987e-636fd552369f))
  )

  (symbol (lib_id "power:GND") (at 58.42 62.23 0) (mirror y) (unit 1)
    (in_bom yes) (on_board yes) (fields_autoplaced)
    (uuid d5550c7a-ed9c-4aa3-b399-2d6ad8a08085)
    (property "Reference" "#PWR0105" (id 0) (at 58.42 68.58 0)
      (effects (font (size 1.27 1.27)) hide)
    )
    (property "Value" "GND" (id 1) (at 58.42 67.31 0))
    (property "Footprint" "" (id 2) (at 58.42 62.23 0)
      (effects (font (size 1.27 1.27)) hide)
    )
    (property "Datasheet" "" (id 3) (at 58.42 62.23 0)
      (effects (font (size 1.27 1.27)) hide)
    )
    (pin "1" (uuid 7172b4b1-8064-434b-a1e2-e54846117dab))
  )

  (symbol (lib_id "power:+BATT") (at 158.75 31.75 0) (unit 1)
    (in_bom yes) (on_board yes) (fields_autoplaced)
    (uuid d8bc0052-1d44-469f-b655-1cacf7da00ef)
    (property "Reference" "#PWR0117" (id 0) (at 158.75 35.56 0)
      (effects (font (size 1.27 1.27)) hide)
    )
    (property "Value" "+BATT" (id 1) (at 158.75 26.67 0))
    (property "Footprint" "" (id 2) (at 158.75 31.75 0)
      (effects (font (size 1.27 1.27)) hide)
    )
    (property "Datasheet" "" (id 3) (at 158.75 31.75 0)
      (effects (font (size 1.27 1.27)) hide)
    )
    (pin "1" (uuid 013f5a0f-5820-45bf-8789-101e2bbc9542))
  )

  (symbol (lib_id "Device:R") (at 33.02 99.06 0) (unit 1)
    (in_bom yes) (on_board yes) (fields_autoplaced)
    (uuid dd2ace97-a2a6-4f79-b85c-3efe48cbbdc1)
    (property "Reference" "R2" (id 0) (at 35.56 97.7899 0)
      (effects (font (size 1.27 1.27)) (justify left))
    )
    (property "Value" "R" (id 1) (at 35.56 100.3299 0)
      (effects (font (size 1.27 1.27)) (justify left))
    )
    (property "Footprint" "Resistor_SMD:R_0805_2012Metric" (id 2) (at 31.242 99.06 90)
      (effects (font (size 1.27 1.27)) hide)
    )
    (property "Datasheet" "~" (id 3) (at 33.02 99.06 0)
      (effects (font (size 1.27 1.27)) hide)
    )
    (pin "1" (uuid 9774b6cc-1b81-46e8-bb27-577efdc73959))
    (pin "2" (uuid e13dfe86-5eb8-4955-84b1-db632867a4a9))
  )

  (symbol (lib_id "power:GND") (at 33.02 135.89 0) (unit 1)
    (in_bom yes) (on_board yes) (fields_autoplaced)
    (uuid dde40fc5-ee19-4d48-aaff-b866c4b6e813)
    (property "Reference" "#PWR0112" (id 0) (at 33.02 142.24 0)
      (effects (font (size 1.27 1.27)) hide)
    )
    (property "Value" "GND" (id 1) (at 33.02 140.97 0))
    (property "Footprint" "" (id 2) (at 33.02 135.89 0)
      (effects (font (size 1.27 1.27)) hide)
    )
    (property "Datasheet" "" (id 3) (at 33.02 135.89 0)
      (effects (font (size 1.27 1.27)) hide)
    )
    (pin "1" (uuid 99c2c21a-35fe-44ad-86dc-1cf590bd61b6))
  )

  (symbol (lib_id "Device:R") (at 74.93 88.9 0) (unit 1)
    (in_bom yes) (on_board yes) (fields_autoplaced)
    (uuid e463e3d3-5ffe-4932-93e3-30a3e350ef50)
    (property "Reference" "R9" (id 0) (at 77.47 87.6299 0)
      (effects (font (size 1.27 1.27)) (justify left))
    )
    (property "Value" "R" (id 1) (at 77.47 90.1699 0)
      (effects (font (size 1.27 1.27)) (justify left))
    )
    (property "Footprint" "Resistor_SMD:R_0805_2012Metric" (id 2) (at 73.152 88.9 90)
      (effects (font (size 1.27 1.27)) hide)
    )
    (property "Datasheet" "~" (id 3) (at 74.93 88.9 0)
      (effects (font (size 1.27 1.27)) hide)
    )
    (pin "1" (uuid b4ecf1c5-c14b-4e5d-a7a5-3a6ca8f48457))
    (pin "2" (uuid 579ff693-e34e-4a00-bcde-393f2adcab08))
  )

  (symbol (lib_id "power:+BATT") (at 33.02 85.09 0) (unit 1)
    (in_bom yes) (on_board yes) (fields_autoplaced)
    (uuid e9860afa-a82c-4c0a-8d23-eee54c2aed22)
    (property "Reference" "#PWR0109" (id 0) (at 33.02 88.9 0)
      (effects (font (size 1.27 1.27)) hide)
    )
    (property "Value" "+BATT" (id 1) (at 33.02 80.01 0))
    (property "Footprint" "" (id 2) (at 33.02 85.09 0)
      (effects (font (size 1.27 1.27)) hide)
    )
    (property "Datasheet" "" (id 3) (at 33.02 85.09 0)
      (effects (font (size 1.27 1.27)) hide)
    )
    (pin "1" (uuid ba5d2fbf-87ef-4c9e-8544-1a81d9f504e3))
  )

  (symbol (lib_id "power:GND") (at 95.25 102.87 0) (unit 1)
    (in_bom yes) (on_board yes) (fields_autoplaced)
    (uuid e9c469c7-cf6f-4195-a365-ccd2ed26be81)
    (property "Reference" "#PWR0108" (id 0) (at 95.25 109.22 0)
      (effects (font (size 1.27 1.27)) hide)
    )
    (property "Value" "GND" (id 1) (at 95.25 107.95 0))
    (property "Footprint" "" (id 2) (at 95.25 102.87 0)
      (effects (font (size 1.27 1.27)) hide)
    )
    (property "Datasheet" "" (id 3) (at 95.25 102.87 0)
      (effects (font (size 1.27 1.27)) hide)
    )
    (pin "1" (uuid e232daee-1b32-4302-b090-eb12a41d568a))
  )

  (symbol (lib_id "Device:R") (at 135.89 99.06 0) (unit 1)
    (in_bom yes) (on_board yes) (fields_autoplaced)
    (uuid ea85fe91-2e14-4faf-bbb0-90423d2ca050)
    (property "Reference" "R20" (id 0) (at 138.43 97.7899 0)
      (effects (font (size 1.27 1.27)) (justify left))
    )
    (property "Value" "R" (id 1) (at 138.43 100.3299 0)
      (effects (font (size 1.27 1.27)) (justify left))
    )
    (property "Footprint" "Resistor_SMD:R_0805_2012Metric" (id 2) (at 134.112 99.06 90)
      (effects (font (size 1.27 1.27)) hide)
    )
    (property "Datasheet" "~" (id 3) (at 135.89 99.06 0)
      (effects (font (size 1.27 1.27)) hide)
    )
    (pin "1" (uuid b22832a7-ceb7-4431-af7c-0786a58967a1))
    (pin "2" (uuid 4827798a-a76f-4bba-bc6c-e4036ecfb789))
  )

  (symbol (lib_id "Device:R") (at 74.93 99.06 0) (unit 1)
    (in_bom yes) (on_board yes) (fields_autoplaced)
    (uuid f02f09f6-1440-4f85-b540-a97f56489e3f)
    (property "Reference" "R10" (id 0) (at 77.47 97.7899 0)
      (effects (font (size 1.27 1.27)) (justify left))
    )
    (property "Value" "R" (id 1) (at 77.47 100.3299 0)
      (effects (font (size 1.27 1.27)) (justify left))
    )
    (property "Footprint" "Resistor_SMD:R_0805_2012Metric" (id 2) (at 73.152 99.06 90)
      (effects (font (size 1.27 1.27)) hide)
    )
    (property "Datasheet" "~" (id 3) (at 74.93 99.06 0)
      (effects (font (size 1.27 1.27)) hide)
    )
    (pin "1" (uuid 5198e06c-0920-4709-847c-8c76c7bfc02a))
    (pin "2" (uuid 2a221727-af2d-434f-927e-2c8b66822790))
  )

  (symbol (lib_id "Connector_Generic:Conn_02x10_Odd_Even") (at 106.68 46.99 0) (unit 1)
    (in_bom yes) (on_board yes) (fields_autoplaced)
    (uuid fd90c046-14c1-4a14-8b60-9eede237e6d5)
    (property "Reference" "MZ2" (id 0) (at 107.95 30.48 0))
    (property "Value" "Conn_02x10_Odd_Even" (id 1) (at 107.95 33.02 0))
    (property "Footprint" "Mezzanine:533072071" (id 2) (at 106.68 46.99 0)
      (effects (font (size 1.27 1.27)) hide)
    )
    (property "Datasheet" "~" (id 3) (at 106.68 46.99 0)
      (effects (font (size 1.27 1.27)) hide)
    )
    (pin "1" (uuid cffc698e-aede-4a87-bb7e-0c8db137f22c))
    (pin "10" (uuid a77505f4-59d3-4f91-9eae-ee388d5c3fee))
    (pin "11" (uuid 751471fb-35c0-4a3b-8585-b0b4eb6f203e))
    (pin "12" (uuid 08bbd589-a8ae-4938-ab95-6af36b207b4b))
    (pin "13" (uuid 419ddfb2-dfa0-4e5b-80ba-7f6c77de1c5d))
    (pin "14" (uuid a8b21096-fecb-454e-81fb-f88d8c4dd71c))
    (pin "15" (uuid 2cf54fbe-a580-480e-b457-594a58b87573))
    (pin "16" (uuid 602acd8d-2714-40f5-a447-ccaf3f60483e))
    (pin "17" (uuid 5f73df79-24c5-4cc4-bd87-3b3521f24609))
    (pin "18" (uuid 5602a395-9aab-491d-bb87-a125d90d5890))
    (pin "19" (uuid efa7e088-3fdc-4061-96ff-eafe78a1df2b))
    (pin "2" (uuid 05bedd0d-7f8b-4b0b-a644-592aee338d69))
    (pin "20" (uuid 91c7d58d-669e-4c1d-ab99-e81c022d4e1d))
    (pin "3" (uuid 7e469f1a-6fd7-4bfc-80ba-5794d3e9fa28))
    (pin "4" (uuid 5368a8ec-9909-4712-a5ae-4ea12a33b6a8))
    (pin "5" (uuid 06005c15-5207-42c9-b571-dd4db8889720))
    (pin "6" (uuid 7afdb1fb-4735-4677-a9de-05454fd3f211))
    (pin "7" (uuid b3d431c2-9961-4364-8a79-48c23fa09fae))
    (pin "8" (uuid 5015d102-8202-44d1-a8e2-380c3ba28385))
    (pin "9" (uuid 89b5a2e7-7515-453a-9e60-593d2ad0022b))
  )

  (sheet_instances
    (path "/" (page "1"))
  )

  (symbol_instances
    (path "/b03c2972-ff06-4251-9c69-cc947baf9f74"
      (reference "#PWR0101") (unit 1) (value "+5V") (footprint "")
    )
    (path "/84cf6df3-9c11-4185-ad8b-e8c9ebcf5a27"
      (reference "#PWR0102") (unit 1) (value "+3V3") (footprint "")
    )
    (path "/74bf09c0-2f62-4d4e-b41b-96487b1f5f59"
      (reference "#PWR0103") (unit 1) (value "GND") (footprint "")
    )
    (path "/61e38bc1-274c-44ac-9a9e-fc6e30db4dd2"
      (reference "#PWR0104") (unit 1) (value "GND") (footprint "")
    )
    (path "/d5550c7a-ed9c-4aa3-b399-2d6ad8a08085"
      (reference "#PWR0105") (unit 1) (value "GND") (footprint "")
    )
    (path "/43894cdd-4751-49a6-b1d4-a84749a5ec7d"
      (reference "#PWR0106") (unit 1) (value "GND") (footprint "")
    )
    (path "/071cb745-1ebb-4324-8463-54216feb753b"
      (reference "#PWR0107") (unit 1) (value "GND") (footprint "")
    )
    (path "/e9c469c7-cf6f-4195-a365-ccd2ed26be81"
      (reference "#PWR0108") (unit 1) (value "GND") (footprint "")
    )
    (path "/e9860afa-a82c-4c0a-8d23-eee54c2aed22"
      (reference "#PWR0109") (unit 1) (value "+BATT") (footprint "")
    )
    (path "/b6cfd8d5-69e9-4a4c-8433-3def68277ff4"
      (reference "#PWR0110") (unit 1) (value "GND") (footprint "")
    )
    (path "/2013c523-60bd-4d96-b97e-8e5be5679c9b"
      (reference "#PWR0111") (unit 1) (value "GND") (footprint "")
    )
    (path "/dde40fc5-ee19-4d48-aaff-b866c4b6e813"
      (reference "#PWR0112") (unit 1) (value "GND") (footprint "")
    )
    (path "/9e467e4e-263b-4994-a7d5-323d8e60ff72"
      (reference "#PWR0113") (unit 1) (value "GND") (footprint "")
    )
    (path "/d38f906d-9947-42b8-b1c7-0c931efff2fe"
      (reference "#PWR0114") (unit 1) (value "GND") (footprint "")
    )
    (path "/2a3dfe45-4b9b-45d5-93dd-97b5d7637976"
      (reference "#PWR0115") (unit 1) (value "GND") (footprint "")
    )
    (path "/6aa910e7-c152-4dcb-9b63-b10cd5e480a4"
      (reference "#PWR0116") (unit 1) (value "GND") (footprint "")
    )
    (path "/d8bc0052-1d44-469f-b655-1cacf7da00ef"
      (reference "#PWR0117") (unit 1) (value "+BATT") (footprint "")
    )
    (path "/bccac380-d775-48e5-8d0d-54c3ac7c0ccb"
      (reference "#PWR0118") (unit 1) (value "GND") (footprint "")
    )
    (path "/be65c98f-b09d-4723-bbbb-ce00209b0bf1"
      (reference "J1") (unit 1) (value "Conn_01x06") (footprint "TerminalBlock_Phoenix:TerminalBlock_Phoenix_MKDS-3-6-5.08_1x06_P5.08mm_Horizontal")
    )
    (path "/8181c3ac-f27a-44c9-bf07-a46efc39f757"
      (reference "J2") (unit 1) (value "Conn_01x06") (footprint "TerminalBlock_Phoenix:TerminalBlock_Phoenix_MKDS-3-6-5.08_1x06_P5.08mm_Horizontal")
    )
    (path "/328e85c9-86ec-4e4a-b7cb-b3eaccdaebda"
      (reference "MZ1") (unit 1) (value "Conn_02x10_Odd_Even") (footprint "Mezzanine:533072071")
    )
    (path "/fd90c046-14c1-4a14-8b60-9eede237e6d5"
      (reference "MZ2") (unit 1) (value "Conn_02x10_Odd_Even") (footprint "Mezzanine:533072071")
    )
    (path "/318cabd1-21a6-4adf-a422-848153f95040"
      (reference "R1") (unit 1) (value "R") (footprint "Resistor_SMD:R_0805_2012Metric")
    )
    (path "/dd2ace97-a2a6-4f79-b85c-3efe48cbbdc1"
      (reference "R2") (unit 1) (value "R") (footprint "Resistor_SMD:R_0805_2012Metric")
    )
    (path "/198c1eee-887a-4a0e-afe8-c95d3824b10a"
      (reference "R3") (unit 1) (value "R") (footprint "Resistor_SMD:R_0805_2012Metric")
    )
    (path "/a2e6028a-ab8e-441c-9b94-5abb5de42a7a"
      (reference "R4") (unit 1) (value "R") (footprint "Resistor_SMD:R_0805_2012Metric")
    )
    (path "/a6cad0c5-b73e-49ed-828b-b0c086d3bd08"
      (reference "R5") (unit 1) (value "R") (footprint "Resistor_SMD:R_0805_2012Metric")
    )
    (path "/16b015e8-f8f0-4c3e-b5be-ce2284478a48"
      (reference "R6") (unit 1) (value "R") (footprint "Resistor_SMD:R_0805_2012Metric")
    )
    (path "/adb82922-0f5e-49ba-a548-4e585ef09c23"
      (reference "R7") (unit 1) (value "R") (footprint "Resistor_SMD:R_0805_2012Metric")
    )
    (path "/6f38080b-fb04-433f-a0dc-4b5abf75dff7"
      (reference "R8") (unit 1) (value "R") (footprint "Resistor_SMD:R_0805_2012Metric")
    )
    (path "/e463e3d3-5ffe-4932-93e3-30a3e350ef50"
      (reference "R9") (unit 1) (value "R") (footprint "Resistor_SMD:R_0805_2012Metric")
    )
    (path "/f02f09f6-1440-4f85-b540-a97f56489e3f"
      (reference "R10") (unit 1) (value "R") (footprint "Resistor_SMD:R_0805_2012Metric")
    )
    (path "/7c01e0c7-70c2-4bcf-b985-2f09ce10cff8"
      (reference "R11") (unit 1) (value "R") (footprint "Resistor_SMD:R_0805_2012Metric")
    )
    (path "/0e359ad9-ba74-4f3d-aa62-fd2550c64a99"
      (reference "R12") (unit 1) (value "R") (footprint "Resistor_SMD:R_0805_2012Metric")
    )
    (path "/7c535447-7743-4e89-87a4-1283b2b16bdd"
      (reference "R13") (unit 1) (value "R") (footprint "Resistor_SMD:R_0805_2012Metric")
    )
    (path "/b8cb1ab9-ee60-4186-a8c7-6e5eb5780a5d"
      (reference "R14") (unit 1) (value "R") (footprint "Resistor_SMD:R_0805_2012Metric")
    )
    (path "/960ab6bc-18e6-42b3-a3c4-7231f2d590d5"
      (reference "R15") (unit 1) (value "R") (footprint "Resistor_SMD:R_0805_2012Metric")
    )
    (path "/7a81fe17-6c38-4dd7-baf9-0c5c1879b9ae"
      (reference "R16") (unit 1) (value "R") (footprint "Resistor_SMD:R_0805_2012Metric")
    )
    (path "/7a498cc3-e373-4a5d-8a6a-4b9bc5f6e918"
      (reference "R17") (unit 1) (value "R") (footprint "Resistor_SMD:R_0805_2012Metric")
    )
    (path "/6810a9cc-aa21-4206-bfaf-0c42ca8e8bc8"
      (reference "R18") (unit 1) (value "R") (footprint "Resistor_SMD:R_0805_2012Metric")
    )
    (path "/4d007882-e467-4dd1-94a7-1dcd20de2ef2"
      (reference "R19") (unit 1) (value "R") (footprint "Resistor_SMD:R_0805_2012Metric")
    )
    (path "/ea85fe91-2e14-4faf-bbb0-90423d2ca050"
      (reference "R20") (unit 1) (value "R") (footprint "Resistor_SMD:R_0805_2012Metric")
    )
  )
)
