M48
; DRILL file {KiCad (5.99.0-11022-g0527dc6fe0)} date Sat Oct 16 17:35:24 2021
; FORMAT={-:-/ absolute / inch / decimal}
; #@! TF.CreationDate,2021-10-16T17:35:24-07:00
; #@! TF.GenerationSoftware,Kicad,Pcbnew,(5.99.0-11022-g0527dc6fe0)
; #@! TF.FileFunction,Plated,1,2,PTH
FMAT,2
INCH
; #@! TA.AperFunction,Plated,PTH,ViaDrill
T1C0.0118
; #@! TA.AperFunction,Plated,PTH,ViaDrill
T2C0.0157
; #@! TA.AperFunction,Plated,PTH,ComponentDrill
T3C0.0394
; #@! TA.AperFunction,Plated,PTH,ComponentDrill
T4C0.0598
%
G90
G05
T1
X4.4783Y-3.0157
X4.5591Y-2.9724
X4.5864Y-2.8113
X4.6398Y-2.6575
X4.6437Y-2.9803
X4.6796Y-2.9512
X4.7382Y-1.9547
X4.7441Y-1.8189
X4.764Y-1.8506
X4.7972Y-2.9508
X4.8228Y-2.9862
X4.8268Y-2.124
X4.8346Y-2.6929
X4.876Y-2.4596
X4.8821Y-2.4973
X4.9134Y-2.6693
X4.918Y-2.4987
X4.9252Y-2.7835
X4.9626Y-2.4134
X4.9665Y-2.4823
X4.9667Y-2.5139
X4.9685Y-2.3189
X4.9724Y-2.7835
X4.9941Y-2.2244
X4.9961Y-2.6713
X5.0177Y-2.7028
X5.0492Y-2.436
X5.0511Y-2.497
X5.0517Y-2.527
X5.0528Y-2.2697
X5.1004Y-2.7756
X5.122Y-2.3898
X5.1496Y-2.6634
X5.1634Y-3.0
X5.1693Y-3.0295
X5.188Y-2.4956
X5.188Y-2.5281
X5.1909Y-3.0531
X5.2106Y-2.6339
X5.2146Y-2.7362
X5.251Y-2.5728
X5.252Y-2.7588
X5.2588Y-2.6378
X5.2667Y-2.4341
X5.2697Y-2.9134
X5.2795Y-2.4075
X5.2795Y-2.5803
X5.3123Y-2.7552
X5.315Y-3.2205
X5.3248Y-3.4094
X5.3405Y-2.5807
X5.3446Y-2.5498
X5.3532Y-2.2961
X5.3741Y-2.5498
X5.3825Y-2.293
X5.4012Y-2.5614
X5.4075Y-2.4055
X5.4143Y-2.6388
X5.4272Y-2.752
X5.4469Y-2.6831
X5.4567Y-3.4055
X5.4685Y-2.3051
X5.5Y-2.8484
X5.5059Y-2.6752
X5.5227Y-2.7896
X5.5236Y-2.3051
X5.5295Y-2.4449
X5.5315Y-2.4134
X5.5551Y-3.2106
X6.0709Y-2.2384
T2
X4.5217Y-2.6102
X4.7146Y-2.8819
X4.7402Y-2.3268
X4.8001Y-2.6564
X4.9301Y-2.8642
X4.9409Y-2.0276
X4.9783Y-1.6516
X4.9832Y-2.8976
X5.0197Y-1.9213
X5.0315Y-2.378
X5.0512Y-1.8494
X5.0541Y-3.2392
X5.1043Y-1.8917
X5.1407Y-1.9213
X5.1476Y-2.2362
X5.2283Y-1.9252
X5.2795Y-3.1811
X5.2795Y-3.5
X5.4055Y-1.9331
X5.4803Y-1.9291
X5.5098Y-1.8937
X5.5984Y-1.8917
X5.626Y-1.9291
X5.6349Y-2.8966
X5.6654Y-2.1555
X5.6654Y-3.0118
X5.6693Y-2.0276
X5.7047Y-2.9134
X5.7087Y-2.9685
X5.7126Y-1.9331
X5.7638Y-2.4429
X5.7992Y-2.3425
X5.8189Y-1.8209
X5.8543Y-1.8504
X5.878Y-2.0354
X6.2165Y-3.2106
X6.2205Y-3.2677
T3
X4.4488Y-2.1703
X4.4488Y-2.2703
X4.4488Y-2.3703
X4.4488Y-2.4703
X4.4488Y-2.5703
X4.4488Y-2.6703
X4.4488Y-2.7703
X4.4488Y-2.8703
X4.4488Y-3.1102
X4.5488Y-3.1102
X4.5945Y-2.273
X4.5945Y-2.373
X4.6488Y-3.1102
X4.7488Y-3.1102
X4.8488Y-3.1102
X4.9488Y-3.1102
X6.1811Y-2.0157
X6.1811Y-2.1157
X6.1811Y-2.2157
X6.1811Y-2.3157
X6.1811Y-2.5197
X6.1811Y-2.6197
X6.1811Y-2.7197
X6.1811Y-2.8197
X6.1811Y-2.9197
X6.1811Y-3.0197
X6.1811Y-3.1197
T4
X4.4835Y-1.7323
X4.4882Y-3.3858
X4.6835Y-1.7323
X4.6882Y-3.3858
X4.8835Y-1.7323
X4.8882Y-3.3858
X5.0835Y-1.7323
X5.0882Y-3.3858
X5.5465Y-1.7323
X5.5512Y-3.3858
X5.7465Y-1.7323
X5.7512Y-3.3858
X5.9465Y-1.7323
X5.9512Y-3.3858
X6.1465Y-1.7323
X6.1512Y-3.3858
T0
M30
