(module LOGO (layer F.Cu)
  (at 0 0)
(attr board_only exclude_from_pos_files exclude_from_bom)
 (fp_text reference "G***" (at 0 0) (layer F.SilkS)
  (effects (font (thickness 0.3)))
  )
  (fp_text value "LOGO" (at 0.75 0) (layer F.SilkS) hide
  (effects (font (thickness 0.3)))
  )
  (fp_poly (pts (xy 2.009944 2.009944) (xy -1.992156 2.009944) (xy -1.992156 1.111695) (xy -1.760924 1.111695) (xy -1.752030 1.120589) (xy -1.743137 1.111695) (xy -1.752030 1.102801) (xy -1.760924 1.111695)
     (xy -1.992156 1.111695) (xy -1.992156 1.093908) (xy -1.725350 1.093908) (xy -1.716456 1.102801) (xy -1.707563 1.093908) (xy -1.716456 1.085014) (xy -1.725350 1.093908) (xy -1.992156 1.093908)
     (xy -1.992156 1.073156) (xy -1.683847 1.073156) (xy -1.681405 1.083731) (xy -1.671988 1.085014) (xy -1.657348 1.078506) (xy -1.660130 1.073156) (xy -1.681240 1.071028) (xy -1.683847 1.073156)
     (xy -1.992156 1.073156) (xy -1.992156 1.058334) (xy -1.636414 1.058334) (xy -1.627521 1.067227) (xy -1.618627 1.058334) (xy -1.627521 1.049440) (xy -1.636414 1.058334) (xy -1.992156 1.058334)
     (xy -1.992156 1.040547) (xy -1.600840 1.040547) (xy -1.591946 1.049440) (xy -1.583053 1.040547) (xy -1.591447 1.032152) (xy -1.564796 1.032152) (xy -1.540205 1.025529) (xy -1.495996 1.006247)
     (xy -1.480068 0.998404) (xy -1.419797 0.970352) (xy -1.333158 0.933160) (xy -1.226282 0.889185) (xy -1.105301 0.840789) (xy -0.976346 0.790330) (xy -0.845548 0.740168) (xy -0.719040 0.692662)
     (xy -0.602952 0.650172) (xy -0.503417 0.615058) (xy -0.426565 0.589679) (xy -0.391316 0.579426) (xy -0.307749 0.559147) (xy -0.223093 0.542109) (xy -0.132608 0.527849) (xy -0.031555 0.515908)
     (xy 0.084807 0.505826) (xy 0.221219 0.497143) (xy 0.382420 0.489398) (xy 0.573150 0.482132) (xy 0.631443 0.480156) (xy 0.859421 0.471969) (xy 1.055165 0.463421) (xy 1.222018 0.454110)
     (xy 1.363320 0.443634) (xy 1.482413 0.431590) (xy 1.582637 0.417579) (xy 1.667334 0.401198) (xy 1.739846 0.382045) (xy 1.803512 0.359720) (xy 1.861674 0.333820) (xy 1.865754 0.331798)
     (xy 1.932942 0.287359) (xy 1.965115 0.241450) (xy 1.973133 0.204030) (xy 1.960366 0.175450) (xy 1.934892 0.150971) (xy 1.876434 0.117311) (xy 1.786126 0.087814) (xy 1.667506 0.062986)
     (xy 1.524111 0.043335) (xy 1.359476 0.029367) (xy 1.177138 0.021591) (xy 1.022759 0.020159) (xy 0.928453 0.021584) (xy 0.843734 0.024670) (xy 0.776572 0.028998) (xy 0.734938 0.034150)
     (xy 0.729272 0.035575) (xy 0.684804 0.049816) (xy 0.731495 0.051589) (xy 0.816101 0.060274) (xy 0.869160 0.078395) (xy 0.889219 0.105430) (xy 0.889356 0.108254) (xy 0.905193 0.150375)
     (xy 0.945938 0.189832) (xy 1.001440 0.217919) (xy 1.024003 0.223746) (xy 1.089595 0.224511) (xy 1.134999 0.200916) (xy 1.155474 0.155831) (xy 1.156163 0.143720) (xy 1.156163 0.093032)
     (xy 1.276226 0.101174) (xy 1.374764 0.110624) (xy 1.480845 0.125367) (xy 1.584494 0.143588) (xy 1.675737 0.163476) (xy 1.744600 0.183218) (xy 1.760003 0.189091) (xy 1.799059 0.207096)
     (xy 1.808883 0.219285) (xy 1.793570 0.232283) (xy 1.788511 0.235191) (xy 1.749225 0.249286) (xy 1.680225 0.265609) (xy 1.587240 0.283328) (xy 1.475999 0.301615) (xy 1.352231 0.319639)
     (xy 1.221664 0.336572) (xy 1.090027 0.351583) (xy 0.963050 0.363842) (xy 0.846461 0.372521) (xy 0.835995 0.373137) (xy 0.667916 0.382427) (xy 0.506617 0.390697) (xy 0.355771 0.397809)
     (xy 0.219056 0.403625) (xy 0.100145 0.408008) (xy 0.002714 0.410820) (xy -0.069560 0.411923) (xy -0.113004 0.411180) (xy -0.124536 0.409104) (xy -0.110736 0.396101) (xy -0.073440 0.367881)
     (xy -0.018763 0.328942) (xy 0.031129 0.294623) (xy 0.137860 0.220631) (xy 0.265762 0.129391) (xy 0.408194 0.025833) (xy 0.558511 -0.085113) (xy 0.710072 -0.198516) (xy 0.856234 -0.309447)
     (xy 0.990354 -0.412975) (xy 0.996728 -0.417997) (xy 1.725351 -0.417997) (xy 1.734244 -0.409103) (xy 1.743138 -0.417997) (xy 1.734244 -0.426890) (xy 1.725351 -0.417997) (xy 0.996728 -0.417997)
     (xy 1.085014 -0.487553) (xy 1.175519 -0.559506) (xy 1.242256 -0.611553) (xy 1.289206 -0.646047) (xy 1.320353 -0.665340) (xy 1.339677 -0.671785) (xy 1.351162 -0.667735) (xy 1.358788 -0.655542)
     (xy 1.360947 -0.650583) (xy 1.398727 -0.587548) (xy 1.457609 -0.533874) (xy 1.544363 -0.483570) (xy 1.556373 -0.477759) (xy 1.611171 -0.453572) (xy 1.657238 -0.436479) (xy 1.689406 -0.427585)
     (xy 1.702512 -0.427997) (xy 1.691389 -0.438822) (xy 1.663212 -0.454872) (xy 1.572819 -0.511386) (xy 1.504439 -0.573499) (xy 1.466079 -0.631950) (xy 1.453033 -0.703511) (xy 1.468458 -0.789521)
     (xy 1.512858 -0.891645) (xy 1.576240 -0.996078) (xy 1.618001 -1.058757) (xy 1.653198 -1.112320) (xy 1.676312 -1.148338) (xy 1.681063 -1.156162) (xy 1.674411 -1.153883) (xy 1.646097 -1.130330)
     (xy 1.600019 -1.088970) (xy 1.540076 -1.033271) (xy 1.497154 -0.992576) (xy 1.413912 -0.914536) (xy 1.327768 -0.836937) (xy 1.235284 -0.756992) (xy 1.133018 -0.671913) (xy 1.017532 -0.578911)
     (xy 0.885384 -0.475199) (xy 0.733136 -0.357988) (xy 0.557348 -0.224491) (xy 0.444678 -0.139578) (xy 0.274879 -0.012378) (xy 0.128043 0.096118) (xy -0.000934 0.189059) (xy -0.117156 0.269599)
     (xy -0.225729 0.340888) (xy -0.331756 0.406076) (xy -0.440344 0.468316) (xy -0.556596 0.530759) (xy -0.685618 0.596556) (xy -0.832513 0.668857) (xy -0.981289 0.740687) (xy -1.113912 0.804485)
     (xy -1.236150 0.863485) (xy -1.344353 0.915911) (xy -1.434872 0.959985) (xy -1.504058 0.993933) (xy -1.548261 1.015976) (xy -1.563783 1.024267) (xy -1.564796 1.032152) (xy -1.591447 1.032152)
     (xy -1.591946 1.031653) (xy -1.600840 1.040547) (xy -1.992156 1.040547) (xy -1.992156 -1.992156) (xy 2.009944 -1.992156) )(layer F.SilkS) (width  0.000000)
  )
  (fp_poly (pts (xy 1.022791 0.075505) (xy 1.065632 0.097026) (xy 1.077104 0.107809) (xy 1.098406 0.136241) (xy 1.094456 0.153345) (xy 1.084307 0.160898) (xy 1.044261 0.176264) (xy 1.004810 0.164737)
     (xy 0.977432 0.145178) (xy 0.951900 0.115075) (xy 0.949831 0.091817) (xy 0.979560 0.073187) )(layer F.SilkS) (width  0.000000)
  )
)
