(kicad_sch (version 20211123) (generator eeschema)

  (uuid 3d8c1adf-e9c7-4fa3-b6a6-8700240e7952)

  (paper "A4")

  (lib_symbols
    (symbol "Connector_Generic:Conn_01x04" (pin_names (offset 1.016) hide) (in_bom yes) (on_board yes)
      (property "Reference" "J" (id 0) (at 0 5.08 0)
        (effects (font (size 1.27 1.27)))
      )
      (property "Value" "Conn_01x04" (id 1) (at 0 -7.62 0)
        (effects (font (size 1.27 1.27)))
      )
      (property "Footprint" "" (id 2) (at 0 0 0)
        (effects (font (size 1.27 1.27)) hide)
      )
      (property "Datasheet" "~" (id 3) (at 0 0 0)
        (effects (font (size 1.27 1.27)) hide)
      )
      (property "ki_keywords" "connector" (id 4) (at 0 0 0)
        (effects (font (size 1.27 1.27)) hide)
      )
      (property "ki_description" "Generic connector, single row, 01x04, script generated (kicad-library-utils/schlib/autogen/connector/)" (id 5) (at 0 0 0)
        (effects (font (size 1.27 1.27)) hide)
      )
      (property "ki_fp_filters" "Connector*:*_1x??_*" (id 6) (at 0 0 0)
        (effects (font (size 1.27 1.27)) hide)
      )
      (symbol "Conn_01x04_1_1"
        (rectangle (start -1.27 -4.953) (end 0 -5.207)
          (stroke (width 0.1524) (type default) (color 0 0 0 0))
          (fill (type none))
        )
        (rectangle (start -1.27 -2.413) (end 0 -2.667)
          (stroke (width 0.1524) (type default) (color 0 0 0 0))
          (fill (type none))
        )
        (rectangle (start -1.27 0.127) (end 0 -0.127)
          (stroke (width 0.1524) (type default) (color 0 0 0 0))
          (fill (type none))
        )
        (rectangle (start -1.27 2.667) (end 0 2.413)
          (stroke (width 0.1524) (type default) (color 0 0 0 0))
          (fill (type none))
        )
        (rectangle (start -1.27 3.81) (end 1.27 -6.35)
          (stroke (width 0.254) (type default) (color 0 0 0 0))
          (fill (type background))
        )
        (pin passive line (at -5.08 2.54 0) (length 3.81)
          (name "Pin_1" (effects (font (size 1.27 1.27))))
          (number "1" (effects (font (size 1.27 1.27))))
        )
        (pin passive line (at -5.08 0 0) (length 3.81)
          (name "Pin_2" (effects (font (size 1.27 1.27))))
          (number "2" (effects (font (size 1.27 1.27))))
        )
        (pin passive line (at -5.08 -2.54 0) (length 3.81)
          (name "Pin_3" (effects (font (size 1.27 1.27))))
          (number "3" (effects (font (size 1.27 1.27))))
        )
        (pin passive line (at -5.08 -5.08 0) (length 3.81)
          (name "Pin_4" (effects (font (size 1.27 1.27))))
          (number "4" (effects (font (size 1.27 1.27))))
        )
      )
    )
    (symbol "Device:C" (pin_numbers hide) (pin_names (offset 0.254)) (in_bom yes) (on_board yes)
      (property "Reference" "C" (id 0) (at 0.635 2.54 0)
        (effects (font (size 1.27 1.27)) (justify left))
      )
      (property "Value" "C" (id 1) (at 0.635 -2.54 0)
        (effects (font (size 1.27 1.27)) (justify left))
      )
      (property "Footprint" "" (id 2) (at 0.9652 -3.81 0)
        (effects (font (size 1.27 1.27)) hide)
      )
      (property "Datasheet" "~" (id 3) (at 0 0 0)
        (effects (font (size 1.27 1.27)) hide)
      )
      (property "ki_keywords" "cap capacitor" (id 4) (at 0 0 0)
        (effects (font (size 1.27 1.27)) hide)
      )
      (property "ki_description" "Unpolarized capacitor" (id 5) (at 0 0 0)
        (effects (font (size 1.27 1.27)) hide)
      )
      (property "ki_fp_filters" "C_*" (id 6) (at 0 0 0)
        (effects (font (size 1.27 1.27)) hide)
      )
      (symbol "C_0_1"
        (polyline
          (pts
            (xy -2.032 -0.762)
            (xy 2.032 -0.762)
          )
          (stroke (width 0.508) (type default) (color 0 0 0 0))
          (fill (type none))
        )
        (polyline
          (pts
            (xy -2.032 0.762)
            (xy 2.032 0.762)
          )
          (stroke (width 0.508) (type default) (color 0 0 0 0))
          (fill (type none))
        )
      )
      (symbol "C_1_1"
        (pin passive line (at 0 3.81 270) (length 2.794)
          (name "~" (effects (font (size 1.27 1.27))))
          (number "1" (effects (font (size 1.27 1.27))))
        )
        (pin passive line (at 0 -3.81 90) (length 2.794)
          (name "~" (effects (font (size 1.27 1.27))))
          (number "2" (effects (font (size 1.27 1.27))))
        )
      )
    )
    (symbol "Device:R" (pin_numbers hide) (pin_names (offset 0)) (in_bom yes) (on_board yes)
      (property "Reference" "R" (id 0) (at 2.032 0 90)
        (effects (font (size 1.27 1.27)))
      )
      (property "Value" "R" (id 1) (at 0 0 90)
        (effects (font (size 1.27 1.27)))
      )
      (property "Footprint" "" (id 2) (at -1.778 0 90)
        (effects (font (size 1.27 1.27)) hide)
      )
      (property "Datasheet" "~" (id 3) (at 0 0 0)
        (effects (font (size 1.27 1.27)) hide)
      )
      (property "ki_keywords" "R res resistor" (id 4) (at 0 0 0)
        (effects (font (size 1.27 1.27)) hide)
      )
      (property "ki_description" "Resistor" (id 5) (at 0 0 0)
        (effects (font (size 1.27 1.27)) hide)
      )
      (property "ki_fp_filters" "R_*" (id 6) (at 0 0 0)
        (effects (font (size 1.27 1.27)) hide)
      )
      (symbol "R_0_1"
        (rectangle (start -1.016 -2.54) (end 1.016 2.54)
          (stroke (width 0.254) (type default) (color 0 0 0 0))
          (fill (type none))
        )
      )
      (symbol "R_1_1"
        (pin passive line (at 0 3.81 270) (length 1.27)
          (name "~" (effects (font (size 1.27 1.27))))
          (number "1" (effects (font (size 1.27 1.27))))
        )
        (pin passive line (at 0 -3.81 90) (length 1.27)
          (name "~" (effects (font (size 1.27 1.27))))
          (number "2" (effects (font (size 1.27 1.27))))
        )
      )
    )
    (symbol "Interface_UART:MAX3232" (pin_names (offset 1.016)) (in_bom yes) (on_board yes)
      (property "Reference" "U" (id 0) (at -2.54 28.575 0)
        (effects (font (size 1.27 1.27)) (justify right))
      )
      (property "Value" "MAX3232" (id 1) (at -2.54 26.67 0)
        (effects (font (size 1.27 1.27)) (justify right))
      )
      (property "Footprint" "" (id 2) (at 1.27 -26.67 0)
        (effects (font (size 1.27 1.27)) (justify left) hide)
      )
      (property "Datasheet" "https://datasheets.maximintegrated.com/en/ds/MAX3222-MAX3241.pdf" (id 3) (at 0 2.54 0)
        (effects (font (size 1.27 1.27)) hide)
      )
      (property "ki_keywords" "rs232 uart transceiver line-driver" (id 4) (at 0 0 0)
        (effects (font (size 1.27 1.27)) hide)
      )
      (property "ki_description" "3.0V to 5.5V, Low-Power, up to 1Mbps, True RS-232 Transceivers Using Four 0.1μF External Capacitors" (id 5) (at 0 0 0)
        (effects (font (size 1.27 1.27)) hide)
      )
      (property "ki_fp_filters" "SOIC*P1.27mm* DIP*W7.62mm* TSSOP*4.4x5mm*P0.65mm*" (id 6) (at 0 0 0)
        (effects (font (size 1.27 1.27)) hide)
      )
      (symbol "MAX3232_0_0"
        (text "LOGIC" (at -11.43 -22.86 0)
          (effects (font (size 1.27 1.27)))
        )
        (text "RS232" (at 11.43 -22.86 0)
          (effects (font (size 1.27 1.27)))
        )
      )
      (symbol "MAX3232_0_1"
        (rectangle (start -15.24 -25.4) (end 15.24 25.4)
          (stroke (width 0.254) (type default) (color 0 0 0 0))
          (fill (type background))
        )
        (circle (center -2.54 -17.78) (radius 0.635)
          (stroke (width 0.254) (type default) (color 0 0 0 0))
          (fill (type none))
        )
        (circle (center -2.54 -12.7) (radius 0.635)
          (stroke (width 0.254) (type default) (color 0 0 0 0))
          (fill (type none))
        )
        (polyline
          (pts
            (xy -3.81 -7.62)
            (xy -8.255 -7.62)
          )
          (stroke (width 0.254) (type default) (color 0 0 0 0))
          (fill (type none))
        )
        (polyline
          (pts
            (xy -3.81 -2.54)
            (xy -8.255 -2.54)
          )
          (stroke (width 0.254) (type default) (color 0 0 0 0))
          (fill (type none))
        )
        (polyline
          (pts
            (xy -3.175 -17.78)
            (xy -8.255 -17.78)
          )
          (stroke (width 0.254) (type default) (color 0 0 0 0))
          (fill (type none))
        )
        (polyline
          (pts
            (xy -3.175 -12.7)
            (xy -8.255 -12.7)
          )
          (stroke (width 0.254) (type default) (color 0 0 0 0))
          (fill (type none))
        )
        (polyline
          (pts
            (xy 1.27 -7.62)
            (xy 6.35 -7.62)
          )
          (stroke (width 0.254) (type default) (color 0 0 0 0))
          (fill (type none))
        )
        (polyline
          (pts
            (xy 1.27 -2.54)
            (xy 6.35 -2.54)
          )
          (stroke (width 0.254) (type default) (color 0 0 0 0))
          (fill (type none))
        )
        (polyline
          (pts
            (xy 1.905 -17.78)
            (xy 6.35 -17.78)
          )
          (stroke (width 0.254) (type default) (color 0 0 0 0))
          (fill (type none))
        )
        (polyline
          (pts
            (xy 1.905 -12.7)
            (xy 6.35 -12.7)
          )
          (stroke (width 0.254) (type default) (color 0 0 0 0))
          (fill (type none))
        )
        (polyline
          (pts
            (xy -3.81 -5.715)
            (xy -3.81 -9.525)
            (xy 0 -7.62)
            (xy -3.81 -5.715)
          )
          (stroke (width 0.254) (type default) (color 0 0 0 0))
          (fill (type none))
        )
        (polyline
          (pts
            (xy -3.81 -0.635)
            (xy -3.81 -4.445)
            (xy 0 -2.54)
            (xy -3.81 -0.635)
          )
          (stroke (width 0.254) (type default) (color 0 0 0 0))
          (fill (type none))
        )
        (polyline
          (pts
            (xy 1.905 -15.875)
            (xy 1.905 -19.685)
            (xy -1.905 -17.78)
            (xy 1.905 -15.875)
          )
          (stroke (width 0.254) (type default) (color 0 0 0 0))
          (fill (type none))
        )
        (polyline
          (pts
            (xy 1.905 -10.795)
            (xy 1.905 -14.605)
            (xy -1.905 -12.7)
            (xy 1.905 -10.795)
          )
          (stroke (width 0.254) (type default) (color 0 0 0 0))
          (fill (type none))
        )
        (circle (center 0.635 -7.62) (radius 0.635)
          (stroke (width 0.254) (type default) (color 0 0 0 0))
          (fill (type none))
        )
        (circle (center 0.635 -2.54) (radius 0.635)
          (stroke (width 0.254) (type default) (color 0 0 0 0))
          (fill (type none))
        )
      )
      (symbol "MAX3232_1_1"
        (pin passive line (at -20.32 22.86 0) (length 5.08)
          (name "C1+" (effects (font (size 1.27 1.27))))
          (number "1" (effects (font (size 1.27 1.27))))
        )
        (pin input line (at -20.32 -7.62 0) (length 5.08)
          (name "T2IN" (effects (font (size 1.27 1.27))))
          (number "10" (effects (font (size 1.27 1.27))))
        )
        (pin input line (at -20.32 -2.54 0) (length 5.08)
          (name "T1IN" (effects (font (size 1.27 1.27))))
          (number "11" (effects (font (size 1.27 1.27))))
        )
        (pin output line (at -20.32 -12.7 0) (length 5.08)
          (name "R1OUT" (effects (font (size 1.27 1.27))))
          (number "12" (effects (font (size 1.27 1.27))))
        )
        (pin input line (at 20.32 -12.7 180) (length 5.08)
          (name "R1IN" (effects (font (size 1.27 1.27))))
          (number "13" (effects (font (size 1.27 1.27))))
        )
        (pin output line (at 20.32 -2.54 180) (length 5.08)
          (name "T1OUT" (effects (font (size 1.27 1.27))))
          (number "14" (effects (font (size 1.27 1.27))))
        )
        (pin power_in line (at 0 -30.48 90) (length 5.08)
          (name "GND" (effects (font (size 1.27 1.27))))
          (number "15" (effects (font (size 1.27 1.27))))
        )
        (pin power_in line (at 0 30.48 270) (length 5.08)
          (name "VCC" (effects (font (size 1.27 1.27))))
          (number "16" (effects (font (size 1.27 1.27))))
        )
        (pin power_out line (at 20.32 10.16 180) (length 5.08)
          (name "VS+" (effects (font (size 1.27 1.27))))
          (number "2" (effects (font (size 1.27 1.27))))
        )
        (pin passive line (at -20.32 15.24 0) (length 5.08)
          (name "C1-" (effects (font (size 1.27 1.27))))
          (number "3" (effects (font (size 1.27 1.27))))
        )
        (pin passive line (at 20.32 22.86 180) (length 5.08)
          (name "C2+" (effects (font (size 1.27 1.27))))
          (number "4" (effects (font (size 1.27 1.27))))
        )
        (pin passive line (at 20.32 15.24 180) (length 5.08)
          (name "C2-" (effects (font (size 1.27 1.27))))
          (number "5" (effects (font (size 1.27 1.27))))
        )
        (pin power_out line (at 20.32 2.54 180) (length 5.08)
          (name "VS-" (effects (font (size 1.27 1.27))))
          (number "6" (effects (font (size 1.27 1.27))))
        )
        (pin output line (at 20.32 -7.62 180) (length 5.08)
          (name "T2OUT" (effects (font (size 1.27 1.27))))
          (number "7" (effects (font (size 1.27 1.27))))
        )
        (pin input line (at 20.32 -17.78 180) (length 5.08)
          (name "R2IN" (effects (font (size 1.27 1.27))))
          (number "8" (effects (font (size 1.27 1.27))))
        )
        (pin output line (at -20.32 -17.78 0) (length 5.08)
          (name "R2OUT" (effects (font (size 1.27 1.27))))
          (number "9" (effects (font (size 1.27 1.27))))
        )
      )
    )
    (symbol "Interface_UART:MAX3485" (in_bom yes) (on_board yes)
      (property "Reference" "U" (id 0) (at -6.096 11.43 0)
        (effects (font (size 1.27 1.27)))
      )
      (property "Value" "MAX3485" (id 1) (at 0.762 11.43 0)
        (effects (font (size 1.27 1.27)) (justify left))
      )
      (property "Footprint" "" (id 2) (at 0 -17.78 0)
        (effects (font (size 1.27 1.27)) hide)
      )
      (property "Datasheet" "https://datasheets.maximintegrated.com/en/ds/MAX3483-MAX3491.pdf" (id 3) (at 0 1.27 0)
        (effects (font (size 1.27 1.27)) hide)
      )
      (property "ki_keywords" "RS-485 RS-422 UART line-driver transceiver" (id 4) (at 0 0 0)
        (effects (font (size 1.27 1.27)) hide)
      )
      (property "ki_description" "True RS-485/RS-422, 10Mbps, Slew-Rate Limited, with low-power shutdown, with receiver/driver enable, 32 receiver drive capacitity, DIP-8 and SOIC-8" (id 5) (at 0 0 0)
        (effects (font (size 1.27 1.27)) hide)
      )
      (property "ki_fp_filters" "DIP*W7.62mm* SOIC*3.9x4.9mm*P1.27mm*" (id 6) (at 0 0 0)
        (effects (font (size 1.27 1.27)) hide)
      )
      (symbol "MAX3485_0_1"
        (rectangle (start -7.62 10.16) (end 7.62 -12.7)
          (stroke (width 0.254) (type default) (color 0 0 0 0))
          (fill (type background))
        )
        (circle (center -0.3048 -3.683) (radius 0.3556)
          (stroke (width 0.254) (type default) (color 0 0 0 0))
          (fill (type outline))
        )
        (circle (center -0.0254 1.4986) (radius 0.3556)
          (stroke (width 0.254) (type default) (color 0 0 0 0))
          (fill (type outline))
        )
        (polyline
          (pts
            (xy -4.064 -5.08)
            (xy -1.905 -5.08)
          )
          (stroke (width 0.254) (type default) (color 0 0 0 0))
          (fill (type none))
        )
        (polyline
          (pts
            (xy -4.064 2.54)
            (xy -1.27 2.54)
          )
          (stroke (width 0.254) (type default) (color 0 0 0 0))
          (fill (type none))
        )
        (polyline
          (pts
            (xy -1.27 -3.2004)
            (xy -1.27 -3.4544)
          )
          (stroke (width 0.254) (type default) (color 0 0 0 0))
          (fill (type none))
        )
        (polyline
          (pts
            (xy -0.635 -5.08)
            (xy 5.334 -5.08)
          )
          (stroke (width 0.254) (type default) (color 0 0 0 0))
          (fill (type none))
        )
        (polyline
          (pts
            (xy -4.064 -2.54)
            (xy -1.27 -2.54)
            (xy -1.27 -3.175)
          )
          (stroke (width 0.254) (type default) (color 0 0 0 0))
          (fill (type none))
        )
        (polyline
          (pts
            (xy 0 1.27)
            (xy 0 0)
            (xy -4.064 0)
          )
          (stroke (width 0.254) (type default) (color 0 0 0 0))
          (fill (type none))
        )
        (polyline
          (pts
            (xy 1.27 3.175)
            (xy 3.81 3.175)
            (xy 3.81 -5.08)
          )
          (stroke (width 0.254) (type default) (color 0 0 0 0))
          (fill (type none))
        )
        (polyline
          (pts
            (xy 2.54 1.905)
            (xy 2.54 -3.81)
            (xy 0 -3.81)
          )
          (stroke (width 0.254) (type default) (color 0 0 0 0))
          (fill (type none))
        )
        (polyline
          (pts
            (xy -1.905 -3.175)
            (xy -1.905 -5.715)
            (xy 0.635 -4.445)
            (xy -1.905 -3.175)
          )
          (stroke (width 0.254) (type default) (color 0 0 0 0))
          (fill (type none))
        )
        (polyline
          (pts
            (xy -1.27 2.54)
            (xy 1.27 3.81)
            (xy 1.27 1.27)
            (xy -1.27 2.54)
          )
          (stroke (width 0.254) (type default) (color 0 0 0 0))
          (fill (type none))
        )
        (polyline
          (pts
            (xy 1.905 1.905)
            (xy 4.445 1.905)
            (xy 4.445 2.54)
            (xy 5.334 2.54)
          )
          (stroke (width 0.254) (type default) (color 0 0 0 0))
          (fill (type none))
        )
        (rectangle (start 1.27 3.175) (end 1.27 3.175)
          (stroke (width 0) (type default) (color 0 0 0 0))
          (fill (type none))
        )
        (circle (center 1.651 1.905) (radius 0.3556)
          (stroke (width 0.254) (type default) (color 0 0 0 0))
          (fill (type outline))
        )
      )
      (symbol "MAX3485_1_1"
        (pin output line (at -10.16 2.54 0) (length 2.54)
          (name "RO" (effects (font (size 1.27 1.27))))
          (number "1" (effects (font (size 1.27 1.27))))
        )
        (pin input line (at -10.16 0 0) (length 2.54)
          (name "~{RE}" (effects (font (size 1.27 1.27))))
          (number "2" (effects (font (size 1.27 1.27))))
        )
        (pin input line (at -10.16 -2.54 0) (length 2.54)
          (name "DE" (effects (font (size 1.27 1.27))))
          (number "3" (effects (font (size 1.27 1.27))))
        )
        (pin input line (at -10.16 -5.08 0) (length 2.54)
          (name "DI" (effects (font (size 1.27 1.27))))
          (number "4" (effects (font (size 1.27 1.27))))
        )
        (pin power_in line (at 0 -15.24 90) (length 2.54)
          (name "GND" (effects (font (size 1.27 1.27))))
          (number "5" (effects (font (size 1.27 1.27))))
        )
        (pin bidirectional line (at 10.16 -5.08 180) (length 2.54)
          (name "A" (effects (font (size 1.27 1.27))))
          (number "6" (effects (font (size 1.27 1.27))))
        )
        (pin bidirectional line (at 10.16 2.54 180) (length 2.54)
          (name "B" (effects (font (size 1.27 1.27))))
          (number "7" (effects (font (size 1.27 1.27))))
        )
        (pin power_in line (at 0 12.7 270) (length 2.54)
          (name "VCC" (effects (font (size 1.27 1.27))))
          (number "8" (effects (font (size 1.27 1.27))))
        )
      )
    )
    (symbol "power:+3V3" (power) (pin_names (offset 0)) (in_bom yes) (on_board yes)
      (property "Reference" "#PWR" (id 0) (at 0 -3.81 0)
        (effects (font (size 1.27 1.27)) hide)
      )
      (property "Value" "+3V3" (id 1) (at 0 3.556 0)
        (effects (font (size 1.27 1.27)))
      )
      (property "Footprint" "" (id 2) (at 0 0 0)
        (effects (font (size 1.27 1.27)) hide)
      )
      (property "Datasheet" "" (id 3) (at 0 0 0)
        (effects (font (size 1.27 1.27)) hide)
      )
      (property "ki_keywords" "power-flag" (id 4) (at 0 0 0)
        (effects (font (size 1.27 1.27)) hide)
      )
      (property "ki_description" "Power symbol creates a global label with name \"+3V3\"" (id 5) (at 0 0 0)
        (effects (font (size 1.27 1.27)) hide)
      )
      (symbol "+3V3_0_1"
        (polyline
          (pts
            (xy -0.762 1.27)
            (xy 0 2.54)
          )
          (stroke (width 0) (type default) (color 0 0 0 0))
          (fill (type none))
        )
        (polyline
          (pts
            (xy 0 0)
            (xy 0 2.54)
          )
          (stroke (width 0) (type default) (color 0 0 0 0))
          (fill (type none))
        )
        (polyline
          (pts
            (xy 0 2.54)
            (xy 0.762 1.27)
          )
          (stroke (width 0) (type default) (color 0 0 0 0))
          (fill (type none))
        )
      )
      (symbol "+3V3_1_1"
        (pin power_in line (at 0 0 90) (length 0) hide
          (name "+3V3" (effects (font (size 1.27 1.27))))
          (number "1" (effects (font (size 1.27 1.27))))
        )
      )
    )
    (symbol "power:+5V" (power) (pin_names (offset 0)) (in_bom yes) (on_board yes)
      (property "Reference" "#PWR" (id 0) (at 0 -3.81 0)
        (effects (font (size 1.27 1.27)) hide)
      )
      (property "Value" "+5V" (id 1) (at 0 3.556 0)
        (effects (font (size 1.27 1.27)))
      )
      (property "Footprint" "" (id 2) (at 0 0 0)
        (effects (font (size 1.27 1.27)) hide)
      )
      (property "Datasheet" "" (id 3) (at 0 0 0)
        (effects (font (size 1.27 1.27)) hide)
      )
      (property "ki_keywords" "power-flag" (id 4) (at 0 0 0)
        (effects (font (size 1.27 1.27)) hide)
      )
      (property "ki_description" "Power symbol creates a global label with name \"+5V\"" (id 5) (at 0 0 0)
        (effects (font (size 1.27 1.27)) hide)
      )
      (symbol "+5V_0_1"
        (polyline
          (pts
            (xy -0.762 1.27)
            (xy 0 2.54)
          )
          (stroke (width 0) (type default) (color 0 0 0 0))
          (fill (type none))
        )
        (polyline
          (pts
            (xy 0 0)
            (xy 0 2.54)
          )
          (stroke (width 0) (type default) (color 0 0 0 0))
          (fill (type none))
        )
        (polyline
          (pts
            (xy 0 2.54)
            (xy 0.762 1.27)
          )
          (stroke (width 0) (type default) (color 0 0 0 0))
          (fill (type none))
        )
      )
      (symbol "+5V_1_1"
        (pin power_in line (at 0 0 90) (length 0) hide
          (name "+5V" (effects (font (size 1.27 1.27))))
          (number "1" (effects (font (size 1.27 1.27))))
        )
      )
    )
    (symbol "power:GND" (power) (pin_names (offset 0)) (in_bom yes) (on_board yes)
      (property "Reference" "#PWR" (id 0) (at 0 -6.35 0)
        (effects (font (size 1.27 1.27)) hide)
      )
      (property "Value" "GND" (id 1) (at 0 -3.81 0)
        (effects (font (size 1.27 1.27)))
      )
      (property "Footprint" "" (id 2) (at 0 0 0)
        (effects (font (size 1.27 1.27)) hide)
      )
      (property "Datasheet" "" (id 3) (at 0 0 0)
        (effects (font (size 1.27 1.27)) hide)
      )
      (property "ki_keywords" "power-flag" (id 4) (at 0 0 0)
        (effects (font (size 1.27 1.27)) hide)
      )
      (property "ki_description" "Power symbol creates a global label with name \"GND\" , ground" (id 5) (at 0 0 0)
        (effects (font (size 1.27 1.27)) hide)
      )
      (symbol "GND_0_1"
        (polyline
          (pts
            (xy 0 0)
            (xy 0 -1.27)
            (xy 1.27 -1.27)
            (xy 0 -2.54)
            (xy -1.27 -1.27)
            (xy 0 -1.27)
          )
          (stroke (width 0) (type default) (color 0 0 0 0))
          (fill (type none))
        )
      )
      (symbol "GND_1_1"
        (pin power_in line (at 0 0 270) (length 0) hide
          (name "GND" (effects (font (size 1.27 1.27))))
          (number "1" (effects (font (size 1.27 1.27))))
        )
      )
    )
  )

  (junction (at 187.96 101.6) (diameter 0.9144) (color 0 0 0 0)
    (uuid 63f4f2c3-230e-4140-b561-60dc7b883135)
  )
  (junction (at 227.33 85.09) (diameter 0.9144) (color 0 0 0 0)
    (uuid 959515dd-32a5-4c45-9397-74bbfcecd51e)
  )
  (junction (at 76.2 69.215) (diameter 0.9144) (color 0 0 0 0)
    (uuid db661329-9c51-496c-9e62-370ebf0236be)
  )
  (junction (at 187.96 104.14) (diameter 0.9144) (color 0 0 0 0)
    (uuid f525c2ca-e7ba-4514-91bc-134c7eeb6847)
  )

  (no_connect (at 96.52 121.92) (uuid 319d2e14-0f1a-46f8-8101-53f39f2bc872))
  (no_connect (at 55.88 121.92) (uuid 8ddbe74d-0f7b-467d-aad1-5c3ad3f3665b))
  (no_connect (at 55.88 111.76) (uuid d0c20d4f-1914-49cc-ae4a-1aca081154bf))
  (no_connect (at 96.52 111.76) (uuid f67bca1a-0911-4a26-8f63-ed39f2b58114))

  (wire (pts (xy 244.348 106.68) (xy 248.92 106.68))
    (stroke (width 0) (type solid) (color 0 0 0 0))
    (uuid 0348dbfd-5828-4523-b92f-5bc014fc7565)
  )
  (wire (pts (xy 179.705 101.6) (xy 187.96 101.6))
    (stroke (width 0) (type solid) (color 0 0 0 0))
    (uuid 04e252f2-7a1d-4724-ba4c-ee9b1a6c1383)
  )
  (wire (pts (xy 237.49 99.06) (xy 242.062 99.06))
    (stroke (width 0) (type solid) (color 0 0 0 0))
    (uuid 07d0aef0-67f4-4e58-814e-fafd5ce15e02)
  )
  (wire (pts (xy 242.062 104.14) (xy 248.92 104.14))
    (stroke (width 0) (type solid) (color 0 0 0 0))
    (uuid 0edb9636-0b54-43d7-a7a1-4ed15143a2ce)
  )
  (wire (pts (xy 240.03 85.09) (xy 245.745 85.09))
    (stroke (width 0) (type solid) (color 0 0 0 0))
    (uuid 116861dd-9898-4c37-88b5-6058c32d764a)
  )
  (wire (pts (xy 76.2 69.215) (xy 89.535 69.215))
    (stroke (width 0) (type solid) (color 0 0 0 0))
    (uuid 199ee726-b3ec-40e3-88f4-a433a2da7e81)
  )
  (wire (pts (xy 104.14 121.285) (xy 111.125 121.285))
    (stroke (width 0) (type solid) (color 0 0 0 0))
    (uuid 1b3802a1-4931-4a8f-817e-ac67e4719c95)
  )
  (wire (pts (xy 179.705 121.285) (xy 179.705 118.11))
    (stroke (width 0) (type solid) (color 0 0 0 0))
    (uuid 1d70c586-171e-40f5-a923-b8be2c64db2b)
  )
  (wire (pts (xy 96.52 101.6) (xy 111.125 101.6))
    (stroke (width 0) (type solid) (color 0 0 0 0))
    (uuid 295cd9ec-bc24-43b3-ba1b-0053bb53e384)
  )
  (wire (pts (xy 104.14 106.68) (xy 104.14 121.285))
    (stroke (width 0) (type solid) (color 0 0 0 0))
    (uuid 2a3ca43f-f349-411b-9139-8f7d227902fb)
  )
  (wire (pts (xy 101.6 129.54) (xy 101.6 126.365))
    (stroke (width 0) (type solid) (color 0 0 0 0))
    (uuid 329bb1a6-c2da-48f2-b9e8-a93a051fd312)
  )
  (wire (pts (xy 50.8 88.9) (xy 55.88 88.9))
    (stroke (width 0) (type solid) (color 0 0 0 0))
    (uuid 34067782-de96-407b-be2b-1a697e83c00f)
  )
  (wire (pts (xy 80.645 64.135) (xy 76.2 64.135))
    (stroke (width 0) (type solid) (color 0 0 0 0))
    (uuid 3743c6e4-83d2-496d-9019-9fbc66799b6c)
  )
  (wire (pts (xy 118.745 101.6) (xy 123.19 101.6))
    (stroke (width 0) (type solid) (color 0 0 0 0))
    (uuid 39d14825-ba0b-4ba3-b9ef-38cd38e6b729)
  )
  (wire (pts (xy 242.062 99.06) (xy 242.062 101.6))
    (stroke (width 0) (type solid) (color 0 0 0 0))
    (uuid 42bc728f-bdd3-40dd-bc8c-c6fde6c4b8eb)
  )
  (wire (pts (xy 101.6 126.365) (xy 111.125 126.365))
    (stroke (width 0) (type solid) (color 0 0 0 0))
    (uuid 44eee2c6-2727-4505-aae6-3283104f9fb1)
  )
  (wire (pts (xy 96.52 81.28) (xy 101.6 81.28))
    (stroke (width 0) (type solid) (color 0 0 0 0))
    (uuid 453d7194-27e4-4faa-b353-d19941a8de4a)
  )
  (polyline (pts (xy 152.4 12.7) (xy 152.4 196.85))
    (stroke (width 0) (type dash) (color 0 0 0 0))
    (uuid 4cc8fca5-7f0a-4163-811c-ee32f155f18f)
  )

  (wire (pts (xy 76.2 69.215) (xy 76.2 73.66))
    (stroke (width 0) (type solid) (color 0 0 0 0))
    (uuid 543c507b-4d52-4c50-9beb-583622e6a010)
  )
  (wire (pts (xy 88.265 64.135) (xy 92.075 64.135))
    (stroke (width 0) (type solid) (color 0 0 0 0))
    (uuid 6e1d48b6-1da0-4431-aefd-dd47fab3a8ce)
  )
  (wire (pts (xy 50.8 81.28) (xy 55.88 81.28))
    (stroke (width 0) (type solid) (color 0 0 0 0))
    (uuid 74e39f7a-3500-4053-bbd1-f60346e21320)
  )
  (wire (pts (xy 237.49 106.68) (xy 242.062 106.68))
    (stroke (width 0) (type solid) (color 0 0 0 0))
    (uuid 796c6e06-eca8-4d81-b59d-8802d722e358)
  )
  (wire (pts (xy 101.6 123.825) (xy 111.125 123.825))
    (stroke (width 0) (type solid) (color 0 0 0 0))
    (uuid 869369a4-6ff7-41e7-aa08-a973eb624730)
  )
  (wire (pts (xy 244.348 110.49) (xy 244.348 106.68))
    (stroke (width 0) (type solid) (color 0 0 0 0))
    (uuid 8bf04fd5-176e-4e66-a1f3-5c76d95449ca)
  )
  (wire (pts (xy 179.705 96.52) (xy 179.705 101.6))
    (stroke (width 0) (type solid) (color 0 0 0 0))
    (uuid 978c86a6-ef45-4764-b0cc-312a755ca84a)
  )
  (wire (pts (xy 227.33 85.09) (xy 227.33 88.9))
    (stroke (width 0) (type solid) (color 0 0 0 0))
    (uuid 9b2cd9c7-2571-4554-be88-81484f14c99c)
  )
  (wire (pts (xy 101.6 116.84) (xy 101.6 123.825))
    (stroke (width 0) (type solid) (color 0 0 0 0))
    (uuid a2e8b733-e942-4e7b-a6b7-2f3c8914c990)
  )
  (wire (pts (xy 179.705 85.725) (xy 179.705 88.9))
    (stroke (width 0) (type solid) (color 0 0 0 0))
    (uuid a2eaa498-0f7a-48b7-b157-7394c77fb9b5)
  )
  (wire (pts (xy 111.125 118.745) (xy 107.7546 118.7445))
    (stroke (width 0) (type solid) (color 0 0 0 0))
    (uuid a51230d5-7fa9-4e26-9591-05347d5d55fb)
  )
  (wire (pts (xy 107.7546 116.9719) (xy 107.7546 118.7445))
    (stroke (width 0) (type solid) (color 0 0 0 0))
    (uuid a7eb75dc-fb67-458b-a9d0-50949424d4b0)
  )
  (wire (pts (xy 227.33 85.09) (xy 232.41 85.09))
    (stroke (width 0) (type solid) (color 0 0 0 0))
    (uuid a85a7932-280d-4783-aad6-298fed82c33b)
  )
  (wire (pts (xy 187.96 96.52) (xy 187.96 101.6))
    (stroke (width 0) (type solid) (color 0 0 0 0))
    (uuid a9ed00ea-362f-4682-8584-ce2bd0579e60)
  )
  (wire (pts (xy 245.11 99.06) (xy 245.11 96.52))
    (stroke (width 0) (type solid) (color 0 0 0 0))
    (uuid b9f0aa44-de71-464f-876c-a435bce188f5)
  )
  (wire (pts (xy 248.92 99.06) (xy 245.11 99.06))
    (stroke (width 0) (type solid) (color 0 0 0 0))
    (uuid b9f0aa44-de71-464f-876c-a435bce188f6)
  )
  (wire (pts (xy 96.52 88.9) (xy 101.6 88.9))
    (stroke (width 0) (type solid) (color 0 0 0 0))
    (uuid c831eb76-11a3-4354-81d7-4402a3459669)
  )
  (wire (pts (xy 227.33 80.645) (xy 227.33 85.09))
    (stroke (width 0) (type solid) (color 0 0 0 0))
    (uuid cdaa5270-11c9-46f2-8181-268d06147f02)
  )
  (wire (pts (xy 242.062 106.68) (xy 242.062 104.14))
    (stroke (width 0) (type solid) (color 0 0 0 0))
    (uuid d723d138-b76c-4af8-94e4-d21a40460f2a)
  )
  (wire (pts (xy 76.2 64.135) (xy 76.2 69.215))
    (stroke (width 0) (type solid) (color 0 0 0 0))
    (uuid dad02690-856d-4970-951d-af5cab5c0602)
  )
  (wire (pts (xy 242.062 101.6) (xy 248.92 101.6))
    (stroke (width 0) (type solid) (color 0 0 0 0))
    (uuid db6449f8-2564-499b-9a7d-7ee333c9cd7e)
  )
  (wire (pts (xy 96.52 93.98) (xy 111.125 93.98))
    (stroke (width 0) (type solid) (color 0 0 0 0))
    (uuid dd105c13-3a90-4add-83d2-70b6eb0f9201)
  )
  (wire (pts (xy 76.2 134.62) (xy 76.2 137.16))
    (stroke (width 0) (type solid) (color 0 0 0 0))
    (uuid e4f2632a-8802-4b60-b2c3-08df4909b2cd)
  )
  (wire (pts (xy 96.52 106.68) (xy 104.14 106.68))
    (stroke (width 0) (type solid) (color 0 0 0 0))
    (uuid e66cbdb0-2cd7-434a-8b63-1b08c1c0178f)
  )
  (wire (pts (xy 187.96 101.6) (xy 217.17 101.6))
    (stroke (width 0) (type solid) (color 0 0 0 0))
    (uuid e77c2cf2-0de4-454e-b0de-b674602c5b3c)
  )
  (wire (pts (xy 187.96 104.14) (xy 187.96 110.49))
    (stroke (width 0) (type solid) (color 0 0 0 0))
    (uuid eed3ec49-8f78-437e-b31e-7a654eaea849)
  )
  (wire (pts (xy 118.745 93.98) (xy 123.19 93.98))
    (stroke (width 0) (type solid) (color 0 0 0 0))
    (uuid f61c46bd-5c89-4380-97bd-6caf44f3aacb)
  )
  (wire (pts (xy 96.52 116.84) (xy 101.6 116.84))
    (stroke (width 0) (type solid) (color 0 0 0 0))
    (uuid f9d8c13a-f0a4-4163-a378-fc5d7de78f37)
  )
  (wire (pts (xy 179.705 110.49) (xy 179.705 104.14))
    (stroke (width 0) (type solid) (color 0 0 0 0))
    (uuid fd0d9400-6206-41cc-b12a-834144799c0b)
  )
  (wire (pts (xy 187.96 85.09) (xy 187.96 88.9))
    (stroke (width 0) (type solid) (color 0 0 0 0))
    (uuid feb7298a-8820-43d3-a7b0-8daf66bec93f)
  )
  (wire (pts (xy 179.705 104.14) (xy 187.96 104.14))
    (stroke (width 0) (type solid) (color 0 0 0 0))
    (uuid ffe55dc2-aea6-47e5-91f6-bf7537d061ff)
  )
  (wire (pts (xy 187.96 104.14) (xy 217.17 104.14))
    (stroke (width 0) (type solid) (color 0 0 0 0))
    (uuid ffe55dc2-aea6-47e5-91f6-bf7537d06200)
  )

  (text "RS232 Transceiver" (at 128.27 19.05 0)
    (effects (font (size 1.27 1.27)) (justify left bottom))
    (uuid 5289d0c8-cd86-47e6-b42c-88f53ca38505)
  )
  (text "RS485 Transceiver" (at 264.16 19.05 0)
    (effects (font (size 1.27 1.27)) (justify left bottom))
    (uuid ad7539ed-8d98-4875-b2ef-504cdf7eb6ab)
  )

  (hierarchical_label "USART2_RTS" (shape input) (at 187.96 110.49 270)
    (effects (font (size 1.27 1.27)) (justify right))
    (uuid 5de9d655-157d-4417-93aa-c526890b5616)
  )
  (hierarchical_label "USART1_TX_MAX3232" (shape input) (at 55.88 116.84 180)
    (effects (font (size 1.27 1.27)) (justify right))
    (uuid 76ef4c7d-4639-4724-b3a1-02062f5c54f5)
  )
  (hierarchical_label "USART1_RX_MAX3232" (shape input) (at 55.88 106.68 180)
    (effects (font (size 1.27 1.27)) (justify right))
    (uuid 91de0983-e9c1-4e23-b3f4-ea79a87d981a)
  )
  (hierarchical_label "USART2_TX_MAX3485" (shape input) (at 217.17 99.06 180)
    (effects (font (size 1.27 1.27)) (justify right))
    (uuid dbf4ff94-1730-4ea9-97ae-d2df4065f8da)
  )
  (hierarchical_label "USART2_RX_MAX3485" (shape input) (at 217.17 106.68 180)
    (effects (font (size 1.27 1.27)) (justify right))
    (uuid f7e93d4e-6e04-425c-858f-fcd74ce3a56e)
  )

  (symbol (lib_id "power:+3V3") (at 89.535 69.215 270) (unit 1)
    (in_bom yes) (on_board yes) (fields_autoplaced)
    (uuid 107bea96-de9d-446b-8330-21d371969ae7)
    (property "Reference" "#PWR0117" (id 0) (at 85.725 69.215 0)
      (effects (font (size 1.27 1.27)) hide)
    )
    (property "Value" "+3V3" (id 1) (at 93.98 69.2149 90)
      (effects (font (size 1.27 1.27)) (justify left))
    )
    (property "Footprint" "" (id 2) (at 89.535 69.215 0)
      (effects (font (size 1.27 1.27)) hide)
    )
    (property "Datasheet" "" (id 3) (at 89.535 69.215 0)
      (effects (font (size 1.27 1.27)) hide)
    )
    (pin "1" (uuid 67e0cd46-6e30-405e-a2ce-a0395c21e8b5))
  )

  (symbol (lib_id "Device:R") (at 179.705 114.3 180) (unit 1)
    (in_bom yes) (on_board yes)
    (uuid 194bd670-128c-4893-b14d-4898d5a23b52)
    (property "Reference" "R12" (id 0) (at 177.8 115.5701 0)
      (effects (font (size 1.27 1.27)) (justify left))
    )
    (property "Value" "10K" (id 1) (at 177.8 113.0301 0)
      (effects (font (size 1.27 1.27)) (justify left))
    )
    (property "Footprint" "Resistor_SMD:R_0603_1608Metric" (id 2) (at 181.483 114.3 90)
      (effects (font (size 1.27 1.27)) hide)
    )
    (property "Datasheet" "~" (id 3) (at 179.705 114.3 0)
      (effects (font (size 1.27 1.27)) hide)
    )
    (pin "1" (uuid 00efd946-8ebe-4a8a-a8e6-05f384a00925))
    (pin "2" (uuid 2531fb16-b428-44b8-a577-24449c2f4667))
  )

  (symbol (lib_id "Device:C") (at 114.935 93.98 90) (unit 1)
    (in_bom yes) (on_board yes) (fields_autoplaced)
    (uuid 1ae75660-2c0f-4dda-a14a-e6f37ad01b75)
    (property "Reference" "C16" (id 0) (at 114.935 88.265 90))
    (property "Value" "0.1 uF" (id 1) (at 114.935 90.805 90))
    (property "Footprint" "Capacitor_SMD:C_0603_1608Metric" (id 2) (at 118.745 93.0148 0)
      (effects (font (size 1.27 1.27)) hide)
    )
    (property "Datasheet" "~" (id 3) (at 114.935 93.98 0)
      (effects (font (size 1.27 1.27)) hide)
    )
    (pin "1" (uuid ddb61e5a-c9b4-45fd-95bf-d9e495f61478))
    (pin "2" (uuid 07eaa84a-6ecb-466f-95df-f975f314aa0c))
  )

  (symbol (lib_id "Device:C") (at 84.455 64.135 90) (unit 1)
    (in_bom yes) (on_board yes) (fields_autoplaced)
    (uuid 266562f4-8072-411f-8c4b-eb5f9e700261)
    (property "Reference" "C14" (id 0) (at 84.455 58.42 90))
    (property "Value" "0.1uF" (id 1) (at 84.455 60.96 90))
    (property "Footprint" "Capacitor_SMD:C_0603_1608Metric" (id 2) (at 88.265 63.1698 0)
      (effects (font (size 1.27 1.27)) hide)
    )
    (property "Datasheet" "~" (id 3) (at 84.455 64.135 0)
      (effects (font (size 1.27 1.27)) hide)
    )
    (pin "1" (uuid 65f391ba-2208-4f11-af52-25e1642e32ef))
    (pin "2" (uuid 9cbba058-b7c6-483c-9109-6180c0917750))
  )

  (symbol (lib_id "power:+5V") (at 245.11 96.52 0) (unit 1)
    (in_bom yes) (on_board yes) (fields_autoplaced)
    (uuid 2ddf5b7d-9625-463e-a964-b16f379d75dd)
    (property "Reference" "#PWR0142" (id 0) (at 245.11 100.33 0)
      (effects (font (size 1.27 1.27)) hide)
    )
    (property "Value" "+5V" (id 1) (at 245.11 92.71 0))
    (property "Footprint" "" (id 2) (at 245.11 96.52 0)
      (effects (font (size 1.27 1.27)) hide)
    )
    (property "Datasheet" "" (id 3) (at 245.11 96.52 0)
      (effects (font (size 1.27 1.27)) hide)
    )
    (pin "1" (uuid c28d788e-9849-422f-9493-2944d16f7df8))
  )

  (symbol (lib_id "power:GND") (at 123.19 101.6 90) (unit 1)
    (in_bom yes) (on_board yes) (fields_autoplaced)
    (uuid 32668480-c9bb-4100-b9bd-8425a2fd69f5)
    (property "Reference" "#PWR0114" (id 0) (at 129.54 101.6 0)
      (effects (font (size 1.27 1.27)) hide)
    )
    (property "Value" "GND" (id 1) (at 127 101.5999 90)
      (effects (font (size 1.27 1.27)) (justify right))
    )
    (property "Footprint" "" (id 2) (at 123.19 101.6 0)
      (effects (font (size 1.27 1.27)) hide)
    )
    (property "Datasheet" "" (id 3) (at 123.19 101.6 0)
      (effects (font (size 1.27 1.27)) hide)
    )
    (pin "1" (uuid 6c70676e-7cf2-43f1-a27c-222ca96a6dbd))
  )

  (symbol (lib_id "power:GND") (at 101.6 129.54 0) (unit 1)
    (in_bom yes) (on_board yes) (fields_autoplaced)
    (uuid 3af8902a-5039-4a4e-b3e8-4c830b99f094)
    (property "Reference" "#PWR0113" (id 0) (at 101.6 135.89 0)
      (effects (font (size 1.27 1.27)) hide)
    )
    (property "Value" "GND" (id 1) (at 101.6 133.985 0))
    (property "Footprint" "" (id 2) (at 101.6 129.54 0)
      (effects (font (size 1.27 1.27)) hide)
    )
    (property "Datasheet" "" (id 3) (at 101.6 129.54 0)
      (effects (font (size 1.27 1.27)) hide)
    )
    (pin "1" (uuid 86402760-01a8-46db-906f-76ec608722ba))
  )

  (symbol (lib_id "power:GND") (at 179.705 85.725 180) (unit 1)
    (in_bom yes) (on_board yes) (fields_autoplaced)
    (uuid 44214432-d118-4753-9545-ad50fa8947d7)
    (property "Reference" "#PWR0123" (id 0) (at 179.705 79.375 0)
      (effects (font (size 1.27 1.27)) hide)
    )
    (property "Value" "GND" (id 1) (at 179.705 80.01 0))
    (property "Footprint" "" (id 2) (at 179.705 85.725 0)
      (effects (font (size 1.27 1.27)) hide)
    )
    (property "Datasheet" "" (id 3) (at 179.705 85.725 0)
      (effects (font (size 1.27 1.27)) hide)
    )
    (pin "1" (uuid 2649565d-9488-4128-bf72-74cdf44a126c))
  )

  (symbol (lib_id "power:+3V3") (at 227.33 80.645 0) (unit 1)
    (in_bom yes) (on_board yes) (fields_autoplaced)
    (uuid 4a9a20bf-875c-4064-9f95-de4d399f4159)
    (property "Reference" "#PWR0119" (id 0) (at 227.33 84.455 0)
      (effects (font (size 1.27 1.27)) hide)
    )
    (property "Value" "+3V3" (id 1) (at 227.33 74.93 0))
    (property "Footprint" "" (id 2) (at 227.33 80.645 0)
      (effects (font (size 1.27 1.27)) hide)
    )
    (property "Datasheet" "" (id 3) (at 227.33 80.645 0)
      (effects (font (size 1.27 1.27)) hide)
    )
    (pin "1" (uuid fb185876-91e9-4389-a3b8-eebf4c81d352))
  )

  (symbol (lib_id "Interface_UART:MAX3485") (at 227.33 101.6 0) (unit 1)
    (in_bom yes) (on_board yes)
    (uuid 50278318-b83e-4cb7-a71e-b95ab3f148de)
    (property "Reference" "U3" (id 0) (at 218.44 84.455 0))
    (property "Value" "MAX3485" (id 1) (at 218.44 86.995 0))
    (property "Footprint" "Package_SO:SOIC-8_3.9x4.9mm_P1.27mm" (id 2) (at 227.33 119.38 0)
      (effects (font (size 1.27 1.27)) hide)
    )
    (property "Datasheet" "https://datasheets.maximintegrated.com/en/ds/MAX3483-MAX3491.pdf" (id 3) (at 227.33 100.33 0)
      (effects (font (size 1.27 1.27)) hide)
    )
    (pin "1" (uuid be356e4d-82fb-4c3b-be7e-7bf41f06208b))
    (pin "2" (uuid 30d381ee-09c2-486b-92da-ecd0fb7cd203))
    (pin "3" (uuid af5ba8f9-ab12-4bac-9e76-bae1d59c96b6))
    (pin "4" (uuid 2de6eb42-6178-45c9-b310-df233a4579b8))
    (pin "5" (uuid b5b98a52-b21d-4ef0-ab26-a8132a1bb245))
    (pin "6" (uuid 5b7c4bac-c51d-4ffc-bafa-fddf43a50cd1))
    (pin "7" (uuid 7abb5182-6376-4dbf-bdbe-da1cc0aa49b6))
    (pin "8" (uuid 62ab81ce-4172-4634-8bdc-b15ce7c94d35))
  )

  (symbol (lib_id "power:GND") (at 227.33 116.84 0) (unit 1)
    (in_bom yes) (on_board yes)
    (uuid 55ed2d86-996e-4b44-b7ac-457a0f81d6c0)
    (property "Reference" "#PWR0122" (id 0) (at 227.33 123.19 0)
      (effects (font (size 1.27 1.27)) hide)
    )
    (property "Value" "GND" (id 1) (at 231.14 118.745 0))
    (property "Footprint" "" (id 2) (at 227.33 116.84 0)
      (effects (font (size 1.27 1.27)) hide)
    )
    (property "Datasheet" "" (id 3) (at 227.33 116.84 0)
      (effects (font (size 1.27 1.27)) hide)
    )
    (pin "1" (uuid c3d59639-4b5b-4bb2-976f-1204c5908852))
  )

  (symbol (lib_id "Device:R") (at 187.96 92.71 0) (unit 1)
    (in_bom yes) (on_board yes)
    (uuid 566ff899-47fd-4c2e-bbd7-132877fd0725)
    (property "Reference" "R16" (id 0) (at 189.865 91.4399 0)
      (effects (font (size 1.27 1.27)) (justify left))
    )
    (property "Value" "10K" (id 1) (at 189.865 93.9799 0)
      (effects (font (size 1.27 1.27)) (justify left))
    )
    (property "Footprint" "Resistor_SMD:R_0603_1608Metric" (id 2) (at 186.182 92.71 90)
      (effects (font (size 1.27 1.27)) hide)
    )
    (property "Datasheet" "~" (id 3) (at 187.96 92.71 0)
      (effects (font (size 1.27 1.27)) hide)
    )
    (pin "1" (uuid 4d5b6ce2-a6a8-4604-9682-35d78875be85))
    (pin "2" (uuid 249b0fe3-8e53-484a-837e-29da87a2028a))
  )

  (symbol (lib_id "Device:C") (at 114.935 101.6 90) (unit 1)
    (in_bom yes) (on_board yes)
    (uuid 574b1b82-72d6-4593-9bb6-127183fcaf58)
    (property "Reference" "C17" (id 0) (at 114.935 105.41 90))
    (property "Value" "0.1 uF" (id 1) (at 114.935 107.95 90))
    (property "Footprint" "Capacitor_SMD:C_0603_1608Metric" (id 2) (at 118.745 100.6348 0)
      (effects (font (size 1.27 1.27)) hide)
    )
    (property "Datasheet" "~" (id 3) (at 114.935 101.6 0)
      (effects (font (size 1.27 1.27)) hide)
    )
    (pin "1" (uuid cb7cea8e-a402-4ee6-aba8-5db4ef8d7894))
    (pin "2" (uuid 5a989783-b3f1-4e79-9e37-ab0b73e73987))
  )

  (symbol (lib_id "power:GND") (at 76.2 137.16 0) (unit 1)
    (in_bom yes) (on_board yes) (fields_autoplaced)
    (uuid 62b6e22a-9882-412c-b57c-43ab9232a959)
    (property "Reference" "#PWR0112" (id 0) (at 76.2 143.51 0)
      (effects (font (size 1.27 1.27)) hide)
    )
    (property "Value" "GND" (id 1) (at 76.2 141.605 0))
    (property "Footprint" "" (id 2) (at 76.2 137.16 0)
      (effects (font (size 1.27 1.27)) hide)
    )
    (property "Datasheet" "" (id 3) (at 76.2 137.16 0)
      (effects (font (size 1.27 1.27)) hide)
    )
    (pin "1" (uuid 6e3b9f0d-c57e-42a7-96bd-bebd2a7c0104))
  )

  (symbol (lib_id "Device:C") (at 50.8 85.09 0) (unit 1)
    (in_bom yes) (on_board yes) (fields_autoplaced)
    (uuid 63f5d5de-4ee8-404e-ba29-e1cd4c74e7b0)
    (property "Reference" "C13" (id 0) (at 53.975 83.8199 0)
      (effects (font (size 1.27 1.27)) (justify left))
    )
    (property "Value" "0.1uF" (id 1) (at 53.975 86.3599 0)
      (effects (font (size 1.27 1.27)) (justify left))
    )
    (property "Footprint" "Capacitor_SMD:C_0603_1608Metric" (id 2) (at 51.7652 88.9 0)
      (effects (font (size 1.27 1.27)) hide)
    )
    (property "Datasheet" "~" (id 3) (at 50.8 85.09 0)
      (effects (font (size 1.27 1.27)) hide)
    )
    (pin "1" (uuid b95c277d-c619-4be9-8399-0d5359b285ec))
    (pin "2" (uuid 65ef21b6-615b-42e4-a858-ce16ce4ec41a))
  )

  (symbol (lib_id "Connector_Generic:Conn_01x04") (at 254 101.6 0) (unit 1)
    (in_bom yes) (on_board yes) (fields_autoplaced)
    (uuid 67ceb027-efd5-4a76-9cc7-7dea52e983d5)
    (property "Reference" "J8" (id 0) (at 256.54 101.5999 0)
      (effects (font (size 1.27 1.27)) (justify left))
    )
    (property "Value" "Conn_01x04" (id 1) (at 256.54 104.1399 0)
      (effects (font (size 1.27 1.27)) (justify left))
    )
    (property "Footprint" "TerminalBlock:TerminalBlock_bornier-4_P5.08mm" (id 2) (at 254 101.6 0)
      (effects (font (size 1.27 1.27)) hide)
    )
    (property "Datasheet" "~" (id 3) (at 254 101.6 0)
      (effects (font (size 1.27 1.27)) hide)
    )
    (pin "1" (uuid 1f6a9a75-2989-4772-9724-70bb22d81d32))
    (pin "2" (uuid 004cb171-610f-409b-9cc0-6121a6939365))
    (pin "3" (uuid 13bd4853-7d3f-49af-a8a6-4df7ad71b057))
    (pin "4" (uuid a2fc0b41-187c-4bc9-a377-19a27a9e24bb))
  )

  (symbol (lib_id "power:GND") (at 179.705 121.285 0) (unit 1)
    (in_bom yes) (on_board yes) (fields_autoplaced)
    (uuid 85f8ccdc-bb55-41b5-ac33-57fc37141eb2)
    (property "Reference" "#PWR0120" (id 0) (at 179.705 127.635 0)
      (effects (font (size 1.27 1.27)) hide)
    )
    (property "Value" "GND" (id 1) (at 179.705 127 0))
    (property "Footprint" "" (id 2) (at 179.705 121.285 0)
      (effects (font (size 1.27 1.27)) hide)
    )
    (property "Datasheet" "" (id 3) (at 179.705 121.285 0)
      (effects (font (size 1.27 1.27)) hide)
    )
    (pin "1" (uuid ac98e59c-50c9-4360-a043-6399465a6ef4))
  )

  (symbol (lib_id "power:GND") (at 92.075 64.135 90) (unit 1)
    (in_bom yes) (on_board yes) (fields_autoplaced)
    (uuid 878fbcbe-35d7-4374-aaad-a2fe810baa37)
    (property "Reference" "#PWR0116" (id 0) (at 98.425 64.135 0)
      (effects (font (size 1.27 1.27)) hide)
    )
    (property "Value" "GND" (id 1) (at 96.52 64.1349 90)
      (effects (font (size 1.27 1.27)) (justify right))
    )
    (property "Footprint" "" (id 2) (at 92.075 64.135 0)
      (effects (font (size 1.27 1.27)) hide)
    )
    (property "Datasheet" "" (id 3) (at 92.075 64.135 0)
      (effects (font (size 1.27 1.27)) hide)
    )
    (pin "1" (uuid baae7b3c-e503-4d7d-9093-82b6d3f49b49))
  )

  (symbol (lib_id "Interface_UART:MAX3232") (at 76.2 104.14 0) (unit 1)
    (in_bom yes) (on_board yes)
    (uuid 8be0c96f-7fdc-4f92-aafc-01c0f6c570f8)
    (property "Reference" "U2" (id 0) (at 67.31 72.39 0))
    (property "Value" "MAX3232" (id 1) (at 67.31 74.93 0))
    (property "Footprint" "Package_SO:SOIC-16W_7.5x10.3mm_P1.27mm" (id 2) (at 77.47 130.81 0)
      (effects (font (size 1.27 1.27)) (justify left) hide)
    )
    (property "Datasheet" "https://datasheets.maximintegrated.com/en/ds/MAX3222-MAX3241.pdf" (id 3) (at 76.2 101.6 0)
      (effects (font (size 1.27 1.27)) hide)
    )
    (pin "1" (uuid 3f2a624f-25b3-479e-a7e8-2069a0a64171))
    (pin "10" (uuid 3bff8812-a351-403a-b5f6-7b975d7b13f6))
    (pin "11" (uuid 75aaaa33-5cd7-4790-8fe4-5e5624790458))
    (pin "12" (uuid 11ac749c-b61b-4a0e-a1b0-4c04c1f635be))
    (pin "13" (uuid 9c376bd6-5b10-4f77-9a85-8b7b20af1bdc))
    (pin "14" (uuid e0fc8930-de64-4312-af68-f92481d52f97))
    (pin "15" (uuid 9156dfe6-8389-44dc-b122-92cb93b66d9f))
    (pin "16" (uuid 5957a356-9904-40cb-9423-126ed76fe0f4))
    (pin "2" (uuid 3d3fe6d6-28ed-4b38-915e-28d3308a68a5))
    (pin "3" (uuid 9251067b-ce1d-43a7-96df-e89183e33b4d))
    (pin "4" (uuid c1427b99-1807-491a-bac5-a2105094996a))
    (pin "5" (uuid 5ea25ac0-da4d-49ba-bcf1-5f05fd41fbc3))
    (pin "6" (uuid f91e6387-f4aa-4d25-a44f-059e80a4266b))
    (pin "7" (uuid b1f9b222-d01e-46a2-8a53-c14b397d25b4))
    (pin "8" (uuid d703a4da-f612-4f68-801d-c5ebcc3aff40))
    (pin "9" (uuid 74401a83-7fa8-46ce-9d3d-c76eaeb0704a))
  )

  (symbol (lib_id "Device:R") (at 179.705 92.71 0) (unit 1)
    (in_bom yes) (on_board yes)
    (uuid a3bd2e52-5a1c-4e46-89bd-a08e34518c91)
    (property "Reference" "R11" (id 0) (at 181.61 91.4399 0)
      (effects (font (size 1.27 1.27)) (justify left))
    )
    (property "Value" "10K" (id 1) (at 181.61 93.9799 0)
      (effects (font (size 1.27 1.27)) (justify left))
    )
    (property "Footprint" "Resistor_SMD:R_0603_1608Metric" (id 2) (at 177.927 92.71 90)
      (effects (font (size 1.27 1.27)) hide)
    )
    (property "Datasheet" "~" (id 3) (at 179.705 92.71 0)
      (effects (font (size 1.27 1.27)) hide)
    )
    (pin "1" (uuid 82bdeb96-5668-4da3-aaa7-2bb192f3b400))
    (pin "2" (uuid abdf630c-d25c-4332-ba63-c23035a33c35))
  )

  (symbol (lib_id "power:GND") (at 245.745 85.09 90) (unit 1)
    (in_bom yes) (on_board yes) (fields_autoplaced)
    (uuid a5deac56-2401-49ed-a0a6-c9b9c0be40a7)
    (property "Reference" "#PWR0124" (id 0) (at 252.095 85.09 0)
      (effects (font (size 1.27 1.27)) hide)
    )
    (property "Value" "GND" (id 1) (at 250.19 85.0899 90)
      (effects (font (size 1.27 1.27)) (justify right))
    )
    (property "Footprint" "" (id 2) (at 245.745 85.09 0)
      (effects (font (size 1.27 1.27)) hide)
    )
    (property "Datasheet" "" (id 3) (at 245.745 85.09 0)
      (effects (font (size 1.27 1.27)) hide)
    )
    (pin "1" (uuid fd0ac7b4-6433-4f13-97bf-070c4c39f0e2))
  )

  (symbol (lib_id "power:+3V3") (at 187.96 85.09 0) (unit 1)
    (in_bom yes) (on_board yes) (fields_autoplaced)
    (uuid b07ef5e1-157f-41b4-8361-bef518106dc9)
    (property "Reference" "#PWR0118" (id 0) (at 187.96 88.9 0)
      (effects (font (size 1.27 1.27)) hide)
    )
    (property "Value" "+3V3" (id 1) (at 187.96 80.01 0))
    (property "Footprint" "" (id 2) (at 187.96 85.09 0)
      (effects (font (size 1.27 1.27)) hide)
    )
    (property "Datasheet" "" (id 3) (at 187.96 85.09 0)
      (effects (font (size 1.27 1.27)) hide)
    )
    (pin "1" (uuid ac4b8897-3be5-49d4-ab7d-4026f1197eea))
  )

  (symbol (lib_id "Connector_Generic:Conn_01x04") (at 116.205 121.285 0) (unit 1)
    (in_bom yes) (on_board yes) (fields_autoplaced)
    (uuid c26a8918-9d86-4390-8dec-d4c62a0b0244)
    (property "Reference" "J7" (id 0) (at 118.745 121.2849 0)
      (effects (font (size 1.27 1.27)) (justify left))
    )
    (property "Value" "Conn_01x04" (id 1) (at 118.745 123.8249 0)
      (effects (font (size 1.27 1.27)) (justify left))
    )
    (property "Footprint" "TerminalBlock:TerminalBlock_bornier-4_P5.08mm" (id 2) (at 116.205 121.285 0)
      (effects (font (size 1.27 1.27)) hide)
    )
    (property "Datasheet" "~" (id 3) (at 116.205 121.285 0)
      (effects (font (size 1.27 1.27)) hide)
    )
    (pin "1" (uuid 611b357e-cdf2-43d9-8ef7-18fe2e544adb))
    (pin "2" (uuid c30bf658-8b1c-4771-8c4d-9db2ea1c7b6c))
    (pin "3" (uuid 8bb19dc6-1efe-4df1-8344-e4349c5aa617))
    (pin "4" (uuid a0aadfb9-2e18-400a-ab44-b456527120e3))
  )

  (symbol (lib_id "power:GND") (at 244.348 110.49 0) (unit 1)
    (in_bom yes) (on_board yes) (fields_autoplaced)
    (uuid ddf025a2-b16c-4640-a30c-04c46c258c45)
    (property "Reference" "#PWR0121" (id 0) (at 244.348 116.84 0)
      (effects (font (size 1.27 1.27)) hide)
    )
    (property "Value" "GND" (id 1) (at 244.348 115.57 0))
    (property "Footprint" "" (id 2) (at 244.348 110.49 0)
      (effects (font (size 1.27 1.27)) hide)
    )
    (property "Datasheet" "" (id 3) (at 244.348 110.49 0)
      (effects (font (size 1.27 1.27)) hide)
    )
    (pin "1" (uuid 79817fb0-0b7e-42e4-8499-3be2faeec112))
  )

  (symbol (lib_id "power:GND") (at 123.19 93.98 90) (unit 1)
    (in_bom yes) (on_board yes) (fields_autoplaced)
    (uuid e97c83b0-833d-4ff5-bf27-759a73e045ac)
    (property "Reference" "#PWR0115" (id 0) (at 129.54 93.98 0)
      (effects (font (size 1.27 1.27)) hide)
    )
    (property "Value" "GND" (id 1) (at 127 93.9799 90)
      (effects (font (size 1.27 1.27)) (justify right))
    )
    (property "Footprint" "" (id 2) (at 123.19 93.98 0)
      (effects (font (size 1.27 1.27)) hide)
    )
    (property "Datasheet" "" (id 3) (at 123.19 93.98 0)
      (effects (font (size 1.27 1.27)) hide)
    )
    (pin "1" (uuid 80c9eb8c-5f7f-4266-89ac-81bc81800ba7))
  )

  (symbol (lib_id "power:+5V") (at 107.7546 116.9719 0) (unit 1)
    (in_bom yes) (on_board yes)
    (uuid ea345958-eb21-47a5-9972-b0be9d2d711d)
    (property "Reference" "#PWR0141" (id 0) (at 107.7546 120.7819 0)
      (effects (font (size 1.27 1.27)) hide)
    )
    (property "Value" "+5V" (id 1) (at 108.1495 113.5026 0))
    (property "Footprint" "" (id 2) (at 107.7546 116.9719 0)
      (effects (font (size 1.27 1.27)) hide)
    )
    (property "Datasheet" "" (id 3) (at 107.7546 116.9719 0)
      (effects (font (size 1.27 1.27)) hide)
    )
    (pin "1" (uuid 7c0e7a59-23cc-4cbc-b799-e7ec9e10b922))
  )

  (symbol (lib_id "Device:C") (at 101.6 85.09 0) (unit 1)
    (in_bom yes) (on_board yes) (fields_autoplaced)
    (uuid f8ea2186-7b00-4516-b069-5981804dbd1a)
    (property "Reference" "C15" (id 0) (at 104.775 83.8199 0)
      (effects (font (size 1.27 1.27)) (justify left))
    )
    (property "Value" "0.1uF" (id 1) (at 104.775 86.3599 0)
      (effects (font (size 1.27 1.27)) (justify left))
    )
    (property "Footprint" "Capacitor_SMD:C_0603_1608Metric" (id 2) (at 102.5652 88.9 0)
      (effects (font (size 1.27 1.27)) hide)
    )
    (property "Datasheet" "~" (id 3) (at 101.6 85.09 0)
      (effects (font (size 1.27 1.27)) hide)
    )
    (pin "1" (uuid 2bc88b35-2356-4f07-be42-005a60afbcc9))
    (pin "2" (uuid 22c3b72b-d79a-4b8b-986b-a8a4a5f9a142))
  )

  (symbol (lib_id "Device:C") (at 236.22 85.09 90) (unit 1)
    (in_bom yes) (on_board yes)
    (uuid fd5d5018-facb-43c8-b81f-3c21a40813f5)
    (property "Reference" "C19" (id 0) (at 236.22 77.47 90))
    (property "Value" "0.1uF" (id 1) (at 236.22 80.01 90))
    (property "Footprint" "Capacitor_SMD:C_0603_1608Metric" (id 2) (at 240.03 84.1248 0)
      (effects (font (size 1.27 1.27)) hide)
    )
    (property "Datasheet" "~" (id 3) (at 236.22 85.09 0)
      (effects (font (size 1.27 1.27)) hide)
    )
    (pin "1" (uuid 3715c83e-a210-4468-ae4a-8f57993275bd))
    (pin "2" (uuid b313fb5f-19a8-42d6-b3d4-13827e2be7a1))
  )
)
