%TF.GenerationSoftware,KiCad,Pcbnew,(5.99.0-11022-g0527dc6fe0)*%
%TF.CreationDate,2021-10-16T17:35:28-07:00*%
%TF.ProjectId,Botz Board V1,426f747a-2042-46f6-9172-642056312e6b,rev?*%
%TF.SameCoordinates,Original*%
%TF.FileFunction,Legend,Bot*%
%TF.FilePolarity,Positive*%
%FSLAX46Y46*%
G04 Gerber Fmt 4.6, Leading zero omitted, Abs format (unit mm)*
G04 Created by KiCad (PCBNEW (5.99.0-11022-g0527dc6fe0)) date 2021-10-16 17:35:28*
%MOMM*%
%LPD*%
G01*
G04 APERTURE LIST*
%ADD10C,0.125000*%
%ADD11C,0.150000*%
%ADD12C,0.250000*%
G04 APERTURE END LIST*
D10*
X111395238Y-57883333D02*
X111157142Y-57883333D01*
X111442857Y-58026190D02*
X111276190Y-57526190D01*
X111109523Y-58026190D01*
X110680952Y-58026190D02*
X110966666Y-58026190D01*
X110823809Y-58026190D02*
X110823809Y-57526190D01*
X110871428Y-57597619D01*
X110919047Y-57645238D01*
X110966666Y-57669047D01*
X110371428Y-57526190D02*
X110323809Y-57526190D01*
X110276190Y-57550000D01*
X110252380Y-57573809D01*
X110228571Y-57621428D01*
X110204761Y-57716666D01*
X110204761Y-57835714D01*
X110228571Y-57930952D01*
X110252380Y-57978571D01*
X110276190Y-58002380D01*
X110323809Y-58026190D01*
X110371428Y-58026190D01*
X110419047Y-58002380D01*
X110442857Y-57978571D01*
X110466666Y-57930952D01*
X110490476Y-57835714D01*
X110490476Y-57716666D01*
X110466666Y-57621428D01*
X110442857Y-57573809D01*
X110419047Y-57550000D01*
X110371428Y-57526190D01*
D11*
X153223809Y-47257142D02*
X153271428Y-47304761D01*
X153414285Y-47352380D01*
X153509523Y-47352380D01*
X153652380Y-47304761D01*
X153747619Y-47209523D01*
X153795238Y-47114285D01*
X153842857Y-46923809D01*
X153842857Y-46780952D01*
X153795238Y-46590476D01*
X153747619Y-46495238D01*
X153652380Y-46400000D01*
X153509523Y-46352380D01*
X153414285Y-46352380D01*
X153271428Y-46400000D01*
X153223809Y-46447619D01*
X152842857Y-47066666D02*
X152366666Y-47066666D01*
X152938095Y-47352380D02*
X152604761Y-46352380D01*
X152271428Y-47352380D01*
X151938095Y-47352380D02*
X151938095Y-46352380D01*
X151366666Y-47352380D01*
X151366666Y-46352380D01*
X150366666Y-47352380D02*
X150938095Y-47352380D01*
X150652380Y-47352380D02*
X150652380Y-46352380D01*
X150747619Y-46495238D01*
X150842857Y-46590476D01*
X150938095Y-46638095D01*
X150176190Y-47447619D02*
X149414285Y-47447619D01*
X149176190Y-47352380D02*
X149176190Y-46352380D01*
X149176190Y-46828571D02*
X148604761Y-46828571D01*
X148604761Y-47352380D02*
X148604761Y-46352380D01*
X154904761Y-66852380D02*
X154904761Y-65852380D01*
X154428571Y-66852380D02*
X154428571Y-65852380D01*
X153857142Y-66852380D01*
X153857142Y-65852380D01*
X153523809Y-65852380D02*
X152952380Y-65852380D01*
X153238095Y-66852380D02*
X153238095Y-65852380D01*
X120554761Y-47407142D02*
X120602380Y-47454761D01*
X120745238Y-47502380D01*
X120840476Y-47502380D01*
X120983333Y-47454761D01*
X121078571Y-47359523D01*
X121126190Y-47264285D01*
X121173809Y-47073809D01*
X121173809Y-46930952D01*
X121126190Y-46740476D01*
X121078571Y-46645238D01*
X120983333Y-46550000D01*
X120840476Y-46502380D01*
X120745238Y-46502380D01*
X120602380Y-46550000D01*
X120554761Y-46597619D01*
X120173809Y-47216666D02*
X119697619Y-47216666D01*
X120269047Y-47502380D02*
X119935714Y-46502380D01*
X119602380Y-47502380D01*
X119269047Y-47502380D02*
X119269047Y-46502380D01*
X118697619Y-47502380D01*
X118697619Y-46502380D01*
X118269047Y-46597619D02*
X118221428Y-46550000D01*
X118126190Y-46502380D01*
X117888095Y-46502380D01*
X117792857Y-46550000D01*
X117745238Y-46597619D01*
X117697619Y-46692857D01*
X117697619Y-46788095D01*
X117745238Y-46930952D01*
X118316666Y-47502380D01*
X117697619Y-47502380D01*
X117507142Y-47597619D02*
X116745238Y-47597619D01*
X116030952Y-47502380D02*
X116507142Y-47502380D01*
X116507142Y-46502380D01*
X126273809Y-47357142D02*
X126321428Y-47404761D01*
X126464285Y-47452380D01*
X126559523Y-47452380D01*
X126702380Y-47404761D01*
X126797619Y-47309523D01*
X126845238Y-47214285D01*
X126892857Y-47023809D01*
X126892857Y-46880952D01*
X126845238Y-46690476D01*
X126797619Y-46595238D01*
X126702380Y-46500000D01*
X126559523Y-46452380D01*
X126464285Y-46452380D01*
X126321428Y-46500000D01*
X126273809Y-46547619D01*
X125892857Y-47166666D02*
X125416666Y-47166666D01*
X125988095Y-47452380D02*
X125654761Y-46452380D01*
X125321428Y-47452380D01*
X124988095Y-47452380D02*
X124988095Y-46452380D01*
X124416666Y-47452380D01*
X124416666Y-46452380D01*
X123988095Y-46547619D02*
X123940476Y-46500000D01*
X123845238Y-46452380D01*
X123607142Y-46452380D01*
X123511904Y-46500000D01*
X123464285Y-46547619D01*
X123416666Y-46642857D01*
X123416666Y-46738095D01*
X123464285Y-46880952D01*
X124035714Y-47452380D01*
X123416666Y-47452380D01*
X123226190Y-47547619D02*
X122464285Y-47547619D01*
X122226190Y-47452380D02*
X122226190Y-46452380D01*
X122226190Y-46928571D02*
X121654761Y-46928571D01*
X121654761Y-47452380D02*
X121654761Y-46452380D01*
X142285714Y-83471428D02*
X141523809Y-83471428D01*
X141904761Y-83852380D02*
X141904761Y-83090476D01*
X140571428Y-82852380D02*
X141047619Y-82852380D01*
X141095238Y-83328571D01*
X141047619Y-83280952D01*
X140952380Y-83233333D01*
X140714285Y-83233333D01*
X140619047Y-83280952D01*
X140571428Y-83328571D01*
X140523809Y-83423809D01*
X140523809Y-83661904D01*
X140571428Y-83757142D01*
X140619047Y-83804761D01*
X140714285Y-83852380D01*
X140952380Y-83852380D01*
X141047619Y-83804761D01*
X141095238Y-83757142D01*
X140238095Y-82852380D02*
X139904761Y-83852380D01*
X139571428Y-82852380D01*
X112992857Y-77359523D02*
X112992857Y-76750000D01*
X112688095Y-77054761D02*
X113297619Y-77054761D01*
X113488095Y-76445238D02*
X113488095Y-75950000D01*
X113183333Y-76216666D01*
X113183333Y-76102380D01*
X113145238Y-76026190D01*
X113107142Y-75988095D01*
X113030952Y-75950000D01*
X112840476Y-75950000D01*
X112764285Y-75988095D01*
X112726190Y-76026190D01*
X112688095Y-76102380D01*
X112688095Y-76330952D01*
X112726190Y-76407142D01*
X112764285Y-76445238D01*
X113488095Y-75721428D02*
X112688095Y-75454761D01*
X113488095Y-75188095D01*
X113488095Y-74997619D02*
X113488095Y-74502380D01*
X113183333Y-74769047D01*
X113183333Y-74654761D01*
X113145238Y-74578571D01*
X113107142Y-74540476D01*
X113030952Y-74502380D01*
X112840476Y-74502380D01*
X112764285Y-74540476D01*
X112726190Y-74578571D01*
X112688095Y-74654761D01*
X112688095Y-74883333D01*
X112726190Y-74959523D01*
X112764285Y-74997619D01*
X151166666Y-83852380D02*
X151500000Y-83376190D01*
X151738095Y-83852380D02*
X151738095Y-82852380D01*
X151357142Y-82852380D01*
X151261904Y-82900000D01*
X151214285Y-82947619D01*
X151166666Y-83042857D01*
X151166666Y-83185714D01*
X151214285Y-83280952D01*
X151261904Y-83328571D01*
X151357142Y-83376190D01*
X151738095Y-83376190D01*
X150833333Y-82852380D02*
X150166666Y-83852380D01*
X150166666Y-82852380D02*
X150833333Y-83852380D01*
X141561904Y-46400000D02*
X141657142Y-46352380D01*
X141800000Y-46352380D01*
X141942857Y-46400000D01*
X142038095Y-46495238D01*
X142085714Y-46590476D01*
X142133333Y-46780952D01*
X142133333Y-46923809D01*
X142085714Y-47114285D01*
X142038095Y-47209523D01*
X141942857Y-47304761D01*
X141800000Y-47352380D01*
X141704761Y-47352380D01*
X141561904Y-47304761D01*
X141514285Y-47257142D01*
X141514285Y-46923809D01*
X141704761Y-46923809D01*
X141085714Y-47352380D02*
X141085714Y-46352380D01*
X140514285Y-47352380D01*
X140514285Y-46352380D01*
X140038095Y-47352380D02*
X140038095Y-46352380D01*
X139800000Y-46352380D01*
X139657142Y-46400000D01*
X139561904Y-46495238D01*
X139514285Y-46590476D01*
X139466666Y-46780952D01*
X139466666Y-46923809D01*
X139514285Y-47114285D01*
X139561904Y-47209523D01*
X139657142Y-47304761D01*
X139800000Y-47352380D01*
X140038095Y-47352380D01*
X155761904Y-64271428D02*
X155000000Y-64271428D01*
X155380952Y-64652380D02*
X155380952Y-63890476D01*
X154619047Y-63652380D02*
X154000000Y-63652380D01*
X154333333Y-64033333D01*
X154190476Y-64033333D01*
X154095238Y-64080952D01*
X154047619Y-64128571D01*
X154000000Y-64223809D01*
X154000000Y-64461904D01*
X154047619Y-64557142D01*
X154095238Y-64604761D01*
X154190476Y-64652380D01*
X154476190Y-64652380D01*
X154571428Y-64604761D01*
X154619047Y-64557142D01*
X153714285Y-63652380D02*
X153380952Y-64652380D01*
X153047619Y-63652380D01*
X152809523Y-63652380D02*
X152190476Y-63652380D01*
X152523809Y-64033333D01*
X152380952Y-64033333D01*
X152285714Y-64080952D01*
X152238095Y-64128571D01*
X152190476Y-64223809D01*
X152190476Y-64461904D01*
X152238095Y-64557142D01*
X152285714Y-64604761D01*
X152380952Y-64652380D01*
X152666666Y-64652380D01*
X152761904Y-64604761D01*
X152809523Y-64557142D01*
X155911904Y-51321428D02*
X155150000Y-51321428D01*
X155530952Y-51702380D02*
X155530952Y-50940476D01*
X154769047Y-50702380D02*
X154150000Y-50702380D01*
X154483333Y-51083333D01*
X154340476Y-51083333D01*
X154245238Y-51130952D01*
X154197619Y-51178571D01*
X154150000Y-51273809D01*
X154150000Y-51511904D01*
X154197619Y-51607142D01*
X154245238Y-51654761D01*
X154340476Y-51702380D01*
X154626190Y-51702380D01*
X154721428Y-51654761D01*
X154769047Y-51607142D01*
X153864285Y-50702380D02*
X153530952Y-51702380D01*
X153197619Y-50702380D01*
X152959523Y-50702380D02*
X152340476Y-50702380D01*
X152673809Y-51083333D01*
X152530952Y-51083333D01*
X152435714Y-51130952D01*
X152388095Y-51178571D01*
X152340476Y-51273809D01*
X152340476Y-51511904D01*
X152388095Y-51607142D01*
X152435714Y-51654761D01*
X152530952Y-51702380D01*
X152816666Y-51702380D01*
X152911904Y-51654761D01*
X152959523Y-51607142D01*
D10*
X111202380Y-67764285D02*
X111130952Y-67788095D01*
X111107142Y-67811904D01*
X111083333Y-67859523D01*
X111083333Y-67930952D01*
X111107142Y-67978571D01*
X111130952Y-68002380D01*
X111178571Y-68026190D01*
X111369047Y-68026190D01*
X111369047Y-67526190D01*
X111202380Y-67526190D01*
X111154761Y-67550000D01*
X111130952Y-67573809D01*
X111107142Y-67621428D01*
X111107142Y-67669047D01*
X111130952Y-67716666D01*
X111154761Y-67740476D01*
X111202380Y-67764285D01*
X111369047Y-67764285D01*
X110845238Y-68026190D02*
X110750000Y-68026190D01*
X110702380Y-68002380D01*
X110678571Y-67978571D01*
X110630952Y-67907142D01*
X110607142Y-67811904D01*
X110607142Y-67621428D01*
X110630952Y-67573809D01*
X110654761Y-67550000D01*
X110702380Y-67526190D01*
X110797619Y-67526190D01*
X110845238Y-67550000D01*
X110869047Y-67573809D01*
X110892857Y-67621428D01*
X110892857Y-67740476D01*
X110869047Y-67788095D01*
X110845238Y-67811904D01*
X110797619Y-67835714D01*
X110702380Y-67835714D01*
X110654761Y-67811904D01*
X110630952Y-67788095D01*
X110607142Y-67740476D01*
D11*
X115285714Y-83471428D02*
X114523809Y-83471428D01*
X114904761Y-83852380D02*
X114904761Y-83090476D01*
X113571428Y-82852380D02*
X114047619Y-82852380D01*
X114095238Y-83328571D01*
X114047619Y-83280952D01*
X113952380Y-83233333D01*
X113714285Y-83233333D01*
X113619047Y-83280952D01*
X113571428Y-83328571D01*
X113523809Y-83423809D01*
X113523809Y-83661904D01*
X113571428Y-83757142D01*
X113619047Y-83804761D01*
X113714285Y-83852380D01*
X113952380Y-83852380D01*
X114047619Y-83804761D01*
X114095238Y-83757142D01*
X113238095Y-82852380D02*
X112904761Y-83852380D01*
X112571428Y-82852380D01*
D10*
X111202380Y-65164285D02*
X111130952Y-65188095D01*
X111107142Y-65211904D01*
X111083333Y-65259523D01*
X111083333Y-65330952D01*
X111107142Y-65378571D01*
X111130952Y-65402380D01*
X111178571Y-65426190D01*
X111369047Y-65426190D01*
X111369047Y-64926190D01*
X111202380Y-64926190D01*
X111154761Y-64950000D01*
X111130952Y-64973809D01*
X111107142Y-65021428D01*
X111107142Y-65069047D01*
X111130952Y-65116666D01*
X111154761Y-65140476D01*
X111202380Y-65164285D01*
X111369047Y-65164285D01*
X110916666Y-64926190D02*
X110607142Y-64926190D01*
X110773809Y-65116666D01*
X110702380Y-65116666D01*
X110654761Y-65140476D01*
X110630952Y-65164285D01*
X110607142Y-65211904D01*
X110607142Y-65330952D01*
X110630952Y-65378571D01*
X110654761Y-65402380D01*
X110702380Y-65426190D01*
X110845238Y-65426190D01*
X110892857Y-65402380D01*
X110916666Y-65378571D01*
X111202380Y-60164285D02*
X111130952Y-60188095D01*
X111107142Y-60211904D01*
X111083333Y-60259523D01*
X111083333Y-60330952D01*
X111107142Y-60378571D01*
X111130952Y-60402380D01*
X111178571Y-60426190D01*
X111369047Y-60426190D01*
X111369047Y-59926190D01*
X111202380Y-59926190D01*
X111154761Y-59950000D01*
X111130952Y-59973809D01*
X111107142Y-60021428D01*
X111107142Y-60069047D01*
X111130952Y-60116666D01*
X111154761Y-60140476D01*
X111202380Y-60164285D01*
X111369047Y-60164285D01*
X110607142Y-60426190D02*
X110892857Y-60426190D01*
X110750000Y-60426190D02*
X110750000Y-59926190D01*
X110797619Y-59997619D01*
X110845238Y-60045238D01*
X110892857Y-60069047D01*
X111240476Y-70364285D02*
X111169047Y-70388095D01*
X111145238Y-70411904D01*
X111121428Y-70459523D01*
X111121428Y-70530952D01*
X111145238Y-70578571D01*
X111169047Y-70602380D01*
X111216666Y-70626190D01*
X111407142Y-70626190D01*
X111407142Y-70126190D01*
X111240476Y-70126190D01*
X111192857Y-70150000D01*
X111169047Y-70173809D01*
X111145238Y-70221428D01*
X111145238Y-70269047D01*
X111169047Y-70316666D01*
X111192857Y-70340476D01*
X111240476Y-70364285D01*
X111407142Y-70364285D01*
X110645238Y-70626190D02*
X110930952Y-70626190D01*
X110788095Y-70626190D02*
X110788095Y-70126190D01*
X110835714Y-70197619D01*
X110883333Y-70245238D01*
X110930952Y-70269047D01*
X110216666Y-70292857D02*
X110216666Y-70626190D01*
X110335714Y-70102380D02*
X110454761Y-70459523D01*
X110145238Y-70459523D01*
X111240476Y-72964285D02*
X111169047Y-72988095D01*
X111145238Y-73011904D01*
X111121428Y-73059523D01*
X111121428Y-73130952D01*
X111145238Y-73178571D01*
X111169047Y-73202380D01*
X111216666Y-73226190D01*
X111407142Y-73226190D01*
X111407142Y-72726190D01*
X111240476Y-72726190D01*
X111192857Y-72750000D01*
X111169047Y-72773809D01*
X111145238Y-72821428D01*
X111145238Y-72869047D01*
X111169047Y-72916666D01*
X111192857Y-72940476D01*
X111240476Y-72964285D01*
X111407142Y-72964285D01*
X110645238Y-73226190D02*
X110930952Y-73226190D01*
X110788095Y-73226190D02*
X110788095Y-72726190D01*
X110835714Y-72797619D01*
X110883333Y-72845238D01*
X110930952Y-72869047D01*
X110192857Y-72726190D02*
X110430952Y-72726190D01*
X110454761Y-72964285D01*
X110430952Y-72940476D01*
X110383333Y-72916666D01*
X110264285Y-72916666D01*
X110216666Y-72940476D01*
X110192857Y-72964285D01*
X110169047Y-73011904D01*
X110169047Y-73130952D01*
X110192857Y-73178571D01*
X110216666Y-73202380D01*
X110264285Y-73226190D01*
X110383333Y-73226190D01*
X110430952Y-73202380D01*
X110454761Y-73178571D01*
X111202380Y-62764285D02*
X111130952Y-62788095D01*
X111107142Y-62811904D01*
X111083333Y-62859523D01*
X111083333Y-62930952D01*
X111107142Y-62978571D01*
X111130952Y-63002380D01*
X111178571Y-63026190D01*
X111369047Y-63026190D01*
X111369047Y-62526190D01*
X111202380Y-62526190D01*
X111154761Y-62550000D01*
X111130952Y-62573809D01*
X111107142Y-62621428D01*
X111107142Y-62669047D01*
X111130952Y-62716666D01*
X111154761Y-62740476D01*
X111202380Y-62764285D01*
X111369047Y-62764285D01*
X110892857Y-62573809D02*
X110869047Y-62550000D01*
X110821428Y-62526190D01*
X110702380Y-62526190D01*
X110654761Y-62550000D01*
X110630952Y-62573809D01*
X110607142Y-62621428D01*
X110607142Y-62669047D01*
X110630952Y-62740476D01*
X110916666Y-63026190D01*
X110607142Y-63026190D01*
D11*
X155264285Y-56654761D02*
X155121428Y-56702380D01*
X154883333Y-56702380D01*
X154788095Y-56654761D01*
X154740476Y-56607142D01*
X154692857Y-56511904D01*
X154692857Y-56416666D01*
X154740476Y-56321428D01*
X154788095Y-56273809D01*
X154883333Y-56226190D01*
X155073809Y-56178571D01*
X155169047Y-56130952D01*
X155216666Y-56083333D01*
X155264285Y-55988095D01*
X155264285Y-55892857D01*
X155216666Y-55797619D01*
X155169047Y-55750000D01*
X155073809Y-55702380D01*
X154835714Y-55702380D01*
X154692857Y-55750000D01*
X154264285Y-56702380D02*
X154264285Y-55702380D01*
X154026190Y-55702380D01*
X153883333Y-55750000D01*
X153788095Y-55845238D01*
X153740476Y-55940476D01*
X153692857Y-56130952D01*
X153692857Y-56273809D01*
X153740476Y-56464285D01*
X153788095Y-56559523D01*
X153883333Y-56654761D01*
X154026190Y-56702380D01*
X154264285Y-56702380D01*
X153311904Y-56416666D02*
X152835714Y-56416666D01*
X153407142Y-56702380D02*
X153073809Y-55702380D01*
X152740476Y-56702380D01*
X140171428Y-72637380D02*
X140171428Y-71637380D01*
X139933333Y-71637380D01*
X139790476Y-71685000D01*
X139695238Y-71780238D01*
X139647619Y-71875476D01*
X139600000Y-72065952D01*
X139600000Y-72208809D01*
X139647619Y-72399285D01*
X139695238Y-72494523D01*
X139790476Y-72589761D01*
X139933333Y-72637380D01*
X140171428Y-72637380D01*
X138790476Y-72589761D02*
X138885714Y-72637380D01*
X139076190Y-72637380D01*
X139171428Y-72589761D01*
X139219047Y-72494523D01*
X139219047Y-72113571D01*
X139171428Y-72018333D01*
X139076190Y-71970714D01*
X138885714Y-71970714D01*
X138790476Y-72018333D01*
X138742857Y-72113571D01*
X138742857Y-72208809D01*
X139219047Y-72304047D01*
X138361904Y-72589761D02*
X138266666Y-72637380D01*
X138076190Y-72637380D01*
X137980952Y-72589761D01*
X137933333Y-72494523D01*
X137933333Y-72446904D01*
X137980952Y-72351666D01*
X138076190Y-72304047D01*
X138219047Y-72304047D01*
X138314285Y-72256428D01*
X138361904Y-72161190D01*
X138361904Y-72113571D01*
X138314285Y-72018333D01*
X138219047Y-71970714D01*
X138076190Y-71970714D01*
X137980952Y-72018333D01*
X137504761Y-72637380D02*
X137504761Y-71970714D01*
X137504761Y-71637380D02*
X137552380Y-71685000D01*
X137504761Y-71732619D01*
X137457142Y-71685000D01*
X137504761Y-71637380D01*
X137504761Y-71732619D01*
X136600000Y-71970714D02*
X136600000Y-72780238D01*
X136647619Y-72875476D01*
X136695238Y-72923095D01*
X136790476Y-72970714D01*
X136933333Y-72970714D01*
X137028571Y-72923095D01*
X136600000Y-72589761D02*
X136695238Y-72637380D01*
X136885714Y-72637380D01*
X136980952Y-72589761D01*
X137028571Y-72542142D01*
X137076190Y-72446904D01*
X137076190Y-72161190D01*
X137028571Y-72065952D01*
X136980952Y-72018333D01*
X136885714Y-71970714D01*
X136695238Y-71970714D01*
X136600000Y-72018333D01*
X136123809Y-71970714D02*
X136123809Y-72637380D01*
X136123809Y-72065952D02*
X136076190Y-72018333D01*
X135980952Y-71970714D01*
X135838095Y-71970714D01*
X135742857Y-72018333D01*
X135695238Y-72113571D01*
X135695238Y-72637380D01*
X134838095Y-72589761D02*
X134933333Y-72637380D01*
X135123809Y-72637380D01*
X135219047Y-72589761D01*
X135266666Y-72494523D01*
X135266666Y-72113571D01*
X135219047Y-72018333D01*
X135123809Y-71970714D01*
X134933333Y-71970714D01*
X134838095Y-72018333D01*
X134790476Y-72113571D01*
X134790476Y-72208809D01*
X135266666Y-72304047D01*
X133933333Y-72637380D02*
X133933333Y-71637380D01*
X133933333Y-72589761D02*
X134028571Y-72637380D01*
X134219047Y-72637380D01*
X134314285Y-72589761D01*
X134361904Y-72542142D01*
X134409523Y-72446904D01*
X134409523Y-72161190D01*
X134361904Y-72065952D01*
X134314285Y-72018333D01*
X134219047Y-71970714D01*
X134028571Y-71970714D01*
X133933333Y-72018333D01*
X132695238Y-72637380D02*
X132695238Y-71637380D01*
X132695238Y-72018333D02*
X132600000Y-71970714D01*
X132409523Y-71970714D01*
X132314285Y-72018333D01*
X132266666Y-72065952D01*
X132219047Y-72161190D01*
X132219047Y-72446904D01*
X132266666Y-72542142D01*
X132314285Y-72589761D01*
X132409523Y-72637380D01*
X132600000Y-72637380D01*
X132695238Y-72589761D01*
X131885714Y-71970714D02*
X131647619Y-72637380D01*
X131409523Y-71970714D02*
X131647619Y-72637380D01*
X131742857Y-72875476D01*
X131790476Y-72923095D01*
X131885714Y-72970714D01*
X131028571Y-72542142D02*
X130980952Y-72589761D01*
X131028571Y-72637380D01*
X131076190Y-72589761D01*
X131028571Y-72542142D01*
X131028571Y-72637380D01*
X131028571Y-72018333D02*
X130980952Y-72065952D01*
X131028571Y-72113571D01*
X131076190Y-72065952D01*
X131028571Y-72018333D01*
X131028571Y-72113571D01*
X140528571Y-73247380D02*
X140195238Y-74247380D01*
X139861904Y-73247380D01*
X139528571Y-74247380D02*
X139528571Y-73580714D01*
X139528571Y-73247380D02*
X139576190Y-73295000D01*
X139528571Y-73342619D01*
X139480952Y-73295000D01*
X139528571Y-73247380D01*
X139528571Y-73342619D01*
X139052380Y-73580714D02*
X139052380Y-74247380D01*
X139052380Y-73675952D02*
X139004761Y-73628333D01*
X138909523Y-73580714D01*
X138766666Y-73580714D01*
X138671428Y-73628333D01*
X138623809Y-73723571D01*
X138623809Y-74247380D01*
X137719047Y-74199761D02*
X137814285Y-74247380D01*
X138004761Y-74247380D01*
X138100000Y-74199761D01*
X138147619Y-74152142D01*
X138195238Y-74056904D01*
X138195238Y-73771190D01*
X138147619Y-73675952D01*
X138100000Y-73628333D01*
X138004761Y-73580714D01*
X137814285Y-73580714D01*
X137719047Y-73628333D01*
X136909523Y-74199761D02*
X137004761Y-74247380D01*
X137195238Y-74247380D01*
X137290476Y-74199761D01*
X137338095Y-74104523D01*
X137338095Y-73723571D01*
X137290476Y-73628333D01*
X137195238Y-73580714D01*
X137004761Y-73580714D01*
X136909523Y-73628333D01*
X136861904Y-73723571D01*
X136861904Y-73818809D01*
X137338095Y-73914047D01*
X136433333Y-73580714D02*
X136433333Y-74247380D01*
X136433333Y-73675952D02*
X136385714Y-73628333D01*
X136290476Y-73580714D01*
X136147619Y-73580714D01*
X136052380Y-73628333D01*
X136004761Y-73723571D01*
X136004761Y-74247380D01*
X135671428Y-73580714D02*
X135290476Y-73580714D01*
X135528571Y-73247380D02*
X135528571Y-74104523D01*
X135480952Y-74199761D01*
X135385714Y-74247380D01*
X135290476Y-74247380D01*
X134290476Y-73247380D02*
X134052380Y-74247380D01*
X133861904Y-73533095D01*
X133671428Y-74247380D01*
X133433333Y-73247380D01*
X132623809Y-74247380D02*
X132623809Y-73723571D01*
X132671428Y-73628333D01*
X132766666Y-73580714D01*
X132957142Y-73580714D01*
X133052380Y-73628333D01*
X132623809Y-74199761D02*
X132719047Y-74247380D01*
X132957142Y-74247380D01*
X133052380Y-74199761D01*
X133100000Y-74104523D01*
X133100000Y-74009285D01*
X133052380Y-73914047D01*
X132957142Y-73866428D01*
X132719047Y-73866428D01*
X132623809Y-73818809D01*
X132147619Y-73580714D02*
X132147619Y-74247380D01*
X132147619Y-73675952D02*
X132100000Y-73628333D01*
X132004761Y-73580714D01*
X131861904Y-73580714D01*
X131766666Y-73628333D01*
X131719047Y-73723571D01*
X131719047Y-74247380D01*
X130814285Y-73580714D02*
X130814285Y-74390238D01*
X130861904Y-74485476D01*
X130909523Y-74533095D01*
X131004761Y-74580714D01*
X131147619Y-74580714D01*
X131242857Y-74533095D01*
X130814285Y-74199761D02*
X130909523Y-74247380D01*
X131100000Y-74247380D01*
X131195238Y-74199761D01*
X131242857Y-74152142D01*
X131290476Y-74056904D01*
X131290476Y-73771190D01*
X131242857Y-73675952D01*
X131195238Y-73628333D01*
X131100000Y-73580714D01*
X130909523Y-73580714D01*
X130814285Y-73628333D01*
X140600000Y-75857380D02*
X140600000Y-74857380D01*
X140171428Y-75809761D02*
X140076190Y-75857380D01*
X139885714Y-75857380D01*
X139790476Y-75809761D01*
X139742857Y-75714523D01*
X139742857Y-75666904D01*
X139790476Y-75571666D01*
X139885714Y-75524047D01*
X140028571Y-75524047D01*
X140123809Y-75476428D01*
X140171428Y-75381190D01*
X140171428Y-75333571D01*
X140123809Y-75238333D01*
X140028571Y-75190714D01*
X139885714Y-75190714D01*
X139790476Y-75238333D01*
X139314285Y-75857380D02*
X139314285Y-74857380D01*
X138885714Y-75857380D02*
X138885714Y-75333571D01*
X138933333Y-75238333D01*
X139028571Y-75190714D01*
X139171428Y-75190714D01*
X139266666Y-75238333D01*
X139314285Y-75285952D01*
X137980952Y-75857380D02*
X137980952Y-75333571D01*
X138028571Y-75238333D01*
X138123809Y-75190714D01*
X138314285Y-75190714D01*
X138409523Y-75238333D01*
X137980952Y-75809761D02*
X138076190Y-75857380D01*
X138314285Y-75857380D01*
X138409523Y-75809761D01*
X138457142Y-75714523D01*
X138457142Y-75619285D01*
X138409523Y-75524047D01*
X138314285Y-75476428D01*
X138076190Y-75476428D01*
X137980952Y-75428809D01*
X137504761Y-75190714D02*
X137504761Y-75857380D01*
X137504761Y-75285952D02*
X137457142Y-75238333D01*
X137361904Y-75190714D01*
X137219047Y-75190714D01*
X137123809Y-75238333D01*
X137076190Y-75333571D01*
X137076190Y-75857380D01*
X135838095Y-75857380D02*
X135838095Y-74857380D01*
X135600000Y-74857380D01*
X135457142Y-74905000D01*
X135361904Y-75000238D01*
X135314285Y-75095476D01*
X135266666Y-75285952D01*
X135266666Y-75428809D01*
X135314285Y-75619285D01*
X135361904Y-75714523D01*
X135457142Y-75809761D01*
X135600000Y-75857380D01*
X135838095Y-75857380D01*
X134409523Y-75190714D02*
X134409523Y-75857380D01*
X134838095Y-75190714D02*
X134838095Y-75714523D01*
X134790476Y-75809761D01*
X134695238Y-75857380D01*
X134552380Y-75857380D01*
X134457142Y-75809761D01*
X134409523Y-75762142D01*
X133933333Y-75857380D02*
X133933333Y-75190714D01*
X133933333Y-75381190D02*
X133885714Y-75285952D01*
X133838095Y-75238333D01*
X133742857Y-75190714D01*
X133647619Y-75190714D01*
X133314285Y-75857380D02*
X133314285Y-75190714D01*
X133314285Y-74857380D02*
X133361904Y-74905000D01*
X133314285Y-74952619D01*
X133266666Y-74905000D01*
X133314285Y-74857380D01*
X133314285Y-74952619D01*
X132885714Y-75809761D02*
X132790476Y-75857380D01*
X132600000Y-75857380D01*
X132504761Y-75809761D01*
X132457142Y-75714523D01*
X132457142Y-75666904D01*
X132504761Y-75571666D01*
X132600000Y-75524047D01*
X132742857Y-75524047D01*
X132838095Y-75476428D01*
X132885714Y-75381190D01*
X132885714Y-75333571D01*
X132838095Y-75238333D01*
X132742857Y-75190714D01*
X132600000Y-75190714D01*
X132504761Y-75238333D01*
X131647619Y-75809761D02*
X131742857Y-75857380D01*
X131933333Y-75857380D01*
X132028571Y-75809761D01*
X132076190Y-75714523D01*
X132076190Y-75333571D01*
X132028571Y-75238333D01*
X131933333Y-75190714D01*
X131742857Y-75190714D01*
X131647619Y-75238333D01*
X131600000Y-75333571D01*
X131600000Y-75428809D01*
X132076190Y-75524047D01*
X131314285Y-75190714D02*
X130933333Y-75190714D01*
X131171428Y-74857380D02*
X131171428Y-75714523D01*
X131123809Y-75809761D01*
X131028571Y-75857380D01*
X130933333Y-75857380D01*
X130600000Y-75857380D02*
X130600000Y-75190714D01*
X130600000Y-74857380D02*
X130647619Y-74905000D01*
X130600000Y-74952619D01*
X130552380Y-74905000D01*
X130600000Y-74857380D01*
X130600000Y-74952619D01*
X138457142Y-77848333D02*
X138504761Y-77800714D01*
X138600000Y-77657857D01*
X138647619Y-77562619D01*
X138695238Y-77419761D01*
X138742857Y-77181666D01*
X138742857Y-76991190D01*
X138695238Y-76753095D01*
X138647619Y-76610238D01*
X138600000Y-76515000D01*
X138504761Y-76372142D01*
X138457142Y-76324523D01*
X137647619Y-77419761D02*
X137742857Y-77467380D01*
X137933333Y-77467380D01*
X138028571Y-77419761D01*
X138076190Y-77372142D01*
X138123809Y-77276904D01*
X138123809Y-76991190D01*
X138076190Y-76895952D01*
X138028571Y-76848333D01*
X137933333Y-76800714D01*
X137742857Y-76800714D01*
X137647619Y-76848333D01*
X137314285Y-77848333D02*
X137266666Y-77800714D01*
X137171428Y-77657857D01*
X137123809Y-77562619D01*
X137076190Y-77419761D01*
X137028571Y-77181666D01*
X137028571Y-76991190D01*
X137076190Y-76753095D01*
X137123809Y-76610238D01*
X137171428Y-76515000D01*
X137266666Y-76372142D01*
X137314285Y-76324523D01*
X135838095Y-76562619D02*
X135790476Y-76515000D01*
X135695238Y-76467380D01*
X135457142Y-76467380D01*
X135361904Y-76515000D01*
X135314285Y-76562619D01*
X135266666Y-76657857D01*
X135266666Y-76753095D01*
X135314285Y-76895952D01*
X135885714Y-77467380D01*
X135266666Y-77467380D01*
X134647619Y-76467380D02*
X134552380Y-76467380D01*
X134457142Y-76515000D01*
X134409523Y-76562619D01*
X134361904Y-76657857D01*
X134314285Y-76848333D01*
X134314285Y-77086428D01*
X134361904Y-77276904D01*
X134409523Y-77372142D01*
X134457142Y-77419761D01*
X134552380Y-77467380D01*
X134647619Y-77467380D01*
X134742857Y-77419761D01*
X134790476Y-77372142D01*
X134838095Y-77276904D01*
X134885714Y-77086428D01*
X134885714Y-76848333D01*
X134838095Y-76657857D01*
X134790476Y-76562619D01*
X134742857Y-76515000D01*
X134647619Y-76467380D01*
X133933333Y-76562619D02*
X133885714Y-76515000D01*
X133790476Y-76467380D01*
X133552380Y-76467380D01*
X133457142Y-76515000D01*
X133409523Y-76562619D01*
X133361904Y-76657857D01*
X133361904Y-76753095D01*
X133409523Y-76895952D01*
X133980952Y-77467380D01*
X133361904Y-77467380D01*
X132409523Y-77467380D02*
X132980952Y-77467380D01*
X132695238Y-77467380D02*
X132695238Y-76467380D01*
X132790476Y-76610238D01*
X132885714Y-76705476D01*
X132980952Y-76753095D01*
D12*
X149230952Y-70208333D02*
X148635714Y-70208333D01*
X149350000Y-70565476D02*
X148933333Y-69315476D01*
X148516666Y-70565476D01*
X148278571Y-69315476D02*
X147861904Y-70565476D01*
X147445238Y-69315476D01*
X146611904Y-69910714D02*
X146433333Y-69970238D01*
X146373809Y-70029761D01*
X146314285Y-70148809D01*
X146314285Y-70327380D01*
X146373809Y-70446428D01*
X146433333Y-70505952D01*
X146552380Y-70565476D01*
X147028571Y-70565476D01*
X147028571Y-69315476D01*
X146611904Y-69315476D01*
X146492857Y-69375000D01*
X146433333Y-69434523D01*
X146373809Y-69553571D01*
X146373809Y-69672619D01*
X146433333Y-69791666D01*
X146492857Y-69851190D01*
X146611904Y-69910714D01*
X147028571Y-69910714D01*
X145600000Y-70565476D02*
X145719047Y-70505952D01*
X145778571Y-70446428D01*
X145838095Y-70327380D01*
X145838095Y-69970238D01*
X145778571Y-69851190D01*
X145719047Y-69791666D01*
X145600000Y-69732142D01*
X145421428Y-69732142D01*
X145302380Y-69791666D01*
X145242857Y-69851190D01*
X145183333Y-69970238D01*
X145183333Y-70327380D01*
X145242857Y-70446428D01*
X145302380Y-70505952D01*
X145421428Y-70565476D01*
X145600000Y-70565476D01*
X144826190Y-69732142D02*
X144350000Y-69732142D01*
X144647619Y-69315476D02*
X144647619Y-70386904D01*
X144588095Y-70505952D01*
X144469047Y-70565476D01*
X144350000Y-70565476D01*
X144052380Y-69732142D02*
X143397619Y-69732142D01*
X144052380Y-70565476D01*
X143397619Y-70565476D01*
X141254761Y-70446428D02*
X141314285Y-70505952D01*
X141492857Y-70565476D01*
X141611904Y-70565476D01*
X141790476Y-70505952D01*
X141909523Y-70386904D01*
X141969047Y-70267857D01*
X142028571Y-70029761D01*
X142028571Y-69851190D01*
X141969047Y-69613095D01*
X141909523Y-69494047D01*
X141790476Y-69375000D01*
X141611904Y-69315476D01*
X141492857Y-69315476D01*
X141314285Y-69375000D01*
X141254761Y-69434523D01*
X140183333Y-70565476D02*
X140183333Y-69910714D01*
X140242857Y-69791666D01*
X140361904Y-69732142D01*
X140600000Y-69732142D01*
X140719047Y-69791666D01*
X140183333Y-70505952D02*
X140302380Y-70565476D01*
X140600000Y-70565476D01*
X140719047Y-70505952D01*
X140778571Y-70386904D01*
X140778571Y-70267857D01*
X140719047Y-70148809D01*
X140600000Y-70089285D01*
X140302380Y-70089285D01*
X140183333Y-70029761D01*
X139766666Y-69732142D02*
X139290476Y-69732142D01*
X139588095Y-69315476D02*
X139588095Y-70386904D01*
X139528571Y-70505952D01*
X139409523Y-70565476D01*
X139290476Y-70565476D01*
X138338095Y-70505952D02*
X138457142Y-70565476D01*
X138695238Y-70565476D01*
X138814285Y-70505952D01*
X138873809Y-70446428D01*
X138933333Y-70327380D01*
X138933333Y-69970238D01*
X138873809Y-69851190D01*
X138814285Y-69791666D01*
X138695238Y-69732142D01*
X138457142Y-69732142D01*
X138338095Y-69791666D01*
X137802380Y-70565476D02*
X137802380Y-69315476D01*
X137266666Y-70565476D02*
X137266666Y-69910714D01*
X137326190Y-69791666D01*
X137445238Y-69732142D01*
X137623809Y-69732142D01*
X137742857Y-69791666D01*
X137802380Y-69851190D01*
X136671428Y-70089285D02*
X135719047Y-70089285D01*
X134588095Y-70565476D02*
X134588095Y-69910714D01*
X134647619Y-69791666D01*
X134766666Y-69732142D01*
X135004761Y-69732142D01*
X135123809Y-69791666D01*
X134588095Y-70505952D02*
X134707142Y-70565476D01*
X135004761Y-70565476D01*
X135123809Y-70505952D01*
X135183333Y-70386904D01*
X135183333Y-70267857D01*
X135123809Y-70148809D01*
X135004761Y-70089285D01*
X134707142Y-70089285D01*
X134588095Y-70029761D01*
X133814285Y-70565476D02*
X133933333Y-70505952D01*
X133992857Y-70386904D01*
X133992857Y-69315476D01*
X133159523Y-70565476D02*
X133278571Y-70505952D01*
X133338095Y-70386904D01*
X133338095Y-69315476D01*
X131314285Y-69910714D02*
X131135714Y-69970238D01*
X131076190Y-70029761D01*
X131016666Y-70148809D01*
X131016666Y-70327380D01*
X131076190Y-70446428D01*
X131135714Y-70505952D01*
X131254761Y-70565476D01*
X131730952Y-70565476D01*
X131730952Y-69315476D01*
X131314285Y-69315476D01*
X131195238Y-69375000D01*
X131135714Y-69434523D01*
X131076190Y-69553571D01*
X131076190Y-69672619D01*
X131135714Y-69791666D01*
X131195238Y-69851190D01*
X131314285Y-69910714D01*
X131730952Y-69910714D01*
X130302380Y-70565476D02*
X130421428Y-70505952D01*
X130480952Y-70446428D01*
X130540476Y-70327380D01*
X130540476Y-69970238D01*
X130480952Y-69851190D01*
X130421428Y-69791666D01*
X130302380Y-69732142D01*
X130123809Y-69732142D01*
X130004761Y-69791666D01*
X129945238Y-69851190D01*
X129885714Y-69970238D01*
X129885714Y-70327380D01*
X129945238Y-70446428D01*
X130004761Y-70505952D01*
X130123809Y-70565476D01*
X130302380Y-70565476D01*
X128814285Y-70565476D02*
X128814285Y-69910714D01*
X128873809Y-69791666D01*
X128992857Y-69732142D01*
X129230952Y-69732142D01*
X129350000Y-69791666D01*
X128814285Y-70505952D02*
X128933333Y-70565476D01*
X129230952Y-70565476D01*
X129350000Y-70505952D01*
X129409523Y-70386904D01*
X129409523Y-70267857D01*
X129350000Y-70148809D01*
X129230952Y-70089285D01*
X128933333Y-70089285D01*
X128814285Y-70029761D01*
X128219047Y-70565476D02*
X128219047Y-69732142D01*
X128219047Y-69970238D02*
X128159523Y-69851190D01*
X128100000Y-69791666D01*
X127980952Y-69732142D01*
X127861904Y-69732142D01*
X126909523Y-70565476D02*
X126909523Y-69315476D01*
X126909523Y-70505952D02*
X127028571Y-70565476D01*
X127266666Y-70565476D01*
X127385714Y-70505952D01*
X127445238Y-70446428D01*
X127504761Y-70327380D01*
X127504761Y-69970238D01*
X127445238Y-69851190D01*
X127385714Y-69791666D01*
X127266666Y-69732142D01*
X127028571Y-69732142D01*
X126909523Y-69791666D01*
X125480952Y-69732142D02*
X125183333Y-70565476D01*
X124885714Y-69732142D01*
X123754761Y-70565476D02*
X124469047Y-70565476D01*
X124111904Y-70565476D02*
X124111904Y-69315476D01*
X124230952Y-69494047D01*
X124350000Y-69613095D01*
X124469047Y-69672619D01*
X123219047Y-70446428D02*
X123159523Y-70505952D01*
X123219047Y-70565476D01*
X123278571Y-70505952D01*
X123219047Y-70446428D01*
X123219047Y-70565476D01*
X122385714Y-69315476D02*
X122266666Y-69315476D01*
X122147619Y-69375000D01*
X122088095Y-69434523D01*
X122028571Y-69553571D01*
X121969047Y-69791666D01*
X121969047Y-70089285D01*
X122028571Y-70327380D01*
X122088095Y-70446428D01*
X122147619Y-70505952D01*
X122266666Y-70565476D01*
X122385714Y-70565476D01*
X122504761Y-70505952D01*
X122564285Y-70446428D01*
X122623809Y-70327380D01*
X122683333Y-70089285D01*
X122683333Y-69791666D01*
X122623809Y-69553571D01*
X122564285Y-69434523D01*
X122504761Y-69375000D01*
X122385714Y-69315476D01*
D11*
X122726190Y-77509523D02*
X122688095Y-77395238D01*
X122688095Y-77204761D01*
X122726190Y-77128571D01*
X122764285Y-77090476D01*
X122840476Y-77052380D01*
X122916666Y-77052380D01*
X122992857Y-77090476D01*
X123030952Y-77128571D01*
X123069047Y-77204761D01*
X123107142Y-77357142D01*
X123145238Y-77433333D01*
X123183333Y-77471428D01*
X123259523Y-77509523D01*
X123335714Y-77509523D01*
X123411904Y-77471428D01*
X123450000Y-77433333D01*
X123488095Y-77357142D01*
X123488095Y-77166666D01*
X123450000Y-77052380D01*
X123488095Y-76785714D02*
X122688095Y-76595238D01*
X123259523Y-76442857D01*
X122688095Y-76290476D01*
X123488095Y-76100000D01*
X122764285Y-75338095D02*
X122726190Y-75376190D01*
X122688095Y-75490476D01*
X122688095Y-75566666D01*
X122726190Y-75680952D01*
X122802380Y-75757142D01*
X122878571Y-75795238D01*
X123030952Y-75833333D01*
X123145238Y-75833333D01*
X123297619Y-75795238D01*
X123373809Y-75757142D01*
X123450000Y-75680952D01*
X123488095Y-75566666D01*
X123488095Y-75490476D01*
X123450000Y-75376190D01*
X123411904Y-75338095D01*
X122688095Y-74614285D02*
X122688095Y-74995238D01*
X123488095Y-74995238D01*
X122688095Y-74347619D02*
X123488095Y-74347619D01*
X122688095Y-73890476D02*
X123145238Y-74233333D01*
X123488095Y-73890476D02*
X123030952Y-74347619D01*
X114661904Y-46500000D02*
X114757142Y-46452380D01*
X114900000Y-46452380D01*
X115042857Y-46500000D01*
X115138095Y-46595238D01*
X115185714Y-46690476D01*
X115233333Y-46880952D01*
X115233333Y-47023809D01*
X115185714Y-47214285D01*
X115138095Y-47309523D01*
X115042857Y-47404761D01*
X114900000Y-47452380D01*
X114804761Y-47452380D01*
X114661904Y-47404761D01*
X114614285Y-47357142D01*
X114614285Y-47023809D01*
X114804761Y-47023809D01*
X114185714Y-47452380D02*
X114185714Y-46452380D01*
X113614285Y-47452380D01*
X113614285Y-46452380D01*
X113138095Y-47452380D02*
X113138095Y-46452380D01*
X112900000Y-46452380D01*
X112757142Y-46500000D01*
X112661904Y-46595238D01*
X112614285Y-46690476D01*
X112566666Y-46880952D01*
X112566666Y-47023809D01*
X112614285Y-47214285D01*
X112661904Y-47309523D01*
X112757142Y-47404761D01*
X112900000Y-47452380D01*
X113138095Y-47452380D01*
X120226190Y-77445238D02*
X120188095Y-77330952D01*
X120188095Y-77140476D01*
X120226190Y-77064285D01*
X120264285Y-77026190D01*
X120340476Y-76988095D01*
X120416666Y-76988095D01*
X120492857Y-77026190D01*
X120530952Y-77064285D01*
X120569047Y-77140476D01*
X120607142Y-77292857D01*
X120645238Y-77369047D01*
X120683333Y-77407142D01*
X120759523Y-77445238D01*
X120835714Y-77445238D01*
X120911904Y-77407142D01*
X120950000Y-77369047D01*
X120988095Y-77292857D01*
X120988095Y-77102380D01*
X120950000Y-76988095D01*
X120988095Y-76721428D02*
X120188095Y-76530952D01*
X120759523Y-76378571D01*
X120188095Y-76226190D01*
X120988095Y-76035714D01*
X120188095Y-75730952D02*
X120988095Y-75730952D01*
X120988095Y-75540476D01*
X120950000Y-75426190D01*
X120873809Y-75350000D01*
X120797619Y-75311904D01*
X120645238Y-75273809D01*
X120530952Y-75273809D01*
X120378571Y-75311904D01*
X120302380Y-75350000D01*
X120226190Y-75426190D01*
X120188095Y-75540476D01*
X120188095Y-75730952D01*
X120188095Y-74930952D02*
X120988095Y-74930952D01*
X120988095Y-74397619D02*
X120988095Y-74245238D01*
X120950000Y-74169047D01*
X120873809Y-74092857D01*
X120721428Y-74054761D01*
X120454761Y-74054761D01*
X120302380Y-74092857D01*
X120226190Y-74169047D01*
X120188095Y-74245238D01*
X120188095Y-74397619D01*
X120226190Y-74473809D01*
X120302380Y-74550000D01*
X120454761Y-74588095D01*
X120721428Y-74588095D01*
X120873809Y-74550000D01*
X120950000Y-74473809D01*
X120988095Y-74397619D01*
X156961904Y-82900000D02*
X157057142Y-82852380D01*
X157200000Y-82852380D01*
X157342857Y-82900000D01*
X157438095Y-82995238D01*
X157485714Y-83090476D01*
X157533333Y-83280952D01*
X157533333Y-83423809D01*
X157485714Y-83614285D01*
X157438095Y-83709523D01*
X157342857Y-83804761D01*
X157200000Y-83852380D01*
X157104761Y-83852380D01*
X156961904Y-83804761D01*
X156914285Y-83757142D01*
X156914285Y-83423809D01*
X157104761Y-83423809D01*
X156485714Y-83852380D02*
X156485714Y-82852380D01*
X155914285Y-83852380D01*
X155914285Y-82852380D01*
X155438095Y-83852380D02*
X155438095Y-82852380D01*
X155200000Y-82852380D01*
X155057142Y-82900000D01*
X154961904Y-82995238D01*
X154914285Y-83090476D01*
X154866666Y-83280952D01*
X154866666Y-83423809D01*
X154914285Y-83614285D01*
X154961904Y-83709523D01*
X155057142Y-83804761D01*
X155200000Y-83852380D01*
X155438095Y-83852380D01*
X117738095Y-76983333D02*
X118119047Y-77250000D01*
X117738095Y-77440476D02*
X118538095Y-77440476D01*
X118538095Y-77135714D01*
X118500000Y-77059523D01*
X118461904Y-77021428D01*
X118385714Y-76983333D01*
X118271428Y-76983333D01*
X118195238Y-77021428D01*
X118157142Y-77059523D01*
X118119047Y-77135714D01*
X118119047Y-77440476D01*
X118538095Y-76716666D02*
X117738095Y-76183333D01*
X118538095Y-76183333D02*
X117738095Y-76716666D01*
X116088095Y-77409523D02*
X116088095Y-76952380D01*
X115288095Y-77180952D02*
X116088095Y-77180952D01*
X116088095Y-76761904D02*
X115288095Y-76228571D01*
X116088095Y-76228571D02*
X115288095Y-76761904D01*
X129961904Y-82900000D02*
X130057142Y-82852380D01*
X130200000Y-82852380D01*
X130342857Y-82900000D01*
X130438095Y-82995238D01*
X130485714Y-83090476D01*
X130533333Y-83280952D01*
X130533333Y-83423809D01*
X130485714Y-83614285D01*
X130438095Y-83709523D01*
X130342857Y-83804761D01*
X130200000Y-83852380D01*
X130104761Y-83852380D01*
X129961904Y-83804761D01*
X129914285Y-83757142D01*
X129914285Y-83423809D01*
X130104761Y-83423809D01*
X129485714Y-83852380D02*
X129485714Y-82852380D01*
X128914285Y-83852380D01*
X128914285Y-82852380D01*
X128438095Y-83852380D02*
X128438095Y-82852380D01*
X128200000Y-82852380D01*
X128057142Y-82900000D01*
X127961904Y-82995238D01*
X127914285Y-83090476D01*
X127866666Y-83280952D01*
X127866666Y-83423809D01*
X127914285Y-83614285D01*
X127961904Y-83709523D01*
X128057142Y-83804761D01*
X128200000Y-83852380D01*
X128438095Y-83852380D01*
X126050000Y-77009523D02*
X126088095Y-77085714D01*
X126088095Y-77200000D01*
X126050000Y-77314285D01*
X125973809Y-77390476D01*
X125897619Y-77428571D01*
X125745238Y-77466666D01*
X125630952Y-77466666D01*
X125478571Y-77428571D01*
X125402380Y-77390476D01*
X125326190Y-77314285D01*
X125288095Y-77200000D01*
X125288095Y-77123809D01*
X125326190Y-77009523D01*
X125364285Y-76971428D01*
X125630952Y-76971428D01*
X125630952Y-77123809D01*
X125288095Y-76628571D02*
X126088095Y-76628571D01*
X125288095Y-76171428D01*
X126088095Y-76171428D01*
X125288095Y-75790476D02*
X126088095Y-75790476D01*
X126088095Y-75600000D01*
X126050000Y-75485714D01*
X125973809Y-75409523D01*
X125897619Y-75371428D01*
X125745238Y-75333333D01*
X125630952Y-75333333D01*
X125478571Y-75371428D01*
X125402380Y-75409523D01*
X125326190Y-75485714D01*
X125288095Y-75600000D01*
X125288095Y-75790476D01*
D10*
X111357142Y-55283333D02*
X111119047Y-55283333D01*
X111404761Y-55426190D02*
X111238095Y-54926190D01*
X111071428Y-55426190D01*
X110809523Y-54926190D02*
X110761904Y-54926190D01*
X110714285Y-54950000D01*
X110690476Y-54973809D01*
X110666666Y-55021428D01*
X110642857Y-55116666D01*
X110642857Y-55235714D01*
X110666666Y-55330952D01*
X110690476Y-55378571D01*
X110714285Y-55402380D01*
X110761904Y-55426190D01*
X110809523Y-55426190D01*
X110857142Y-55402380D01*
X110880952Y-55378571D01*
X110904761Y-55330952D01*
X110928571Y-55235714D01*
X110928571Y-55116666D01*
X110904761Y-55021428D01*
X110880952Y-54973809D01*
X110857142Y-54950000D01*
X110809523Y-54926190D01*
D11*
X154811904Y-58400000D02*
X154907142Y-58352380D01*
X155050000Y-58352380D01*
X155192857Y-58400000D01*
X155288095Y-58495238D01*
X155335714Y-58590476D01*
X155383333Y-58780952D01*
X155383333Y-58923809D01*
X155335714Y-59114285D01*
X155288095Y-59209523D01*
X155192857Y-59304761D01*
X155050000Y-59352380D01*
X154954761Y-59352380D01*
X154811904Y-59304761D01*
X154764285Y-59257142D01*
X154764285Y-58923809D01*
X154954761Y-58923809D01*
X154335714Y-59352380D02*
X154335714Y-58352380D01*
X153764285Y-59352380D01*
X153764285Y-58352380D01*
X153288095Y-59352380D02*
X153288095Y-58352380D01*
X153050000Y-58352380D01*
X152907142Y-58400000D01*
X152811904Y-58495238D01*
X152764285Y-58590476D01*
X152716666Y-58780952D01*
X152716666Y-58923809D01*
X152764285Y-59114285D01*
X152811904Y-59209523D01*
X152907142Y-59304761D01*
X153050000Y-59352380D01*
X153288095Y-59352380D01*
X130935714Y-46971428D02*
X130173809Y-46971428D01*
X130554761Y-47352380D02*
X130554761Y-46590476D01*
X129221428Y-46352380D02*
X129697619Y-46352380D01*
X129745238Y-46828571D01*
X129697619Y-46780952D01*
X129602380Y-46733333D01*
X129364285Y-46733333D01*
X129269047Y-46780952D01*
X129221428Y-46828571D01*
X129173809Y-46923809D01*
X129173809Y-47161904D01*
X129221428Y-47257142D01*
X129269047Y-47304761D01*
X129364285Y-47352380D01*
X129602380Y-47352380D01*
X129697619Y-47304761D01*
X129745238Y-47257142D01*
X128888095Y-46352380D02*
X128554761Y-47352380D01*
X128221428Y-46352380D01*
X147454761Y-47257142D02*
X147502380Y-47304761D01*
X147645238Y-47352380D01*
X147740476Y-47352380D01*
X147883333Y-47304761D01*
X147978571Y-47209523D01*
X148026190Y-47114285D01*
X148073809Y-46923809D01*
X148073809Y-46780952D01*
X148026190Y-46590476D01*
X147978571Y-46495238D01*
X147883333Y-46400000D01*
X147740476Y-46352380D01*
X147645238Y-46352380D01*
X147502380Y-46400000D01*
X147454761Y-46447619D01*
X147073809Y-47066666D02*
X146597619Y-47066666D01*
X147169047Y-47352380D02*
X146835714Y-46352380D01*
X146502380Y-47352380D01*
X146169047Y-47352380D02*
X146169047Y-46352380D01*
X145597619Y-47352380D01*
X145597619Y-46352380D01*
X144597619Y-47352380D02*
X145169047Y-47352380D01*
X144883333Y-47352380D02*
X144883333Y-46352380D01*
X144978571Y-46495238D01*
X145073809Y-46590476D01*
X145169047Y-46638095D01*
X144407142Y-47447619D02*
X143645238Y-47447619D01*
X142930952Y-47352380D02*
X143407142Y-47352380D01*
X143407142Y-46352380D01*
X157335714Y-46871428D02*
X156573809Y-46871428D01*
X156954761Y-47252380D02*
X156954761Y-46490476D01*
X155621428Y-46252380D02*
X156097619Y-46252380D01*
X156145238Y-46728571D01*
X156097619Y-46680952D01*
X156002380Y-46633333D01*
X155764285Y-46633333D01*
X155669047Y-46680952D01*
X155621428Y-46728571D01*
X155573809Y-46823809D01*
X155573809Y-47061904D01*
X155621428Y-47157142D01*
X155669047Y-47204761D01*
X155764285Y-47252380D01*
X156002380Y-47252380D01*
X156097619Y-47204761D01*
X156145238Y-47157142D01*
X155288095Y-46252380D02*
X154954761Y-47252380D01*
X154621428Y-46252380D01*
X154161904Y-78700000D02*
X154257142Y-78652380D01*
X154400000Y-78652380D01*
X154542857Y-78700000D01*
X154638095Y-78795238D01*
X154685714Y-78890476D01*
X154733333Y-79080952D01*
X154733333Y-79223809D01*
X154685714Y-79414285D01*
X154638095Y-79509523D01*
X154542857Y-79604761D01*
X154400000Y-79652380D01*
X154304761Y-79652380D01*
X154161904Y-79604761D01*
X154114285Y-79557142D01*
X154114285Y-79223809D01*
X154304761Y-79223809D01*
X153685714Y-79652380D02*
X153685714Y-78652380D01*
X153114285Y-79652380D01*
X153114285Y-78652380D01*
X152638095Y-79652380D02*
X152638095Y-78652380D01*
X152400000Y-78652380D01*
X152257142Y-78700000D01*
X152161904Y-78795238D01*
X152114285Y-78890476D01*
X152066666Y-79080952D01*
X152066666Y-79223809D01*
X152114285Y-79414285D01*
X152161904Y-79509523D01*
X152257142Y-79604761D01*
X152400000Y-79652380D01*
X152638095Y-79652380D01*
X154885714Y-72004761D02*
X154742857Y-72052380D01*
X154504761Y-72052380D01*
X154409523Y-72004761D01*
X154361904Y-71957142D01*
X154314285Y-71861904D01*
X154314285Y-71766666D01*
X154361904Y-71671428D01*
X154409523Y-71623809D01*
X154504761Y-71576190D01*
X154695238Y-71528571D01*
X154790476Y-71480952D01*
X154838095Y-71433333D01*
X154885714Y-71338095D01*
X154885714Y-71242857D01*
X154838095Y-71147619D01*
X154790476Y-71100000D01*
X154695238Y-71052380D01*
X154457142Y-71052380D01*
X154314285Y-71100000D01*
X153314285Y-71957142D02*
X153361904Y-72004761D01*
X153504761Y-72052380D01*
X153600000Y-72052380D01*
X153742857Y-72004761D01*
X153838095Y-71909523D01*
X153885714Y-71814285D01*
X153933333Y-71623809D01*
X153933333Y-71480952D01*
X153885714Y-71290476D01*
X153838095Y-71195238D01*
X153742857Y-71100000D01*
X153600000Y-71052380D01*
X153504761Y-71052380D01*
X153361904Y-71100000D01*
X153314285Y-71147619D01*
X152885714Y-72052380D02*
X152885714Y-71052380D01*
X152314285Y-72052380D02*
X152742857Y-71480952D01*
X152314285Y-71052380D02*
X152885714Y-71623809D01*
X123928571Y-83328571D02*
X123785714Y-83376190D01*
X123738095Y-83423809D01*
X123690476Y-83519047D01*
X123690476Y-83661904D01*
X123738095Y-83757142D01*
X123785714Y-83804761D01*
X123880952Y-83852380D01*
X124261904Y-83852380D01*
X124261904Y-82852380D01*
X123928571Y-82852380D01*
X123833333Y-82900000D01*
X123785714Y-82947619D01*
X123738095Y-83042857D01*
X123738095Y-83138095D01*
X123785714Y-83233333D01*
X123833333Y-83280952D01*
X123928571Y-83328571D01*
X124261904Y-83328571D01*
X155190476Y-54054761D02*
X155047619Y-54102380D01*
X154809523Y-54102380D01*
X154714285Y-54054761D01*
X154666666Y-54007142D01*
X154619047Y-53911904D01*
X154619047Y-53816666D01*
X154666666Y-53721428D01*
X154714285Y-53673809D01*
X154809523Y-53626190D01*
X155000000Y-53578571D01*
X155095238Y-53530952D01*
X155142857Y-53483333D01*
X155190476Y-53388095D01*
X155190476Y-53292857D01*
X155142857Y-53197619D01*
X155095238Y-53150000D01*
X155000000Y-53102380D01*
X154761904Y-53102380D01*
X154619047Y-53150000D01*
X153619047Y-54007142D02*
X153666666Y-54054761D01*
X153809523Y-54102380D01*
X153904761Y-54102380D01*
X154047619Y-54054761D01*
X154142857Y-53959523D01*
X154190476Y-53864285D01*
X154238095Y-53673809D01*
X154238095Y-53530952D01*
X154190476Y-53340476D01*
X154142857Y-53245238D01*
X154047619Y-53150000D01*
X153904761Y-53102380D01*
X153809523Y-53102380D01*
X153666666Y-53150000D01*
X153619047Y-53197619D01*
X152714285Y-54102380D02*
X153190476Y-54102380D01*
X153190476Y-53102380D01*
X146761904Y-82852380D02*
X146190476Y-82852380D01*
X146476190Y-83852380D02*
X146476190Y-82852380D01*
X145952380Y-82852380D02*
X145285714Y-83852380D01*
X145285714Y-82852380D02*
X145952380Y-83852380D01*
X154909523Y-74404761D02*
X154766666Y-74452380D01*
X154528571Y-74452380D01*
X154433333Y-74404761D01*
X154385714Y-74357142D01*
X154338095Y-74261904D01*
X154338095Y-74166666D01*
X154385714Y-74071428D01*
X154433333Y-74023809D01*
X154528571Y-73976190D01*
X154719047Y-73928571D01*
X154814285Y-73880952D01*
X154861904Y-73833333D01*
X154909523Y-73738095D01*
X154909523Y-73642857D01*
X154861904Y-73547619D01*
X154814285Y-73500000D01*
X154719047Y-73452380D01*
X154480952Y-73452380D01*
X154338095Y-73500000D01*
X153909523Y-74452380D02*
X153909523Y-73452380D01*
X153671428Y-73452380D01*
X153528571Y-73500000D01*
X153433333Y-73595238D01*
X153385714Y-73690476D01*
X153338095Y-73880952D01*
X153338095Y-74023809D01*
X153385714Y-74214285D01*
X153433333Y-74309523D01*
X153528571Y-74404761D01*
X153671428Y-74452380D01*
X153909523Y-74452380D01*
X152719047Y-73452380D02*
X152528571Y-73452380D01*
X152433333Y-73500000D01*
X152338095Y-73595238D01*
X152290476Y-73785714D01*
X152290476Y-74119047D01*
X152338095Y-74309523D01*
X152433333Y-74404761D01*
X152528571Y-74452380D01*
X152719047Y-74452380D01*
X152814285Y-74404761D01*
X152909523Y-74309523D01*
X152957142Y-74119047D01*
X152957142Y-73785714D01*
X152909523Y-73595238D01*
X152814285Y-73500000D01*
X152719047Y-73452380D01*
X154366666Y-69357142D02*
X154414285Y-69404761D01*
X154557142Y-69452380D01*
X154652380Y-69452380D01*
X154795238Y-69404761D01*
X154890476Y-69309523D01*
X154938095Y-69214285D01*
X154985714Y-69023809D01*
X154985714Y-68880952D01*
X154938095Y-68690476D01*
X154890476Y-68595238D01*
X154795238Y-68500000D01*
X154652380Y-68452380D01*
X154557142Y-68452380D01*
X154414285Y-68500000D01*
X154366666Y-68547619D01*
X153985714Y-69404761D02*
X153842857Y-69452380D01*
X153604761Y-69452380D01*
X153509523Y-69404761D01*
X153461904Y-69357142D01*
X153414285Y-69261904D01*
X153414285Y-69166666D01*
X153461904Y-69071428D01*
X153509523Y-69023809D01*
X153604761Y-68976190D01*
X153795238Y-68928571D01*
X153890476Y-68880952D01*
X153938095Y-68833333D01*
X153985714Y-68738095D01*
X153985714Y-68642857D01*
X153938095Y-68547619D01*
X153890476Y-68500000D01*
X153795238Y-68452380D01*
X153557142Y-68452380D01*
X153414285Y-68500000D01*
X154823809Y-77004761D02*
X154680952Y-77052380D01*
X154442857Y-77052380D01*
X154347619Y-77004761D01*
X154300000Y-76957142D01*
X154252380Y-76861904D01*
X154252380Y-76766666D01*
X154300000Y-76671428D01*
X154347619Y-76623809D01*
X154442857Y-76576190D01*
X154633333Y-76528571D01*
X154728571Y-76480952D01*
X154776190Y-76433333D01*
X154823809Y-76338095D01*
X154823809Y-76242857D01*
X154776190Y-76147619D01*
X154728571Y-76100000D01*
X154633333Y-76052380D01*
X154395238Y-76052380D01*
X154252380Y-76100000D01*
X153823809Y-77052380D02*
X153823809Y-76052380D01*
X153585714Y-76052380D01*
X153442857Y-76100000D01*
X153347619Y-76195238D01*
X153300000Y-76290476D01*
X153252380Y-76480952D01*
X153252380Y-76623809D01*
X153300000Y-76814285D01*
X153347619Y-76909523D01*
X153442857Y-77004761D01*
X153585714Y-77052380D01*
X153823809Y-77052380D01*
X152823809Y-77052380D02*
X152823809Y-76052380D01*
X119238095Y-83566666D02*
X118761904Y-83566666D01*
X119333333Y-83852380D02*
X119000000Y-82852380D01*
X118666666Y-83852380D01*
%TO.C,G\u002A\u002A\u002A*%
G36*
X131812198Y-62844827D02*
G01*
X131685152Y-62959802D01*
X131469942Y-63071874D01*
X131185779Y-63100667D01*
X131114931Y-63099520D01*
X130821941Y-63050799D01*
X130661089Y-62919730D01*
X130612000Y-62691794D01*
X130611687Y-62679285D01*
X131035333Y-62679285D01*
X131088849Y-62744212D01*
X131236589Y-62759501D01*
X131411689Y-62719782D01*
X131546311Y-62631412D01*
X131612272Y-62506092D01*
X131575548Y-62402239D01*
X131442539Y-62377625D01*
X131251347Y-62455033D01*
X131099309Y-62578751D01*
X131035333Y-62679285D01*
X130611687Y-62679285D01*
X130610169Y-62618649D01*
X130583811Y-62545065D01*
X130497065Y-62513769D01*
X130313870Y-62516024D01*
X129998166Y-62543096D01*
X129992096Y-62543661D01*
X129166972Y-62640068D01*
X128498442Y-62760722D01*
X127992146Y-62904606D01*
X127847089Y-62958996D01*
X127712381Y-63022770D01*
X127708326Y-63067746D01*
X127816139Y-63116548D01*
X127882965Y-63137699D01*
X128151340Y-63200448D01*
X128542522Y-63274858D01*
X129024196Y-63356073D01*
X129564045Y-63439233D01*
X130129755Y-63519483D01*
X130689011Y-63591964D01*
X131209498Y-63651819D01*
X131658900Y-63694190D01*
X131918700Y-63712459D01*
X132312285Y-63735992D01*
X132789613Y-63761696D01*
X133325398Y-63788482D01*
X133894355Y-63815258D01*
X134471200Y-63840934D01*
X135030647Y-63864420D01*
X135547411Y-63884625D01*
X135996207Y-63900458D01*
X136351751Y-63910829D01*
X136588757Y-63914648D01*
X136681940Y-63910824D01*
X136672582Y-63900122D01*
X136564137Y-63817358D01*
X136359448Y-63671510D01*
X136089273Y-63484695D01*
X135867798Y-63332271D01*
X135161904Y-62835071D01*
X134378941Y-62269599D01*
X133558504Y-61665200D01*
X132740187Y-61051217D01*
X131963586Y-60456993D01*
X131268295Y-59911873D01*
X131110875Y-59786725D01*
X130705169Y-59466208D01*
X130352150Y-59190190D01*
X130071675Y-58974024D01*
X129883604Y-58833065D01*
X129807795Y-58782667D01*
X129790424Y-58792842D01*
X129765333Y-58898249D01*
X129730592Y-59031438D01*
X129564501Y-59257738D01*
X129287598Y-59492941D01*
X128929095Y-59708736D01*
X128627461Y-59847647D01*
X128305391Y-59973466D01*
X128012600Y-60068588D01*
X127790570Y-60119581D01*
X127680786Y-60113009D01*
X127679629Y-60110220D01*
X127747758Y-60051589D01*
X127929639Y-59944314D01*
X128190089Y-59809371D01*
X128478556Y-59647199D01*
X128780772Y-59437347D01*
X128996090Y-59243648D01*
X129162267Y-59010248D01*
X129248457Y-58750735D01*
X129236529Y-58457949D01*
X129121872Y-58109503D01*
X128899871Y-57683010D01*
X128565913Y-57156081D01*
X128411502Y-56922885D01*
X128236087Y-56650217D01*
X128116321Y-56454282D01*
X128072000Y-56366718D01*
X128079760Y-56367002D01*
X128176628Y-56439176D01*
X128366937Y-56601423D01*
X128628675Y-56834644D01*
X128939833Y-57119741D01*
X129133430Y-57298498D01*
X129570948Y-57695332D01*
X129998417Y-58070873D01*
X130440318Y-58445293D01*
X130921132Y-58838767D01*
X131465339Y-59271469D01*
X132097421Y-59763572D01*
X132841857Y-60335250D01*
X133654443Y-60954571D01*
X134519022Y-61607558D01*
X135281800Y-62174740D01*
X135959386Y-62666957D01*
X136568391Y-63095050D01*
X137125423Y-63469858D01*
X137647092Y-63802220D01*
X138150008Y-64102977D01*
X138650780Y-64382969D01*
X139166019Y-64653036D01*
X139712333Y-64924016D01*
X140306333Y-65206751D01*
X140359960Y-65231910D01*
X140959471Y-65515205D01*
X141650998Y-65844946D01*
X142380307Y-66195102D01*
X143093163Y-66539644D01*
X143735333Y-66852540D01*
X144093304Y-67028530D01*
X144559480Y-67259846D01*
X144953553Y-67457919D01*
X145255474Y-67612560D01*
X145445190Y-67713577D01*
X145502653Y-67750779D01*
X145484597Y-67746450D01*
X145340172Y-67692214D01*
X145072949Y-67583636D01*
X144706177Y-67430389D01*
X144263107Y-67242147D01*
X143766986Y-67028583D01*
X143181203Y-66776860D01*
X142284960Y-66399133D01*
X141416746Y-66041771D01*
X140597588Y-65713051D01*
X139848508Y-65421246D01*
X139190534Y-65174632D01*
X138644690Y-64981485D01*
X138232000Y-64850079D01*
X138027708Y-64793556D01*
X137625646Y-64697551D01*
X137197463Y-64617808D01*
X136719291Y-64551738D01*
X136167260Y-64496751D01*
X135517502Y-64450258D01*
X134746149Y-64409669D01*
X133829333Y-64372395D01*
X133240738Y-64350492D01*
X132239701Y-64310769D01*
X131383807Y-64272551D01*
X130657215Y-64234467D01*
X130044086Y-64195150D01*
X129528577Y-64153231D01*
X129094849Y-64107340D01*
X128727060Y-64056110D01*
X128409370Y-63998171D01*
X128125938Y-63932155D01*
X127860923Y-63856693D01*
X127638172Y-63777858D01*
X127266890Y-63597013D01*
X126973187Y-63389710D01*
X126785997Y-63178326D01*
X126734250Y-62985240D01*
X126823881Y-62808698D01*
X127062920Y-62615491D01*
X127424766Y-62441560D01*
X127884924Y-62301463D01*
X128038823Y-62270087D01*
X128439959Y-62211613D01*
X128943649Y-62158705D01*
X129516035Y-62112986D01*
X130123259Y-62076079D01*
X130731461Y-62049605D01*
X131306783Y-62035187D01*
X131815366Y-62034447D01*
X132223352Y-62049007D01*
X132496882Y-62080490D01*
X132710617Y-62132935D01*
X132906937Y-62202234D01*
X132982666Y-62260003D01*
X132927610Y-62295601D01*
X132744449Y-62326698D01*
X132477324Y-62338667D01*
X132344861Y-62339736D01*
X132120953Y-62354420D01*
X132022902Y-62392983D01*
X132020010Y-62463827D01*
X132025182Y-62491451D01*
X132019988Y-62506092D01*
X131969375Y-62648759D01*
X131812198Y-62844827D01*
G37*
%TD*%
M02*
