%TF.GenerationSoftware,KiCad,Pcbnew,(5.99.0-11022-g0527dc6fe0)*%
%TF.CreationDate,2021-10-16T17:35:28-07:00*%
%TF.ProjectId,Botz Board V1,426f747a-2042-46f6-9172-642056312e6b,rev?*%
%TF.SameCoordinates,Original*%
%TF.FileFunction,Soldermask,Top*%
%TF.FilePolarity,Negative*%
%FSLAX46Y46*%
G04 Gerber Fmt 4.6, Leading zero omitted, Abs format (unit mm)*
G04 Created by KiCad (PCBNEW (5.99.0-11022-g0527dc6fe0)) date 2021-10-16 17:35:28*
%MOMM*%
%LPD*%
G01*
G04 APERTURE LIST*
G04 Aperture macros list*
%AMRoundRect*
0 Rectangle with rounded corners*
0 $1 Rounding radius*
0 $2 $3 $4 $5 $6 $7 $8 $9 X,Y pos of 4 corners*
0 Add a 4 corners polygon primitive as box body*
4,1,4,$2,$3,$4,$5,$6,$7,$8,$9,$2,$3,0*
0 Add four circle primitives for the rounded corners*
1,1,$1+$1,$2,$3*
1,1,$1+$1,$4,$5*
1,1,$1+$1,$6,$7*
1,1,$1+$1,$8,$9*
0 Add four rect primitives between the rounded corners*
20,1,$1+$1,$2,$3,$4,$5,0*
20,1,$1+$1,$4,$5,$6,$7,0*
20,1,$1+$1,$6,$7,$8,$9,0*
20,1,$1+$1,$8,$9,$2,$3,0*%
G04 Aperture macros list end*
%ADD10RoundRect,0.225000X-0.250000X0.225000X-0.250000X-0.225000X0.250000X-0.225000X0.250000X0.225000X0*%
%ADD11C,0.250000*%
%ADD12RoundRect,0.218750X0.256250X-0.218750X0.256250X0.218750X-0.256250X0.218750X-0.256250X-0.218750X0*%
%ADD13RoundRect,0.225000X0.225000X0.250000X-0.225000X0.250000X-0.225000X-0.250000X0.225000X-0.250000X0*%
%ADD14R,3.000000X3.000000*%
%ADD15C,3.000000*%
%ADD16RoundRect,0.225000X0.250000X-0.225000X0.250000X0.225000X-0.250000X0.225000X-0.250000X-0.225000X0*%
%ADD17RoundRect,0.200000X-0.200000X-0.275000X0.200000X-0.275000X0.200000X0.275000X-0.200000X0.275000X0*%
%ADD18R,1.700000X1.700000*%
%ADD19O,1.700000X1.700000*%
%ADD20R,0.450000X0.700000*%
%ADD21R,1.050000X2.000000*%
%ADD22RoundRect,0.200000X0.275000X-0.200000X0.275000X0.200000X-0.275000X0.200000X-0.275000X-0.200000X0*%
%ADD23RoundRect,0.225000X-0.225000X-0.250000X0.225000X-0.250000X0.225000X0.250000X-0.225000X0.250000X0*%
%ADD24RoundRect,0.200000X-0.275000X0.200000X-0.275000X-0.200000X0.275000X-0.200000X0.275000X0.200000X0*%
%ADD25RoundRect,0.150000X-0.825000X-0.150000X0.825000X-0.150000X0.825000X0.150000X-0.825000X0.150000X0*%
%ADD26R,0.750000X0.700000*%
%ADD27RoundRect,0.200000X0.200000X0.275000X-0.200000X0.275000X-0.200000X-0.275000X0.200000X-0.275000X0*%
%ADD28R,1.060000X0.650000*%
%ADD29RoundRect,0.218750X0.218750X0.256250X-0.218750X0.256250X-0.218750X-0.256250X0.218750X-0.256250X0*%
%ADD30RoundRect,0.150000X0.825000X0.150000X-0.825000X0.150000X-0.825000X-0.150000X0.825000X-0.150000X0*%
%ADD31RoundRect,0.075000X0.075000X-0.350000X0.075000X0.350000X-0.075000X0.350000X-0.075000X-0.350000X0*%
%ADD32RoundRect,0.075000X0.350000X-0.075000X0.350000X0.075000X-0.350000X0.075000X-0.350000X-0.075000X0*%
%ADD33R,2.650000X2.650000*%
%ADD34RoundRect,0.150000X-0.150000X0.825000X-0.150000X-0.825000X0.150000X-0.825000X0.150000X0.825000X0*%
%ADD35RoundRect,0.218750X-0.256250X0.218750X-0.256250X-0.218750X0.256250X-0.218750X0.256250X0.218750X0*%
%ADD36RoundRect,0.075000X-0.075000X0.662500X-0.075000X-0.662500X0.075000X-0.662500X0.075000X0.662500X0*%
%ADD37RoundRect,0.075000X-0.662500X0.075000X-0.662500X-0.075000X0.662500X-0.075000X0.662500X0.075000X0*%
%ADD38R,2.000000X2.000000*%
%ADD39RoundRect,0.150000X-0.875000X-0.150000X0.875000X-0.150000X0.875000X0.150000X-0.875000X0.150000X0*%
G04 APERTURE END LIST*
D10*
%TO.C,C3*%
X136050000Y-55725000D03*
X136050000Y-57275000D03*
%TD*%
D11*
%TO.C,U5*%
X125500000Y-74000000D03*
X125900000Y-74000000D03*
X125500000Y-74400000D03*
X125900000Y-74400000D03*
%TD*%
D12*
%TO.C,D6*%
X132900000Y-85075000D03*
X132900000Y-83500000D03*
%TD*%
D13*
%TO.C,C25*%
X120642031Y-66274910D03*
X119092031Y-66274910D03*
%TD*%
D14*
%TO.C,J4*%
X156120000Y-44000000D03*
D15*
X151040000Y-44000000D03*
X145960000Y-44000000D03*
X140880000Y-44000000D03*
%TD*%
D16*
%TO.C,C7*%
X136050000Y-54275000D03*
X136050000Y-52725000D03*
%TD*%
D14*
%TO.C,J5*%
X129120000Y-44000000D03*
D15*
X124040000Y-44000000D03*
X118960000Y-44000000D03*
X113880000Y-44000000D03*
%TD*%
D16*
%TO.C,R9*%
X119300000Y-61375000D03*
X119300000Y-59825000D03*
%TD*%
D17*
%TO.C,R16*%
X130875000Y-71000000D03*
X132525000Y-71000000D03*
%TD*%
D18*
%TO.C,J1*%
X113000000Y-55125000D03*
D19*
X113000000Y-57665000D03*
X113000000Y-60205000D03*
X113000000Y-62745000D03*
X113000000Y-65285000D03*
X113000000Y-67825000D03*
X113000000Y-70365000D03*
X113000000Y-72905000D03*
%TD*%
D13*
%TO.C,C10*%
X150125000Y-60800000D03*
X148575000Y-60800000D03*
%TD*%
D18*
%TO.C,J9*%
X157000000Y-51200000D03*
D19*
X157000000Y-53740000D03*
X157000000Y-56280000D03*
X157000000Y-58820000D03*
%TD*%
D20*
%TO.C,U9*%
X141650000Y-52000000D03*
X140350000Y-52000000D03*
X141000000Y-54000000D03*
%TD*%
D21*
%TO.C,SW2*%
X153125000Y-64000000D03*
X148675000Y-64000000D03*
%TD*%
D22*
%TO.C,R14*%
X116600000Y-75000000D03*
X116600000Y-73350000D03*
%TD*%
D10*
%TO.C,C17*%
X135600000Y-78125000D03*
X135600000Y-79675000D03*
%TD*%
D23*
%TO.C,C28*%
X123275000Y-69400000D03*
X124825000Y-69400000D03*
%TD*%
D24*
%TO.C,R5*%
X137300000Y-86425000D03*
X137300000Y-88075000D03*
%TD*%
D16*
%TO.C,C6*%
X134050000Y-54275000D03*
X134050000Y-52725000D03*
%TD*%
%TO.C,C16*%
X135600000Y-72575000D03*
X135600000Y-71025000D03*
%TD*%
D10*
%TO.C,C14*%
X149150000Y-71025000D03*
X149150000Y-72575000D03*
%TD*%
D25*
%TO.C,U6*%
X147525000Y-49095000D03*
X147525000Y-50365000D03*
X147525000Y-51635000D03*
X147525000Y-52905000D03*
X152475000Y-52905000D03*
X152475000Y-51635000D03*
X152475000Y-50365000D03*
X152475000Y-49095000D03*
%TD*%
D18*
%TO.C,J6*%
X157000000Y-64000000D03*
D19*
X157000000Y-66540000D03*
X157000000Y-69080000D03*
X157000000Y-71620000D03*
X157000000Y-74160000D03*
X157000000Y-76700000D03*
X157000000Y-79240000D03*
%TD*%
D10*
%TO.C,C15*%
X135600000Y-75025000D03*
X135600000Y-76575000D03*
%TD*%
%TO.C,C13*%
X134000000Y-71025000D03*
X134000000Y-72575000D03*
%TD*%
D26*
%TO.C,Y1*%
X125475000Y-56650000D03*
X124125000Y-56650000D03*
X124125000Y-57650000D03*
X125475000Y-57650000D03*
%TD*%
D12*
%TO.C,D5*%
X137300000Y-85037500D03*
X137300000Y-83462500D03*
%TD*%
D27*
%TO.C,R7*%
X150225000Y-68100000D03*
X148575000Y-68100000D03*
%TD*%
D28*
%TO.C,U10*%
X151150000Y-78050000D03*
X151150000Y-79000000D03*
X151150000Y-79950000D03*
X153350000Y-79950000D03*
X153350000Y-78050000D03*
%TD*%
D22*
%TO.C,R3*%
X137300000Y-44825000D03*
X137300000Y-43175000D03*
%TD*%
D23*
%TO.C,R20*%
X138225000Y-50000000D03*
X139775000Y-50000000D03*
%TD*%
D17*
%TO.C,R1*%
X144476718Y-57272500D03*
X146126718Y-57272500D03*
%TD*%
D16*
%TO.C,C9*%
X125500000Y-54875000D03*
X125500000Y-53325000D03*
%TD*%
D10*
%TO.C,C20*%
X145500000Y-50225000D03*
X145500000Y-51775000D03*
%TD*%
D29*
%TO.C,D2*%
X143091718Y-58865000D03*
X141516718Y-58865000D03*
%TD*%
D27*
%TO.C,R15*%
X125065000Y-71750000D03*
X123415000Y-71750000D03*
%TD*%
D10*
%TO.C,C2*%
X134050000Y-55725000D03*
X134050000Y-57275000D03*
%TD*%
D14*
%TO.C,J8*%
X114000000Y-86000000D03*
D15*
X119080000Y-86000000D03*
X124160000Y-86000000D03*
X129240000Y-86000000D03*
%TD*%
D23*
%TO.C,R17*%
X130225000Y-50000000D03*
X131775000Y-50000000D03*
%TD*%
D30*
%TO.C,U8*%
X121825000Y-52805000D03*
X121825000Y-51535000D03*
X121825000Y-50265000D03*
X121825000Y-48995000D03*
X116875000Y-48995000D03*
X116875000Y-50265000D03*
X116875000Y-51535000D03*
X116875000Y-52805000D03*
%TD*%
D10*
%TO.C,C21*%
X134200000Y-46225000D03*
X134200000Y-47775000D03*
%TD*%
%TO.C,C4*%
X138050000Y-55725000D03*
X138050000Y-57275000D03*
%TD*%
D31*
%TO.C,U7*%
X118600000Y-71750000D03*
X119100000Y-71750000D03*
X119600000Y-71750000D03*
X120100000Y-71750000D03*
X120600000Y-71750000D03*
X121100000Y-71750000D03*
D32*
X121800000Y-71050000D03*
X121800000Y-70550000D03*
X121800000Y-70050000D03*
X121800000Y-69550000D03*
X121800000Y-69050000D03*
X121800000Y-68550000D03*
D31*
X121100000Y-67850000D03*
X120600000Y-67850000D03*
X120100000Y-67850000D03*
X119600000Y-67850000D03*
X119100000Y-67850000D03*
X118600000Y-67850000D03*
D32*
X117900000Y-68550000D03*
X117900000Y-69050000D03*
X117900000Y-69550000D03*
X117900000Y-70050000D03*
X117900000Y-70550000D03*
X117900000Y-71050000D03*
D33*
X119850000Y-69800000D03*
%TD*%
D16*
%TO.C,C29*%
X153400000Y-76225000D03*
X153400000Y-74675000D03*
%TD*%
%TO.C,C12*%
X124000000Y-54875000D03*
X124000000Y-53325000D03*
%TD*%
D18*
%TO.C,J2*%
X113000000Y-79000000D03*
D19*
X115540000Y-79000000D03*
X118080000Y-79000000D03*
X120620000Y-79000000D03*
X123160000Y-79000000D03*
X125700000Y-79000000D03*
%TD*%
D17*
%TO.C,R2*%
X144475000Y-58880052D03*
X146125000Y-58880052D03*
%TD*%
D34*
%TO.C,U3*%
X132405000Y-74625000D03*
X131135000Y-74625000D03*
X129865000Y-74625000D03*
X128595000Y-74625000D03*
X128595000Y-79575000D03*
X129865000Y-79575000D03*
X131135000Y-79575000D03*
X132405000Y-79575000D03*
%TD*%
D22*
%TO.C,R4*%
X132700000Y-44814218D03*
X132700000Y-43164218D03*
%TD*%
D13*
%TO.C,C27*%
X116632879Y-76443579D03*
X115082879Y-76443579D03*
%TD*%
D10*
%TO.C,C1*%
X132050000Y-55725000D03*
X132050000Y-57275000D03*
%TD*%
D24*
%TO.C,R12*%
X134050000Y-74975000D03*
X134050000Y-76625000D03*
%TD*%
D10*
%TO.C,C24*%
X151100000Y-74675000D03*
X151100000Y-76225000D03*
%TD*%
D27*
%TO.C,R13*%
X128065000Y-71750000D03*
X126415000Y-71750000D03*
%TD*%
D16*
%TO.C,C8*%
X138050000Y-54275000D03*
X138050000Y-52725000D03*
%TD*%
%TO.C,R8*%
X119300000Y-58375000D03*
X119300000Y-56825000D03*
%TD*%
D23*
%TO.C,R18*%
X126225000Y-50000000D03*
X127775000Y-50000000D03*
%TD*%
D17*
%TO.C,R11*%
X130875000Y-72550000D03*
X132525000Y-72550000D03*
%TD*%
D16*
%TO.C,C5*%
X132050000Y-54275000D03*
X132050000Y-52725000D03*
%TD*%
D20*
%TO.C,U4*%
X129650000Y-52000000D03*
X128350000Y-52000000D03*
X129000000Y-54000000D03*
%TD*%
D35*
%TO.C,D3*%
X137300353Y-46210782D03*
X137300353Y-47785782D03*
%TD*%
D23*
%TO.C,R19*%
X142225000Y-50000000D03*
X143775000Y-50000000D03*
%TD*%
D17*
%TO.C,R10*%
X124875000Y-76400000D03*
X126525000Y-76400000D03*
%TD*%
D10*
%TO.C,C18*%
X123350000Y-73475000D03*
X123350000Y-75025000D03*
%TD*%
D23*
%TO.C,C26*%
X119100000Y-64800000D03*
X120650000Y-64800000D03*
%TD*%
D29*
%TO.C,D1*%
X143091718Y-57250000D03*
X141516718Y-57250000D03*
%TD*%
D13*
%TO.C,C11*%
X150150000Y-66500000D03*
X148600000Y-66500000D03*
%TD*%
D10*
%TO.C,C23*%
X135800000Y-46225000D03*
X135800000Y-47775000D03*
%TD*%
D24*
%TO.C,R6*%
X132900000Y-86462500D03*
X132900000Y-88112500D03*
%TD*%
D21*
%TO.C,SW1*%
X153125000Y-58200000D03*
X148675000Y-58200000D03*
%TD*%
D18*
%TO.C,J3*%
X116700000Y-60275000D03*
D19*
X116700000Y-57735000D03*
%TD*%
D36*
%TO.C,U1*%
X137500000Y-59887500D03*
X137000000Y-59887500D03*
X136500000Y-59887500D03*
X136000000Y-59887500D03*
X135500000Y-59887500D03*
X135000000Y-59887500D03*
X134500000Y-59887500D03*
X134000000Y-59887500D03*
X133500000Y-59887500D03*
X133000000Y-59887500D03*
X132500000Y-59887500D03*
X132000000Y-59887500D03*
D37*
X130587500Y-61300000D03*
X130587500Y-61800000D03*
X130587500Y-62300000D03*
X130587500Y-62800000D03*
X130587500Y-63300000D03*
X130587500Y-63800000D03*
X130587500Y-64300000D03*
X130587500Y-64800000D03*
X130587500Y-65300000D03*
X130587500Y-65800000D03*
X130587500Y-66300000D03*
X130587500Y-66800000D03*
D36*
X132000000Y-68212500D03*
X132500000Y-68212500D03*
X133000000Y-68212500D03*
X133500000Y-68212500D03*
X134000000Y-68212500D03*
X134500000Y-68212500D03*
X135000000Y-68212500D03*
X135500000Y-68212500D03*
X136000000Y-68212500D03*
X136500000Y-68212500D03*
X137000000Y-68212500D03*
X137500000Y-68212500D03*
D37*
X138912500Y-66800000D03*
X138912500Y-66300000D03*
X138912500Y-65800000D03*
X138912500Y-65300000D03*
X138912500Y-64800000D03*
X138912500Y-64300000D03*
X138912500Y-63800000D03*
X138912500Y-63300000D03*
X138912500Y-62800000D03*
X138912500Y-62300000D03*
X138912500Y-61800000D03*
X138912500Y-61300000D03*
%TD*%
D16*
%TO.C,C22*%
X124000000Y-51775000D03*
X124000000Y-50225000D03*
%TD*%
%TO.C,C19*%
X134050000Y-79675000D03*
X134050000Y-78125000D03*
%TD*%
D35*
%TO.C,D4*%
X132718248Y-46212500D03*
X132718248Y-47787500D03*
%TD*%
D14*
%TO.C,J7*%
X141000000Y-86000000D03*
D15*
X146080000Y-86000000D03*
X151160000Y-86000000D03*
X156240000Y-86000000D03*
%TD*%
D38*
%TO.C,TP1*%
X112800000Y-50900000D03*
%TD*%
D39*
%TO.C,U2*%
X137750000Y-71255000D03*
X137750000Y-72525000D03*
X137750000Y-73795000D03*
X137750000Y-75065000D03*
X137750000Y-76335000D03*
X137750000Y-77605000D03*
X137750000Y-78875000D03*
X137750000Y-80145000D03*
X147050000Y-80145000D03*
X147050000Y-78875000D03*
X147050000Y-77605000D03*
X147050000Y-76335000D03*
X147050000Y-75065000D03*
X147050000Y-73795000D03*
X147050000Y-72525000D03*
X147050000Y-71255000D03*
%TD*%
M02*
