M48
; DRILL file {KiCad (5.99.0-11022-g0527dc6fe0)} date Sat Oct 16 17:35:24 2021
; FORMAT={-:-/ absolute / inch / decimal}
; #@! TF.CreationDate,2021-10-16T17:35:24-07:00
; #@! TF.GenerationSoftware,Kicad,Pcbnew,(5.99.0-11022-g0527dc6fe0)
; #@! TF.FileFunction,NonPlated,1,2,NPTH
FMAT,2
INCH
%
G90
G05
T0
M30
