"Source:","C:\Users\iduri\OneDrive\Documents\KiCAD Projects\Botz Board V1\Botz Board V1.kicad_sch"
"Date:","7/30/2021 10:32:34 PM"
"Tool:","Eeschema (5.99.0-11135-g27804e40e2)"
"Generator:","C:\Program Files\KiCad\5.99\bin\scripting\plugins/bom_csv_grouped_by_value.py"
"Component Count:","73"

"Individual Components:"

"Item","Qty","Reference(s)","Value","LibPart","Footprint","Datasheet"
"","","C1","0.1uF","Device:C","Capacitor_SMD:C_0603_1608Metric","~"
"","","C2","0.1uF","Device:C","Capacitor_SMD:C_0603_1608Metric","~"
"","","C3","0.1uF","Device:C","Capacitor_SMD:C_0603_1608Metric","~"
"","","C4","4.7uF","Device:C","Capacitor_SMD:C_0603_1608Metric","~"
"","","C5","10nF","Device:C","Capacitor_SMD:C_0603_1608Metric","~"
"","","C6","1uF","Device:C","Capacitor_SMD:C_0603_1608Metric","~"
"","","C7","0.1uF","Device:C","Capacitor_SMD:C_0603_1608Metric","~"
"","","C8","1uF","Device:C","Capacitor_SMD:C_0603_1608Metric","~"
"","","C9","22pF","Device:C","Capacitor_SMD:C_0603_1608Metric","~"
"","","C10","0.1uF","Device:C","Capacitor_SMD:C_0603_1608Metric","~"
"","","C11","0.1uF","Device:C","Capacitor_SMD:C_0603_1608Metric","~"
"","","C12","22pF","Device:C","Capacitor_SMD:C_0603_1608Metric","~"
"","","C13","0.1uF","Device:C","Capacitor_SMD:C_0603_1608Metric","~"
"","","C14","0.1uF","Device:C","Capacitor_SMD:C_0603_1608Metric","~"
"","","C15","4.7nF","Device:C","Capacitor_SMD:C_0603_1608Metric","~"
"","","C16","4.7nF","Device:C","Capacitor_SMD:C_0603_1608Metric","~"
"","","C17","0.1uF","Device:C","Capacitor_SMD:C_0603_1608Metric","~"
"","","C18","2.2uF","Device:C","Capacitor_SMD:C_0603_1608Metric","~"
"","","C19","0.1uF","Device:C","Capacitor_SMD:C_0603_1608Metric","~"
"","","C21","0.1uF","Device:C","Capacitor_SMD:C_0603_1608Metric","~"
"","","C22","0.1uF","Device:C","Capacitor_SMD:C_0603_1608Metric","~"
"","","C23","0.1 uF","Device:C","Capacitor_SMD:C_0603_1608Metric","~"
"","","C24","0.1 uF","Device:C","Capacitor_SMD:C_0603_1608Metric","~"
"","","C25","2.2uF","Device:C","Capacitor_SMD:C_0603_1608Metric","~"
"","","C26","0.1uF","Device:C","Capacitor_SMD:C_0603_1608Metric","~"
"","","C27","10nF","Device:C","Capacitor_SMD:C_0603_1608Metric","~"
"","","C28","0.1uF","Device:C","Capacitor_SMD:C_0603_1608Metric","~"
"","","D1","RED","Device:LED","LED_SMD:LED_0603_1608Metric","~"
"","","D2","BLUE","Device:LED","LED_SMD:LED_0603_1608Metric","~"
"","","D3","BLUE","Device:LED","LED_SMD:LED_0603_1608Metric","~"
"","","D4","BLUE","Device:LED","LED_SMD:LED_0603_1608Metric","~"
"","","D5","BLUE","Device:LED","LED_SMD:LED_0603_1608Metric","~"
"","","D6","BLUE","Device:LED","LED_SMD:LED_0603_1608Metric","~"
"","","J1","Conn_01x08","Connector_Generic:Conn_01x08","Connector_PinHeader_2.54mm:PinHeader_1x08_P2.54mm_Vertical","~"
"","","J2","Conn_01x06","Connector_Generic:Conn_01x06","Connector_PinHeader_2.54mm:PinHeader_1x06_P2.54mm_Vertical","~"
"","","J3","Conn_01x02","Connector_Generic:Conn_01x02","Connector_PinHeader_2.54mm:PinHeader_1x02_P2.54mm_Vertical","~"
"","","J4","Conn_01x04","Connector_Generic:Conn_01x04","TerminalBlock:TerminalBlock_bornier-4_P5.08mm","~"
"","","J5","Conn_01x04","Connector_Generic:Conn_01x04","TerminalBlock:TerminalBlock_bornier-4_P5.08mm","~"
"","","J6","Conn_01x07","Connector_Generic:Conn_01x07","Connector_PinHeader_2.54mm:PinHeader_1x07_P2.54mm_Vertical","~"
"","","J7","Conn_01x03","Connector_Generic:Conn_01x03","TerminalBlock:TerminalBlock_bornier-3_P5.08mm","~"
"","","J8","Conn_01x03","Connector_Generic:Conn_01x03","TerminalBlock:TerminalBlock_bornier-3_P5.08mm","~"
"","","J9","Conn_01x04","Connector_Generic:Conn_01x04","Connector_PinSocket_2.54mm:PinSocket_1x04_P2.54mm_Vertical","~"
"","","R1","470","Device:R","Resistor_SMD:R_0603_1608Metric","~"
"","","R2","470","Device:R","Resistor_SMD:R_0603_1608Metric","~"
"","","R3","470","Device:R","Resistor_SMD:R_0603_1608Metric","~"
"","","R4","470","Device:R","Resistor_SMD:R_0603_1608Metric","~"
"","","R5","470","Device:R","Resistor_SMD:R_0603_1608Metric","~"
"","","R6","470","Device:R","Resistor_SMD:R_0603_1608Metric","~"
"","","R7","100K","Device:R","Resistor_SMD:R_0603_1608Metric","~"
"","","R8","47K","Device:R","Capacitor_SMD:C_0603_1608Metric","~"
"","","R9","47K","Device:R","Capacitor_SMD:C_0603_1608Metric","~"
"","","R10","10K","Device:R","Resistor_SMD:R_0603_1608Metric","~"
"","","R11","10K","Device:R","Resistor_SMD:R_0603_1608Metric","~"
"","","R12","10K","Device:R","Resistor_SMD:R_0603_1608Metric","~"
"","","R13","2.7K","Device:R","Resistor_SMD:R_0603_1608Metric","~"
"","","R14","10K","Device:R","Resistor_SMD:R_0603_1608Metric","~"
"","","R15","2.7K","Device:R","Resistor_SMD:R_0603_1608Metric","~"
"","","R16","60","Device:R","Capacitor_SMD:C_0603_1608Metric","~"
"","","R17","60","Device:R","Capacitor_SMD:C_0603_1608Metric","~"
"","","R18","60","Device:R","Capacitor_SMD:C_0603_1608Metric","~"
"","","R19","60","Device:R","Capacitor_SMD:C_0603_1608Metric","~"
"","","SW1","SW_Push","Switch:SW_Push","TS_1088R:TS-1088R-02026","~"
"","","SW2","SW_Push","Switch:SW_Push","TS_1088R:TS-1088R-02026","~"
"","","U1","STM32G491CETx","MCU_ST_STM32G4:STM32G491CETx","Package_QFP:LQFP-48_7x7mm_P0.5mm",""
"","","U2","TCAN332","Interface_CAN_LIN:TCAN332","Package_SO:SOIC-8_3.9x4.9mm_P1.27mm","http://www.ti.com/lit/ds/symlink/tcan337.pdf"
"","","U3","TCAN332","Interface_CAN_LIN:TCAN332","Package_SO:SOIC-8_3.9x4.9mm_P1.27mm","http://www.ti.com/lit/ds/symlink/tcan337.pdf"
"","","U4","MAX3232","Interface_UART:MAX3232","Package_SO:SOIC-16W_7.5x10.3mm_P1.27mm","https://datasheets.maximintegrated.com/en/ds/MAX3222-MAX3241.pdf"
"","","U5","MMC5603NJ","MMC5603:MMC5603NJ","Package_BGA:WLP-4_0.86x0.86mm_P0.4mm",""
"","","U6","MAX3485","Interface_UART:MAX3485","Package_SO:SOIC-8_3.9x4.9mm_P1.27mm","https://datasheets.maximintegrated.com/en/ds/MAX3483-MAX3491.pdf"
"","","U7","ICM20689","ICM_20689:ICM20689","Package_DFN_QFN:QFN-24-1EP_4x4mm_P0.5mm_EP2.65x2.65mm",""
"","","U8","PESD1CAN-UX","PESD1CAN-U:PESD1CAN-UX","Package_TO_SOT_SMD:SOT-323_SC-70",""
"","","U9","PESD1CAN-UX","PESD1CAN-U:PESD1CAN-UX","Package_TO_SOT_SMD:SOT-323_SC-70",""
"","","Y1","16MHz","Device:Crystal","XRCGB16M000FXN20R0:OSC_XRCGB16M000FXN20R0","~"



"Collated Components:"

"Item","Qty","Reference(s)","Value","LibPart","Footprint","Datasheet"
"1","14","C1, C2, C3, C7, C10, C11, C13, C14, C17, C19, C21, C22, C26, C28","0.1uF","Device:C","Capacitor_SMD:C_0603_1608Metric","~"
"2","1","C4","4.7uF","Device:C","Capacitor_SMD:C_0603_1608Metric","~"
"3","2","C5, C27","10nF","Device:C","Capacitor_SMD:C_0603_1608Metric","~"
"4","2","C6, C8","1uF","Device:C","Capacitor_SMD:C_0603_1608Metric","~"
"5","2","C9, C12","22pF","Device:C","Capacitor_SMD:C_0603_1608Metric","~"
"6","2","C15, C16","4.7nF","Device:C","Capacitor_SMD:C_0603_1608Metric","~"
"7","2","C18, C25","2.2uF","Device:C","Capacitor_SMD:C_0603_1608Metric","~"
"8","2","C23, C24","0.1 uF","Device:C","Capacitor_SMD:C_0603_1608Metric","~"
"9","1","D1","RED","Device:LED","LED_SMD:LED_0603_1608Metric","~"
"10","5","D2, D3, D4, D5, D6","BLUE","Device:LED","LED_SMD:LED_0603_1608Metric","~"
"11","1","J1","Conn_01x08","Connector_Generic:Conn_01x08","Connector_PinHeader_2.54mm:PinHeader_1x08_P2.54mm_Vertical","~"
"12","1","J2","Conn_01x06","Connector_Generic:Conn_01x06","Connector_PinHeader_2.54mm:PinHeader_1x06_P2.54mm_Vertical","~"
"13","1","J3","Conn_01x02","Connector_Generic:Conn_01x02","Connector_PinHeader_2.54mm:PinHeader_1x02_P2.54mm_Vertical","~"
"14","2","J4, J5","Conn_01x04","Connector_Generic:Conn_01x04","TerminalBlock:TerminalBlock_bornier-4_P5.08mm","~"
"15","1","J6","Conn_01x07","Connector_Generic:Conn_01x07","Connector_PinHeader_2.54mm:PinHeader_1x07_P2.54mm_Vertical","~"
"16","2","J7, J8","Conn_01x03","Connector_Generic:Conn_01x03","TerminalBlock:TerminalBlock_bornier-3_P5.08mm","~"
"17","1","J9","Conn_01x04","Connector_Generic:Conn_01x04","Connector_PinSocket_2.54mm:PinSocket_1x04_P2.54mm_Vertical","~"
"18","6","R1, R2, R3, R4, R5, R6","470","Device:R","Resistor_SMD:R_0603_1608Metric","~"
"19","1","R7","100K","Device:R","Resistor_SMD:R_0603_1608Metric","~"
"20","2","R8, R9","47K","Device:R","Capacitor_SMD:C_0603_1608Metric","~"
"21","4","R10, R11, R12, R14","10K","Device:R","Resistor_SMD:R_0603_1608Metric","~"
"22","2","R13, R15","2.7K","Device:R","Resistor_SMD:R_0603_1608Metric","~"
"23","4","R16, R17, R18, R19","60","Device:R","Capacitor_SMD:C_0603_1608Metric","~"
"24","2","SW1, SW2","SW_Push","Switch:SW_Push","TS_1088R:TS-1088R-02026","~"
"25","1","U1","STM32G491CETx","MCU_ST_STM32G4:STM32G491CETx","Package_QFP:LQFP-48_7x7mm_P0.5mm",""
"26","2","U2, U3","TCAN332","Interface_CAN_LIN:TCAN332","Package_SO:SOIC-8_3.9x4.9mm_P1.27mm","http://www.ti.com/lit/ds/symlink/tcan337.pdf"
"27","1","U4","MAX3232","Interface_UART:MAX3232","Package_SO:SOIC-16W_7.5x10.3mm_P1.27mm","https://datasheets.maximintegrated.com/en/ds/MAX3222-MAX3241.pdf"
"28","1","U5","MMC5603NJ","MMC5603:MMC5603NJ","Package_BGA:WLP-4_0.86x0.86mm_P0.4mm",""
"29","1","U6","MAX3485","Interface_UART:MAX3485","Package_SO:SOIC-8_3.9x4.9mm_P1.27mm","https://datasheets.maximintegrated.com/en/ds/MAX3483-MAX3491.pdf"
"30","1","U7","ICM20689","ICM_20689:ICM20689","Package_DFN_QFN:QFN-24-1EP_4x4mm_P0.5mm_EP2.65x2.65mm",""
"31","2","U8, U9","PESD1CAN-UX","PESD1CAN-U:PESD1CAN-UX","Package_TO_SOT_SMD:SOT-323_SC-70",""
"32","1","Y1","16MHz","Device:Crystal","XRCGB16M000FXN20R0:OSC_XRCGB16M000FXN20R0","~"
