(footprint "ADAMTECH_TERMINALBLOCK_01X04" (version 20210606) (generator pcbnew) (layer "F.Cu")
  (tedit 60FFA018)
  (fp_text reference "REF**" (at 0 -0.5 unlocked) (layer "F.SilkS")
    (effects (font (size 1 1) (thickness 0.15)))
    (tstamp a1121082-4eda-49a4-a712-b5336750d297)
  )
  (fp_text value "ADAMTECH_TERMINALBLOCK_01X04" (at 0 1 unlocked) (layer "F.Fab")
    (effects (font (size 1 1) (thickness 0.15)))
    (tstamp 79e5a9bb-e1ea-4dad-83fb-3514831ad517)
  )
  (fp_text user "${REFERENCE}" (at 0 2.5 unlocked) (layer "F.Fab")
    (effects (font (size 1 1) (thickness 0.15)))
    (tstamp 7ffd7929-c8e9-438e-820c-d66ea6985571)
  )
)
