(kicad_symbol_lib (version 20201005) (generator kicad_symbol_editor)
  (symbol "PESD1CAN-U:PESD1CAN-UX" (in_bom yes) (on_board yes)
    (property "Reference" "U" (id 0) (at -38.735 36.83 0)
      (effects (font (size 1.27 1.27)))
    )
    (property "Value" "PESD1CAN-UX" (id 1) (at -15.24 26.035 0)
      (effects (font (size 1.27 1.27)))
    )
    (property "Footprint" "" (id 2) (at -38.735 36.83 0)
      (effects (font (size 1.27 1.27)) hide)
    )
    (property "Datasheet" "" (id 3) (at -38.735 36.83 0)
      (effects (font (size 1.27 1.27)) hide)
    )
    (symbol "PESD1CAN-UX_0_1"
      (rectangle (start -6.35 5.08) (end 6.35 -5.08)
        (stroke (width 0.1524)) (fill (type background))
      )
      (polyline
        (pts
          (xy 0 -5.08)
          (xy 0 -3.81)
        )
        (stroke (width 0.1524)) (fill (type none))
      )
      (polyline
        (pts
          (xy -3.81 -2.54)
          (xy -1.27 -2.54)
          (xy -1.27 -1.27)
        )
        (stroke (width 0.1524)) (fill (type none))
      )
      (polyline
        (pts
          (xy -2.54 5.08)
          (xy -2.54 -3.81)
          (xy 0 -3.81)
        )
        (stroke (width 0.1524)) (fill (type none))
      )
      (polyline
        (pts
          (xy -1.27 3.81)
          (xy -3.81 3.81)
          (xy -3.81 2.54)
        )
        (stroke (width 0.1524)) (fill (type none))
      )
      (polyline
        (pts
          (xy 1.27 -2.54)
          (xy 3.81 -2.54)
          (xy 3.81 -1.27)
        )
        (stroke (width 0.1524)) (fill (type none))
      )
      (polyline
        (pts
          (xy 2.54 5.08)
          (xy 2.54 -3.81)
          (xy 0 -3.81)
        )
        (stroke (width 0.1524)) (fill (type none))
      )
      (polyline
        (pts
          (xy 3.81 3.81)
          (xy 1.27 3.81)
          (xy 1.27 2.54)
        )
        (stroke (width 0.1524)) (fill (type none))
      )
      (polyline
        (pts
          (xy -3.81 1.27)
          (xy -2.54 3.81)
          (xy -1.27 1.27)
          (xy -3.81 1.27)
        )
        (stroke (width 0.1524)) (fill (type none))
      )
      (polyline
        (pts
          (xy -1.27 0)
          (xy -2.54 -2.54)
          (xy -3.81 0)
          (xy -1.27 0)
        )
        (stroke (width 0.1524)) (fill (type none))
      )
      (polyline
        (pts
          (xy 1.27 1.27)
          (xy 2.54 3.81)
          (xy 3.81 1.27)
          (xy 1.27 1.27)
        )
        (stroke (width 0.1524)) (fill (type none))
      )
      (polyline
        (pts
          (xy 3.81 0)
          (xy 2.54 -2.54)
          (xy 1.27 0)
          (xy 3.81 0)
        )
        (stroke (width 0.1524)) (fill (type none))
      )
    )
    (symbol "PESD1CAN-UX_1_1"
      (pin bidirectional line (at -2.54 7.62 270) (length 2.54)
        (name "" (effects (font (size 1.27 1.27))))
        (number "1" (effects (font (size 1.27 1.27))))
      )
      (pin bidirectional line (at 2.54 7.62 270) (length 2.54)
        (name "" (effects (font (size 1.27 1.27))))
        (number "2" (effects (font (size 1.27 1.27))))
      )
      (pin power_in line (at 0 -7.62 90) (length 2.54)
        (name "" (effects (font (size 1.27 1.27))))
        (number "3" (effects (font (size 1.27 1.27))))
      )
    )
  )
)
