%!PS-Adobe-3.0
%%Creator: PCBNEW
%%CreationDate: Sat Oct 16 17:35:25 2021
%%Title: ()
%%Pages: 1
%%PageOrder: Ascend
%%BoundingBox: 0 0 596 842
%%DocumentMedia: A4 595 842 0 () ()
%%Orientation: Landscape
%%EndComments
%%BeginProlog
/line { newpath moveto lineto stroke } bind def
/cir0 { newpath 0 360 arc stroke } bind def
/cir1 { newpath 0 360 arc gsave fill grestore stroke } bind def
/cir2 { newpath 0 360 arc gsave fill grestore stroke } bind def
/arc0 { newpath arc stroke } bind def
/arc1 { newpath 4 index 4 index moveto arc closepath gsave fill
    grestore stroke } bind def
/arc2 { newpath 4 index 4 index moveto arc closepath gsave fill
    grestore stroke } bind def
/poly0 { stroke } bind def
/poly1 { closepath gsave fill grestore stroke } bind def
/poly2 { closepath gsave fill grestore stroke } bind def
/rect0 { rectstroke } bind def
/rect1 { rectfill } bind def
/rect2 { rectfill } bind def
/linemode0 { 0 setlinecap 0 setlinejoin 0 setlinewidth } bind def
/linemode1 { 1 setlinecap 1 setlinejoin } bind def
/dashedline { [200] 100 setdash } bind def
/solidline { [] 0 setdash } bind def
/phantomshow { moveto
    /KicadFont findfont 0.000001 scalefont setfont
    show } bind def
/textshow { gsave
    findfont exch scalefont setfont concat 1 scale 0 0 moveto show
    } bind def
/reencodefont {
  findfont dup length dict begin
  { 1 index /FID ne
    { def }
    { pop pop } ifelse
  } forall
  /Encoding ISOLatin1Encoding def
  currentdict
  end } bind def
/KicadFont /Helvetica reencodefont definefont pop
/KicadFont-Bold /Helvetica-Bold reencodefont definefont pop
/KicadFont-Oblique /Helvetica-Oblique reencodefont definefont pop
/KicadFont-BoldOblique /Helvetica-BoldOblique reencodefont definefont pop
%%EndProlog
%%Page: 1 1
%%BeginPageSetup
gsave
0.0072 0.0072 scale
linemode1
82680 0 translate 90 rotate
182.319 setlinewidth
%%EndPageSetup
0 0 0 setrgbcolor
91.1597 setlinewidth
newpath
81254.9 35086.1 moveto
35675.1 35086.1 lineto
stroke
0 0 0 setrgbcolor
newpath
81254.9 80665.9 moveto
81254.9 35086.1 lineto
stroke
0 0 0 setrgbcolor
newpath
35675.1 35086.1 moveto
35675.1 80665.9 lineto
stroke
0 0 0 setrgbcolor
newpath
35675.1 80665.9 moveto
81254.9 80665.9 lineto
stroke
182.319 setlinewidth
27.3479 setlinewidth
newpath
38956.8 47438.2 moveto
39230.3 47164.7 lineto
stroke
newpath
39230.3 47438.2 moveto
38956.8 47164.7 lineto
stroke
newpath
40825.6 48441 moveto
41099.1 48167.5 lineto
stroke
newpath
41099.1 48441 moveto
40825.6 48167.5 lineto
stroke
newpath
41458 52172.8 moveto
41731.5 51899.4 lineto
stroke
newpath
41731.5 52172.8 moveto
41458 51899.4 lineto
stroke
newpath
42694.4 55733.7 moveto
42967.9 55460.3 lineto
stroke
newpath
42967.9 55733.7 moveto
42694.4 55460.3 lineto
stroke
newpath
42785.5 48258.7 moveto
43059 47985.2 lineto
stroke
newpath
43059 48258.7 moveto
42785.5 47985.2 lineto
stroke
newpath
43616.2 48932.1 moveto
43889.7 48658.6 lineto
stroke
newpath
43889.7 48932.1 moveto
43616.2 48658.6 lineto
stroke
newpath
44973.4 72005.7 moveto
45246.8 71732.3 lineto
stroke
newpath
45246.8 72005.7 moveto
44973.4 71732.3 lineto
stroke
newpath
45110.1 75150.8 moveto
45383.6 74877.3 lineto
stroke
newpath
45383.6 75150.8 moveto
45110.1 74877.3 lineto
stroke
newpath
45570.3 74417.7 moveto
45843.8 74144.2 lineto
stroke
newpath
45843.8 74417.7 moveto
45570.3 74144.2 lineto
stroke
newpath
46340.8 48942.4 moveto
46614.2 48668.9 lineto
stroke
newpath
46614.2 48942.4 moveto
46340.8 48668.9 lineto
stroke
newpath
46933.3 48121.9 moveto
47206.8 47848.4 lineto
stroke
newpath
47206.8 48121.9 moveto
46933.3 47848.4 lineto
stroke
newpath
47024.5 68085.9 moveto
47297.9 67812.4 lineto
stroke
newpath
47297.9 68085.9 moveto
47024.5 67812.4 lineto
stroke
newpath
47206.8 54913.3 moveto
47480.3 54639.8 lineto
stroke
newpath
47480.3 54913.3 moveto
47206.8 54639.8 lineto
stroke
newpath
48164 60315 moveto
48437.4 60041.5 lineto
stroke
newpath
48437.4 60315 moveto
48164 60041.5 lineto
stroke
newpath
48306 59442.3 moveto
48579.4 59168.9 lineto
stroke
newpath
48579.4 59442.3 moveto
48306 59168.9 lineto
stroke
newpath
49030 55460.3 moveto
49303.5 55186.8 lineto
stroke
newpath
49303.5 55460.3 moveto
49030 55186.8 lineto
stroke
newpath
49135.8 59411 moveto
49409.3 59137.5 lineto
stroke
newpath
49409.3 59411 moveto
49135.8 59137.5 lineto
stroke
newpath
49303.5 52816.6 moveto
49576.9 52543.2 lineto
stroke
newpath
49576.9 52816.6 moveto
49303.5 52543.2 lineto
stroke
newpath
50169.5 61385.6 moveto
50442.9 61112.2 lineto
stroke
newpath
50442.9 61385.6 moveto
50169.5 61112.2 lineto
stroke
newpath
50260.6 59790.4 moveto
50534.1 59516.9 lineto
stroke
newpath
50534.1 59790.4 moveto
50260.6 59516.9 lineto
stroke
newpath
50263.6 59057.5 moveto
50537.1 58784 lineto
stroke
newpath
50537.1 59057.5 moveto
50263.6 58784 lineto
stroke
newpath
50306.2 63573.5 moveto
50579.7 63300 lineto
stroke
newpath
50579.7 63573.5 moveto
50306.2 63300 lineto
stroke
newpath
50397.4 52816.6 moveto
50670.8 52543.2 lineto
stroke
newpath
50670.8 52816.6 moveto
50397.4 52543.2 lineto
stroke
newpath
50898.7 65761.3 moveto
51172.2 65487.8 lineto
stroke
newpath
51172.2 65761.3 moveto
50898.7 65487.8 lineto
stroke
newpath
50944.3 55414.7 moveto
51217.8 55141.2 lineto
stroke
newpath
51217.8 55414.7 moveto
50944.3 55141.2 lineto
stroke
newpath
51445.7 54685.4 moveto
51719.2 54411.9 lineto
stroke
newpath
51719.2 54685.4 moveto
51445.7 54411.9 lineto
stroke
newpath
52175 60861.9 moveto
52448.5 60588.5 lineto
stroke
newpath
52448.5 60861.9 moveto
52175 60588.5 lineto
stroke
newpath
52218.3 59449 moveto
52491.8 59175.5 lineto
stroke
newpath
52491.8 59449 moveto
52218.3 59175.5 lineto
stroke
newpath
52232.4 58754.7 moveto
52505.9 58481.2 lineto
stroke
newpath
52505.9 58754.7 moveto
52232.4 58481.2 lineto
stroke
newpath
52259 64712.5 moveto
52532.5 64439 lineto
stroke
newpath
52532.5 64712.5 moveto
52259 64439 lineto
stroke
newpath
53360.1 52999 moveto
53633.5 52725.5 lineto
stroke
newpath
53633.5 52999 moveto
53360.1 52725.5 lineto
stroke
newpath
53861.4 61932.1 moveto
54134.9 61658.7 lineto
stroke
newpath
54134.9 61932.1 moveto
53861.4 61658.7 lineto
stroke
newpath
54499.6 55597 moveto
54773 55323.5 lineto
stroke
newpath
54773 55597 moveto
54499.6 55323.5 lineto
stroke
newpath
54818.6 47802.9 moveto
55092.1 47529.4 lineto
stroke
newpath
55092.1 47802.9 moveto
54818.6 47529.4 lineto
stroke
newpath
54955.4 47119.2 moveto
55228.8 46845.7 lineto
stroke
newpath
55228.8 47119.2 moveto
54955.4 46845.7 lineto
stroke
newpath
55387.9 59483 moveto
55661.4 59209.5 lineto
stroke
newpath
55661.4 59483 moveto
55387.9 59209.5 lineto
stroke
newpath
55387.9 58728.5 moveto
55661.4 58455 lineto
stroke
newpath
55661.4 58728.5 moveto
55387.9 58455 lineto
stroke
newpath
55456.7 46572.2 moveto
55730.2 46298.7 lineto
stroke
newpath
55730.2 46572.2 moveto
55456.7 46298.7 lineto
stroke
newpath
55912.5 56280.7 moveto
56186 56007.2 lineto
stroke
newpath
56186 56280.7 moveto
55912.5 56007.2 lineto
stroke
newpath
56003.7 53910.6 moveto
56277.2 53637.1 lineto
stroke
newpath
56277.2 53910.6 moveto
56003.7 53637.1 lineto
stroke
newpath
56846.9 57694.1 moveto
57120.4 57420.7 lineto
stroke
newpath
57120.4 57694.1 moveto
56846.9 57420.7 lineto
stroke
newpath
56869.7 53386.8 moveto
57143.2 53113.4 lineto
stroke
newpath
57143.2 53386.8 moveto
56869.7 53113.4 lineto
stroke
newpath
57028.8 56189.5 moveto
57302.3 55916.1 lineto
stroke
newpath
57302.3 56189.5 moveto
57028.8 55916.1 lineto
stroke
newpath
57211.1 60906.9 moveto
57484.6 60633.5 lineto
stroke
newpath
57484.6 60906.9 moveto
57211.1 60633.5 lineto
stroke
newpath
57279.9 49808.4 moveto
57553.4 49534.9 lineto
stroke
newpath
57553.4 49808.4 moveto
57279.9 49534.9 lineto
stroke
newpath
57507.8 61522.4 moveto
57781.3 61248.9 lineto
stroke
newpath
57781.3 61522.4 moveto
57507.8 61248.9 lineto
stroke
newpath
57507.9 57521.1 moveto
57781.4 57247.7 lineto
stroke
newpath
57781.4 57521.1 moveto
57507.9 57247.7 lineto
stroke
newpath
58265.6 53471.9 moveto
58539.1 53198.4 lineto
stroke
newpath
58539.1 53471.9 moveto
58265.6 53198.4 lineto
stroke
newpath
58328.3 42697.9 moveto
58601.7 42424.4 lineto
stroke
newpath
58601.7 42697.9 moveto
58328.3 42424.4 lineto
stroke
newpath
58556.2 38322.3 moveto
58829.6 38048.8 lineto
stroke
newpath
58829.6 38322.3 moveto
58556.2 38048.8 lineto
stroke
newpath
58919.5 57511.4 moveto
59193 57237.9 lineto
stroke
newpath
59193 57511.4 moveto
58919.5 57237.9 lineto
stroke
newpath
59014.7 58227.5 moveto
59288.2 57954.1 lineto
stroke
newpath
59288.2 58227.5 moveto
59014.7 57954.1 lineto
stroke
newpath
59213.3 64101.5 moveto
59486.7 63828 lineto
stroke
newpath
59486.7 64101.5 moveto
59213.3 63828 lineto
stroke
newpath
59698 58227.5 moveto
59971.4 57954.1 lineto
stroke
newpath
59971.4 58227.5 moveto
59698 57954.1 lineto
stroke
newpath
59892.8 64172.3 moveto
60166.3 63898.8 lineto
stroke
newpath
60166.3 64172.3 moveto
59892.8 63898.8 lineto
stroke
newpath
60326 57958.4 moveto
60599.5 57685 lineto
stroke
newpath
60599.5 57958.4 moveto
60326 57685 lineto
stroke
newpath
60470.5 61568 moveto
60744 61294.5 lineto
stroke
newpath
60744 61568 moveto
60470.5 61294.5 lineto
stroke
newpath
60628.4 56166.3 moveto
60901.8 55892.8 lineto
stroke
newpath
60901.8 56166.3 moveto
60628.4 55892.8 lineto
stroke
newpath
60926.3 53545.9 moveto
61199.8 53272.4 lineto
stroke
newpath
61199.8 53545.9 moveto
60926.3 53272.4 lineto
stroke
newpath
61382.1 55141.2 moveto
61655.6 54867.7 lineto
stroke
newpath
61655.6 55141.2 moveto
61382.1 54867.7 lineto
stroke
newpath
61610 38413.4 moveto
61883.5 38139.9 lineto
stroke
newpath
61883.5 38413.4 moveto
61610 38139.9 lineto
stroke
newpath
61883.9 63892.5 moveto
62157.4 63619.1 lineto
stroke
newpath
62157.4 63892.5 moveto
61883.9 63619.1 lineto
stroke
newpath
62612.8 51312.5 moveto
62886.2 51039 lineto
stroke
newpath
62886.2 51312.5 moveto
62612.8 51039 lineto
stroke
newpath
62749.5 55323.5 moveto
63023 55050.1 lineto
stroke
newpath
63023 55323.5 moveto
62749.5 55050.1 lineto
stroke
newpath
63138.7 52674.8 moveto
63412.2 52401.3 lineto
stroke
newpath
63412.2 52674.8 moveto
63138.7 52401.3 lineto
stroke
newpath
63159.7 63892.5 moveto
63433.2 63619.1 lineto
stroke
newpath
63433.2 63892.5 moveto
63159.7 63619.1 lineto
stroke
newpath
63296.5 60656.4 moveto
63569.9 60382.9 lineto
stroke
newpath
63569.9 60656.4 moveto
63296.5 60382.9 lineto
stroke
newpath
63342 61385.6 moveto
63615.5 61112.2 lineto
stroke
newpath
63615.5 61385.6 moveto
63342 61112.2 lineto
stroke
newpath
63889 42925.8 moveto
64162.5 42652.3 lineto
stroke
newpath
64162.5 42925.8 moveto
63889 42652.3 lineto
stroke
newpath
75830.9 65438.2 moveto
76104.4 65164.7 lineto
stroke
newpath
76104.4 65438.2 moveto
75830.9 65164.7 lineto
stroke
36.4639 setlinewidth
40096.3 56690.9 182.319 cir0
44563.2 50400.9 182.319 cir0
45155.7 63254.4 182.319 cir0
46544.1 55621.6 182.319 cir0
49554.6 50811.1 182.319 cir0
49804.8 70182.6 182.319 cir0
50670.8 78888.3 182.319 cir0
50784.3 50036.3 182.319 cir0
51628 72643.9 182.319 cir0
51901.5 62069.3 182.319 cir0
52357.3 74307.1 182.319 cir0
52425.7 42128.2 182.319 cir0
53588 73327.6 182.319 cir0
54431.2 72643.9 182.319 cir0
54590.7 65351.1 182.319 cir0
56459.5 72552.7 182.319 cir0
57644.6 43472.8 182.319 cir0
57644.6 36088.8 182.319 cir0
60561.7 72370.4 182.319 cir0
62293.7 72461.5 182.319 cir0
62977.4 73282 182.319 cir0
65028.5 73327.6 182.319 cir0
65666.6 72461.5 182.319 cir0
65873.5 50060.8 182.319 cir0
66578.2 67219.4 182.319 cir0
66578.2 47392.6 182.319 cir0
66669.4 70182.6 182.319 cir0
67489.8 49671.6 182.319 cir0
67581 48395.4 182.319 cir0
67672.1 72370.4 182.319 cir0
68857.2 60565.2 182.319 cir0
69677.6 62889.8 182.319 cir0
70133.4 74968.4 182.319 cir0
70953.4 74285.2 182.319 cir0
71500.8 70000.2 182.319 cir0
79340.6 42789.1 182.319 cir0
79431.7 41467.3 182.319 cir0
91.1597 setlinewidth
newpath
38409.9 67333.8 moveto
38409.9 66422.2 lineto
stroke
newpath
37954.1 66878 moveto
38865.7 66878 lineto
stroke
newpath
38409.9 65018.4 moveto
38409.9 64106.8 lineto
stroke
newpath
37954.1 64562.6 moveto
38865.7 64562.6 lineto
stroke
newpath
38409.9 62702.9 moveto
38409.9 61791.3 lineto
stroke
newpath
37954.1 62247.1 moveto
38865.7 62247.1 lineto
stroke
newpath
38409.9 60387.4 moveto
38409.9 59475.9 lineto
stroke
newpath
37954.1 59931.7 moveto
38865.7 59931.7 lineto
stroke
newpath
38409.9 58072 moveto
38409.9 57160.4 lineto
stroke
newpath
37954.1 57616.2 moveto
38865.7 57616.2 lineto
stroke
newpath
38409.9 55756.5 moveto
38409.9 54844.9 lineto
stroke
newpath
37954.1 55300.7 moveto
38865.7 55300.7 lineto
stroke
newpath
38409.9 53441.1 moveto
38409.9 52529.5 lineto
stroke
newpath
37954.1 52985.3 moveto
38865.7 52985.3 lineto
stroke
newpath
38409.9 51125.6 moveto
38409.9 50214 lineto
stroke
newpath
37954.1 50669.8 moveto
38865.7 50669.8 lineto
stroke
newpath
38409.9 45569.4 moveto
38409.9 44657.8 lineto
stroke
newpath
37954.1 45113.6 moveto
38865.7 45113.6 lineto
stroke
newpath
40725.3 45569.4 moveto
40725.3 44657.8 lineto
stroke
newpath
40269.5 45113.6 moveto
41181.1 45113.6 lineto
stroke
newpath
41782.8 64954.5 moveto
41782.8 64043 lineto
stroke
newpath
41327 64498.7 moveto
42238.6 64498.7 lineto
stroke
newpath
41782.8 62639.1 moveto
41782.8 61727.5 lineto
stroke
newpath
41327 62183.3 moveto
42238.6 62183.3 lineto
stroke
newpath
43040.8 45569.4 moveto
43040.8 44657.8 lineto
stroke
newpath
42585 45113.6 moveto
43496.6 45113.6 lineto
stroke
newpath
45356.2 45569.4 moveto
45356.2 44657.8 lineto
stroke
newpath
44900.4 45113.6 moveto
45812 45113.6 lineto
stroke
newpath
47671.7 45569.4 moveto
47671.7 44657.8 lineto
stroke
newpath
47215.9 45113.6 moveto
48127.5 45113.6 lineto
stroke
newpath
49987.2 45569.4 moveto
49987.2 44657.8 lineto
stroke
newpath
49531.4 45113.6 moveto
50442.9 45113.6 lineto
stroke
newpath
78520.1 70911.8 moveto
78520.1 70000.2 lineto
stroke
newpath
78064.3 70456 moveto
78975.9 70456 lineto
stroke
newpath
78520.1 68596.4 moveto
78520.1 67684.8 lineto
stroke
newpath
78064.3 68140.6 moveto
78975.9 68140.6 lineto
stroke
newpath
78520.1 66280.9 moveto
78520.1 65369.3 lineto
stroke
newpath
78064.3 65825.1 moveto
78975.9 65825.1 lineto
stroke
newpath
78520.1 63965.5 moveto
78520.1 63053.9 lineto
stroke
newpath
78064.3 63509.7 moveto
78975.9 63509.7 lineto
stroke
newpath
78520.1 59243.4 moveto
78520.1 58331.8 lineto
stroke
newpath
78064.3 58787.6 moveto
78975.9 58787.6 lineto
stroke
newpath
78520.1 56927.9 moveto
78520.1 56016.3 lineto
stroke
newpath
78064.3 56472.1 moveto
78975.9 56472.1 lineto
stroke
newpath
78520.1 54612.5 moveto
78520.1 53700.9 lineto
stroke
newpath
78064.3 54156.7 moveto
78975.9 54156.7 lineto
stroke
newpath
78520.1 52297 moveto
78520.1 51385.4 lineto
stroke
newpath
78064.3 51841.2 moveto
78975.9 51841.2 lineto
stroke
newpath
78520.1 49981.6 moveto
78520.1 49070 lineto
stroke
newpath
78064.3 49525.8 moveto
78975.9 49525.8 lineto
stroke
newpath
78520.1 47666.1 moveto
78520.1 46754.5 lineto
stroke
newpath
78064.3 47210.3 moveto
78975.9 47210.3 lineto
stroke
newpath
78520.1 45350.7 moveto
78520.1 44439.1 lineto
stroke
newpath
78064.3 44894.9 moveto
78975.9 44894.9 lineto
stroke
138.563 setlinewidth
newpath
39702 76529.6 moveto
39702 77509.4 lineto
38722.2 77509.4 lineto
38722.2 76529.6 lineto
39702 76529.6 lineto
poly0
newpath
39811.4 38242.6 moveto
39811.4 39222.4 lineto
38831.6 39222.4 lineto
38831.6 38242.6 lineto
39811.4 38242.6 lineto
poly0
newpath
44332.9 76529.6 moveto
44332.9 77509.4 lineto
43353.1 77509.4 lineto
43353.1 76529.6 lineto
44332.9 76529.6 lineto
poly0
newpath
44442.3 38242.6 moveto
44442.3 39222.4 lineto
43462.5 39222.4 lineto
43462.5 38242.6 lineto
44442.3 38242.6 lineto
poly0
newpath
48963.8 76529.6 moveto
48963.8 77509.4 lineto
47984 77509.4 lineto
47984 76529.6 lineto
48963.8 76529.6 lineto
poly0
newpath
49073.2 38242.6 moveto
49073.2 39222.4 lineto
48093.4 39222.4 lineto
48093.4 38242.6 lineto
49073.2 38242.6 lineto
poly0
newpath
53594.7 76529.6 moveto
53594.7 77509.4 lineto
52614.9 77509.4 lineto
52614.9 76529.6 lineto
53594.7 76529.6 lineto
poly0
newpath
53704.1 38242.6 moveto
53704.1 39222.4 lineto
52724.3 39222.4 lineto
52724.3 38242.6 lineto
53704.1 38242.6 lineto
poly0
newpath
64315.1 76529.6 moveto
64315.1 77509.4 lineto
63335.3 77509.4 lineto
63335.3 76529.6 lineto
64315.1 76529.6 lineto
poly0
newpath
64424.5 38242.6 moveto
64424.5 39222.4 lineto
63444.7 39222.4 lineto
63444.7 38242.6 lineto
64424.5 38242.6 lineto
poly0
newpath
68946 76529.6 moveto
68946 77509.4 lineto
67966.2 77509.4 lineto
67966.2 76529.6 lineto
68946 76529.6 lineto
poly0
newpath
69055.4 38242.6 moveto
69055.4 39222.4 lineto
68075.6 39222.4 lineto
68075.6 38242.6 lineto
69055.4 38242.6 lineto
poly0
newpath
73576.9 76529.6 moveto
73576.9 77509.4 lineto
72597.1 77509.4 lineto
72597.1 76529.6 lineto
73576.9 76529.6 lineto
poly0
newpath
73686.3 38242.6 moveto
73686.3 39222.4 lineto
72706.5 39222.4 lineto
72706.5 38242.6 lineto
73686.3 38242.6 lineto
poly0
newpath
78207.8 76529.6 moveto
78207.8 77509.4 lineto
77228 77509.4 lineto
77228 76529.6 lineto
78207.8 76529.6 lineto
poly0
newpath
78317.2 38242.6 moveto
78317.2 39222.4 lineto
77337.4 39222.4 lineto
77337.4 38242.6 lineto
78317.2 38242.6 lineto
poly0
182.319 setlinewidth
78.7401 setlinewidth
0 0 0 setrgbcolor
0 0 0 setrgbcolor
newpath
36643.8 33818.2 moveto
36643.8 34605.6 lineto
36831.2 34605.6 lineto
36943.7 34568.1 lineto
37018.7 34493.1 lineto
37056.2 34418.1 lineto
37093.7 34268.1 lineto
37093.7 34155.6 lineto
37056.2 34005.6 lineto
37018.7 33930.6 lineto
36943.7 33855.7 lineto
36831.2 33818.2 lineto
36643.8 33818.2 lineto
stroke
newpath
37431.2 33818.2 moveto
37431.2 34343.1 lineto
stroke
newpath
37431.2 34193.1 moveto
37468.6 34268.1 lineto
37506.1 34305.6 lineto
37581.1 34343.1 lineto
37656.1 34343.1 lineto
stroke
newpath
37918.6 33818.2 moveto
37918.6 34343.1 lineto
stroke
newpath
37918.6 34605.6 moveto
37881.1 34568.1 lineto
37918.6 34530.6 lineto
37956.1 34568.1 lineto
37918.6 34605.6 lineto
37918.6 34530.6 lineto
stroke
newpath
38406 33818.2 moveto
38331 33855.7 lineto
38293.5 33930.6 lineto
38293.5 34605.6 lineto
stroke
newpath
38818.5 33818.2 moveto
38743.5 33855.7 lineto
38706 33930.6 lineto
38706 34605.6 lineto
stroke
newpath
39718.4 33818.2 moveto
39718.4 34605.6 lineto
39980.8 34043.1 lineto
40243.3 34605.6 lineto
40243.3 33818.2 lineto
stroke
newpath
40955.7 33818.2 moveto
40955.7 34230.6 lineto
40918.2 34305.6 lineto
40843.2 34343.1 lineto
40693.2 34343.1 lineto
40618.3 34305.6 lineto
stroke
newpath
40955.7 33855.7 moveto
40880.7 33818.2 lineto
40693.2 33818.2 lineto
40618.3 33855.7 lineto
40580.8 33930.6 lineto
40580.8 34005.6 lineto
40618.3 34080.6 lineto
40693.2 34118.1 lineto
40880.7 34118.1 lineto
40955.7 34155.6 lineto
stroke
newpath
41330.7 34343.1 moveto
41330.7 33555.7 lineto
stroke
newpath
41330.7 34305.6 moveto
41405.7 34343.1 lineto
41555.6 34343.1 lineto
41630.6 34305.6 lineto
41668.1 34268.1 lineto
41705.6 34193.1 lineto
41705.6 33968.1 lineto
41668.1 33893.1 lineto
41630.6 33855.7 lineto
41555.6 33818.2 lineto
41405.7 33818.2 lineto
41330.7 33855.7 lineto
stroke
newpath
42043.1 33893.1 moveto
42080.6 33855.7 lineto
42043.1 33818.2 lineto
42005.6 33855.7 lineto
42043.1 33893.1 lineto
42043.1 33818.2 lineto
stroke
newpath
42043.1 34305.6 moveto
42080.6 34268.1 lineto
42043.1 34230.6 lineto
42005.6 34268.1 lineto
42043.1 34305.6 lineto
42043.1 34230.6 lineto
stroke
27.3479 setlinewidth
newpath
35356 32657.6 moveto
35629.5 32384.1 lineto
stroke
newpath
35629.5 32657.6 moveto
35356 32384.1 lineto
stroke
182.319 setlinewidth
78.7401 setlinewidth
0 0 0 setrgbcolor
0 0 0 setrgbcolor
newpath
36793.7 32952 moveto
36868.7 32952 lineto
36943.7 32914.5 lineto
36981.2 32877 lineto
37018.7 32802 lineto
37056.2 32652.1 lineto
37056.2 32464.6 lineto
37018.7 32314.6 lineto
36981.2 32239.6 lineto
36943.7 32202.1 lineto
36868.7 32164.6 lineto
36793.7 32164.6 lineto
36718.7 32202.1 lineto
36681.2 32239.6 lineto
36643.8 32314.6 lineto
36606.3 32464.6 lineto
36606.3 32652.1 lineto
36643.8 32802 lineto
36681.2 32877 lineto
36718.7 32914.5 lineto
36793.7 32952 lineto
stroke
newpath
37393.7 32239.6 moveto
37431.2 32202.1 lineto
37393.7 32164.6 lineto
37356.2 32202.1 lineto
37393.7 32239.6 lineto
37393.7 32164.6 lineto
stroke
newpath
37693.6 32952 moveto
38181.1 32952 lineto
37918.6 32652.1 lineto
38031.1 32652.1 lineto
38106.1 32614.6 lineto
38143.6 32577.1 lineto
38181.1 32502.1 lineto
38181.1 32314.6 lineto
38143.6 32239.6 lineto
38106.1 32202.1 lineto
38031.1 32164.6 lineto
37806.1 32164.6 lineto
37731.1 32202.1 lineto
37693.6 32239.6 lineto
stroke
newpath
38668.5 32952 moveto
38743.5 32952 lineto
38818.5 32914.5 lineto
38856 32877 lineto
38893.5 32802 lineto
38931 32652.1 lineto
38931 32464.6 lineto
38893.5 32314.6 lineto
38856 32239.6 lineto
38818.5 32202.1 lineto
38743.5 32164.6 lineto
38668.5 32164.6 lineto
38593.5 32202.1 lineto
38556 32239.6 lineto
38518.5 32314.6 lineto
38481 32464.6 lineto
38481 32652.1 lineto
38518.5 32802 lineto
38556 32877 lineto
38593.5 32914.5 lineto
38668.5 32952 lineto
stroke
newpath
39418.4 32952 moveto
39493.4 32952 lineto
39568.4 32914.5 lineto
39605.9 32877 lineto
39643.4 32802 lineto
39680.9 32652.1 lineto
39680.9 32464.6 lineto
39643.4 32314.6 lineto
39605.9 32239.6 lineto
39568.4 32202.1 lineto
39493.4 32164.6 lineto
39418.4 32164.6 lineto
39343.4 32202.1 lineto
39305.9 32239.6 lineto
39268.4 32314.6 lineto
39230.9 32464.6 lineto
39230.9 32652.1 lineto
39268.4 32802 lineto
39305.9 32877 lineto
39343.4 32914.5 lineto
39418.4 32952 lineto
stroke
newpath
40018.3 32164.6 moveto
40018.3 32689.5 lineto
stroke
newpath
40018.3 32614.6 moveto
40055.8 32652.1 lineto
40130.8 32689.5 lineto
40243.3 32689.5 lineto
40318.3 32652.1 lineto
40355.8 32577.1 lineto
40355.8 32164.6 lineto
stroke
newpath
40355.8 32577.1 moveto
40393.3 32652.1 lineto
40468.3 32689.5 lineto
40580.8 32689.5 lineto
40655.8 32652.1 lineto
40693.2 32577.1 lineto
40693.2 32164.6 lineto
stroke
newpath
41068.2 32164.6 moveto
41068.2 32689.5 lineto
stroke
newpath
41068.2 32614.6 moveto
41105.7 32652.1 lineto
41180.7 32689.5 lineto
41293.2 32689.5 lineto
41368.2 32652.1 lineto
41405.7 32577.1 lineto
41405.7 32164.6 lineto
stroke
newpath
41405.7 32577.1 moveto
41443.2 32652.1 lineto
41518.1 32689.5 lineto
41630.6 32689.5 lineto
41705.6 32652.1 lineto
41743.1 32577.1 lineto
41743.1 32164.6 lineto
stroke
newpath
43280.4 32989.5 moveto
42605.5 31977.1 lineto
stroke
newpath
44292.8 32952 moveto
44367.8 32952 lineto
44442.8 32914.5 lineto
44480.3 32877 lineto
44517.8 32802 lineto
44555.3 32652.1 lineto
44555.3 32464.6 lineto
44517.8 32314.6 lineto
44480.3 32239.6 lineto
44442.8 32202.1 lineto
44367.8 32164.6 lineto
44292.8 32164.6 lineto
44217.8 32202.1 lineto
44180.3 32239.6 lineto
44142.8 32314.6 lineto
44105.3 32464.6 lineto
44105.3 32652.1 lineto
44142.8 32802 lineto
44180.3 32877 lineto
44217.8 32914.5 lineto
44292.8 32952 lineto
stroke
newpath
44892.7 32239.6 moveto
44930.2 32202.1 lineto
44892.7 32164.6 lineto
44855.2 32202.1 lineto
44892.7 32239.6 lineto
44892.7 32164.6 lineto
stroke
newpath
45417.7 32952 moveto
45492.6 32952 lineto
45567.6 32914.5 lineto
45605.1 32877 lineto
45642.6 32802 lineto
45680.1 32652.1 lineto
45680.1 32464.6 lineto
45642.6 32314.6 lineto
45605.1 32239.6 lineto
45567.6 32202.1 lineto
45492.6 32164.6 lineto
45417.7 32164.6 lineto
45342.7 32202.1 lineto
45305.2 32239.6 lineto
45267.7 32314.6 lineto
45230.2 32464.6 lineto
45230.2 32652.1 lineto
45267.7 32802 lineto
45305.2 32877 lineto
45342.7 32914.5 lineto
45417.7 32952 lineto
stroke
newpath
46430 32164.6 moveto
45980.1 32164.6 lineto
stroke
newpath
46205.1 32164.6 moveto
46205.1 32952 lineto
46130.1 32839.5 lineto
46055.1 32764.5 lineto
45980.1 32727 lineto
stroke
newpath
47179.9 32164.6 moveto
46730 32164.6 lineto
stroke
newpath
46955 32164.6 moveto
46955 32952 lineto
46880 32839.5 lineto
46805 32764.5 lineto
46730 32727 lineto
stroke
newpath
47629.9 32614.6 moveto
47554.9 32652.1 lineto
47517.4 32689.5 lineto
47479.9 32764.5 lineto
47479.9 32802 lineto
47517.4 32877 lineto
47554.9 32914.5 lineto
47629.9 32952 lineto
47779.9 32952 lineto
47854.9 32914.5 lineto
47892.3 32877 lineto
47929.8 32802 lineto
47929.8 32764.5 lineto
47892.3 32689.5 lineto
47854.9 32652.1 lineto
47779.9 32614.6 lineto
47629.9 32614.6 lineto
47554.9 32577.1 lineto
47517.4 32539.6 lineto
47479.9 32464.6 lineto
47479.9 32314.6 lineto
47517.4 32239.6 lineto
47554.9 32202.1 lineto
47629.9 32164.6 lineto
47779.9 32164.6 lineto
47854.9 32202.1 lineto
47892.3 32239.6 lineto
47929.8 32314.6 lineto
47929.8 32464.6 lineto
47892.3 32539.6 lineto
47854.9 32577.1 lineto
47779.9 32614.6 lineto
stroke
newpath
48229.8 32952 moveto
48229.8 32802 lineto
stroke
newpath
48529.8 32952 moveto
48529.8 32802 lineto
stroke
newpath
49692.1 31864.7 moveto
49654.6 31902.1 lineto
49579.6 32014.6 lineto
49542.1 32089.6 lineto
49504.6 32202.1 lineto
49467.2 32389.6 lineto
49467.2 32539.6 lineto
49504.6 32727 lineto
49542.1 32839.5 lineto
49579.6 32914.5 lineto
49654.6 33027 lineto
49692.1 33064.5 lineto
stroke
newpath
49917.1 32952 moveto
50442 32952 lineto
50104.6 32164.6 lineto
stroke
newpath
50892 32952 moveto
50967 32952 lineto
51042 32914.5 lineto
51079.4 32877 lineto
51116.9 32802 lineto
51154.4 32652.1 lineto
51154.4 32464.6 lineto
51116.9 32314.6 lineto
51079.4 32239.6 lineto
51042 32202.1 lineto
50967 32164.6 lineto
50892 32164.6 lineto
50817 32202.1 lineto
50779.5 32239.6 lineto
50742 32314.6 lineto
50704.5 32464.6 lineto
50704.5 32652.1 lineto
50742 32802 lineto
50779.5 32877 lineto
50817 32914.5 lineto
50892 32952 lineto
stroke
newpath
52091.8 32164.6 moveto
52091.8 32952 lineto
stroke
newpath
52429.3 32164.6 moveto
52429.3 32577.1 lineto
52391.8 32652.1 lineto
52316.8 32689.5 lineto
52204.3 32689.5 lineto
52129.3 32652.1 lineto
52091.8 32614.6 lineto
stroke
newpath
52916.7 32164.6 moveto
52841.7 32202.1 lineto
52804.2 32239.6 lineto
52766.7 32314.6 lineto
52766.7 32539.6 lineto
52804.2 32614.6 lineto
52841.7 32652.1 lineto
52916.7 32689.5 lineto
53029.2 32689.5 lineto
53104.2 32652.1 lineto
53141.7 32614.6 lineto
53179.2 32539.6 lineto
53179.2 32314.6 lineto
53141.7 32239.6 lineto
53104.2 32202.1 lineto
53029.2 32164.6 lineto
52916.7 32164.6 lineto
stroke
newpath
53629.1 32164.6 moveto
53554.1 32202.1 lineto
53516.6 32277.1 lineto
53516.6 32952 lineto
stroke
newpath
54229.1 32202.1 moveto
54154.1 32164.6 lineto
54004.1 32164.6 lineto
53929.1 32202.1 lineto
53891.6 32277.1 lineto
53891.6 32577.1 lineto
53929.1 32652.1 lineto
54004.1 32689.5 lineto
54154.1 32689.5 lineto
54229.1 32652.1 lineto
54266.6 32577.1 lineto
54266.6 32502.1 lineto
53891.6 32427.1 lineto
stroke
newpath
54566.5 32202.1 moveto
54641.5 32164.6 lineto
54791.5 32164.6 lineto
54866.5 32202.1 lineto
54904 32277.1 lineto
54904 32314.6 lineto
54866.5 32389.6 lineto
54791.5 32427.1 lineto
54679 32427.1 lineto
54604 32464.6 lineto
54566.5 32539.6 lineto
54566.5 32577.1 lineto
54604 32652.1 lineto
54679 32689.5 lineto
54791.5 32689.5 lineto
54866.5 32652.1 lineto
stroke
newpath
55166.4 31864.7 moveto
55203.9 31902.1 lineto
55278.9 32014.6 lineto
55316.4 32089.6 lineto
55353.9 32202.1 lineto
55391.4 32389.6 lineto
55391.4 32539.6 lineto
55353.9 32727 lineto
55316.4 32839.5 lineto
55278.9 32914.5 lineto
55203.9 33027 lineto
55166.4 33064.5 lineto
stroke
36.4639 setlinewidth
35447.2 31481.4 182.319 cir0
182.319 setlinewidth
78.7401 setlinewidth
0 0 0 setrgbcolor
0 0 0 setrgbcolor
newpath
36793.7 31912.6 moveto
36868.7 31912.6 lineto
36943.7 31875.2 lineto
36981.2 31837.7 lineto
37018.7 31762.7 lineto
37056.2 31612.7 lineto
37056.2 31425.2 lineto
37018.7 31275.2 lineto
36981.2 31200.2 lineto
36943.7 31162.7 lineto
36868.7 31125.2 lineto
36793.7 31125.2 lineto
36718.7 31162.7 lineto
36681.2 31200.2 lineto
36643.8 31275.2 lineto
36606.3 31425.2 lineto
36606.3 31612.7 lineto
36643.8 31762.7 lineto
36681.2 31837.7 lineto
36718.7 31875.2 lineto
36793.7 31912.6 lineto
stroke
newpath
37393.7 31200.2 moveto
37431.2 31162.7 lineto
37393.7 31125.2 lineto
37356.2 31162.7 lineto
37393.7 31200.2 lineto
37393.7 31125.2 lineto
stroke
newpath
38106.1 31650.2 moveto
38106.1 31125.2 lineto
stroke
newpath
37918.6 31950.1 moveto
37731.1 31387.7 lineto
38218.6 31387.7 lineto
stroke
newpath
38668.5 31912.6 moveto
38743.5 31912.6 lineto
38818.5 31875.2 lineto
38856 31837.7 lineto
38893.5 31762.7 lineto
38931 31612.7 lineto
38931 31425.2 lineto
38893.5 31275.2 lineto
38856 31200.2 lineto
38818.5 31162.7 lineto
38743.5 31125.2 lineto
38668.5 31125.2 lineto
38593.5 31162.7 lineto
38556 31200.2 lineto
38518.5 31275.2 lineto
38481 31425.2 lineto
38481 31612.7 lineto
38518.5 31762.7 lineto
38556 31837.7 lineto
38593.5 31875.2 lineto
38668.5 31912.6 lineto
stroke
newpath
39418.4 31912.6 moveto
39493.4 31912.6 lineto
39568.4 31875.2 lineto
39605.9 31837.7 lineto
39643.4 31762.7 lineto
39680.9 31612.7 lineto
39680.9 31425.2 lineto
39643.4 31275.2 lineto
39605.9 31200.2 lineto
39568.4 31162.7 lineto
39493.4 31125.2 lineto
39418.4 31125.2 lineto
39343.4 31162.7 lineto
39305.9 31200.2 lineto
39268.4 31275.2 lineto
39230.9 31425.2 lineto
39230.9 31612.7 lineto
39268.4 31762.7 lineto
39305.9 31837.7 lineto
39343.4 31875.2 lineto
39418.4 31912.6 lineto
stroke
newpath
40018.3 31125.2 moveto
40018.3 31650.2 lineto
stroke
newpath
40018.3 31575.2 moveto
40055.8 31612.7 lineto
40130.8 31650.2 lineto
40243.3 31650.2 lineto
40318.3 31612.7 lineto
40355.8 31537.7 lineto
40355.8 31125.2 lineto
stroke
newpath
40355.8 31537.7 moveto
40393.3 31612.7 lineto
40468.3 31650.2 lineto
40580.8 31650.2 lineto
40655.8 31612.7 lineto
40693.2 31537.7 lineto
40693.2 31125.2 lineto
stroke
newpath
41068.2 31125.2 moveto
41068.2 31650.2 lineto
stroke
newpath
41068.2 31575.2 moveto
41105.7 31612.7 lineto
41180.7 31650.2 lineto
41293.2 31650.2 lineto
41368.2 31612.7 lineto
41405.7 31537.7 lineto
41405.7 31125.2 lineto
stroke
newpath
41405.7 31537.7 moveto
41443.2 31612.7 lineto
41518.1 31650.2 lineto
41630.6 31650.2 lineto
41705.6 31612.7 lineto
41743.1 31537.7 lineto
41743.1 31125.2 lineto
stroke
newpath
43280.4 31950.1 moveto
42605.5 30937.8 lineto
stroke
newpath
44292.8 31912.6 moveto
44367.8 31912.6 lineto
44442.8 31875.2 lineto
44480.3 31837.7 lineto
44517.8 31762.7 lineto
44555.3 31612.7 lineto
44555.3 31425.2 lineto
44517.8 31275.2 lineto
44480.3 31200.2 lineto
44442.8 31162.7 lineto
44367.8 31125.2 lineto
44292.8 31125.2 lineto
44217.8 31162.7 lineto
44180.3 31200.2 lineto
44142.8 31275.2 lineto
44105.3 31425.2 lineto
44105.3 31612.7 lineto
44142.8 31762.7 lineto
44180.3 31837.7 lineto
44217.8 31875.2 lineto
44292.8 31912.6 lineto
stroke
newpath
44892.7 31200.2 moveto
44930.2 31162.7 lineto
44892.7 31125.2 lineto
44855.2 31162.7 lineto
44892.7 31200.2 lineto
44892.7 31125.2 lineto
stroke
newpath
45417.7 31912.6 moveto
45492.6 31912.6 lineto
45567.6 31875.2 lineto
45605.1 31837.7 lineto
45642.6 31762.7 lineto
45680.1 31612.7 lineto
45680.1 31425.2 lineto
45642.6 31275.2 lineto
45605.1 31200.2 lineto
45567.6 31162.7 lineto
45492.6 31125.2 lineto
45417.7 31125.2 lineto
45342.7 31162.7 lineto
45305.2 31200.2 lineto
45267.7 31275.2 lineto
45230.2 31425.2 lineto
45230.2 31612.7 lineto
45267.7 31762.7 lineto
45305.2 31837.7 lineto
45342.7 31875.2 lineto
45417.7 31912.6 lineto
stroke
newpath
46430 31125.2 moveto
45980.1 31125.2 lineto
stroke
newpath
46205.1 31125.2 moveto
46205.1 31912.6 lineto
46130.1 31800.2 lineto
46055.1 31725.2 lineto
45980.1 31687.7 lineto
stroke
newpath
47142.4 31912.6 moveto
46767.5 31912.6 lineto
46730 31537.7 lineto
46767.5 31575.2 lineto
46842.5 31612.7 lineto
47030 31612.7 lineto
47104.9 31575.2 lineto
47142.4 31537.7 lineto
47179.9 31462.7 lineto
47179.9 31275.2 lineto
47142.4 31200.2 lineto
47104.9 31162.7 lineto
47030 31125.2 lineto
46842.5 31125.2 lineto
46767.5 31162.7 lineto
46730 31200.2 lineto
stroke
newpath
47442.4 31912.6 moveto
47967.3 31912.6 lineto
47629.9 31125.2 lineto
stroke
newpath
48229.8 31912.6 moveto
48229.8 31762.7 lineto
stroke
newpath
48529.8 31912.6 moveto
48529.8 31762.7 lineto
stroke
newpath
49692.1 30825.3 moveto
49654.6 30862.8 lineto
49579.6 30975.3 lineto
49542.1 31050.3 lineto
49504.6 31162.7 lineto
49467.2 31350.2 lineto
49467.2 31500.2 lineto
49504.6 31687.7 lineto
49542.1 31800.2 lineto
49579.6 31875.2 lineto
49654.6 31987.6 lineto
49692.1 32025.1 lineto
stroke
newpath
49917.1 31912.6 moveto
50404.5 31912.6 lineto
50142.1 31612.7 lineto
50254.6 31612.7 lineto
50329.5 31575.2 lineto
50367 31537.7 lineto
50404.5 31462.7 lineto
50404.5 31275.2 lineto
50367 31200.2 lineto
50329.5 31162.7 lineto
50254.6 31125.2 lineto
50029.6 31125.2 lineto
49954.6 31162.7 lineto
49917.1 31200.2 lineto
stroke
newpath
50667 31912.6 moveto
51191.9 31912.6 lineto
50854.5 31125.2 lineto
stroke
newpath
52091.8 31125.2 moveto
52091.8 31912.6 lineto
stroke
newpath
52429.3 31125.2 moveto
52429.3 31537.7 lineto
52391.8 31612.7 lineto
52316.8 31650.2 lineto
52204.3 31650.2 lineto
52129.3 31612.7 lineto
52091.8 31575.2 lineto
stroke
newpath
52916.7 31125.2 moveto
52841.7 31162.7 lineto
52804.2 31200.2 lineto
52766.7 31275.2 lineto
52766.7 31500.2 lineto
52804.2 31575.2 lineto
52841.7 31612.7 lineto
52916.7 31650.2 lineto
53029.2 31650.2 lineto
53104.2 31612.7 lineto
53141.7 31575.2 lineto
53179.2 31500.2 lineto
53179.2 31275.2 lineto
53141.7 31200.2 lineto
53104.2 31162.7 lineto
53029.2 31125.2 lineto
52916.7 31125.2 lineto
stroke
newpath
53629.1 31125.2 moveto
53554.1 31162.7 lineto
53516.6 31237.7 lineto
53516.6 31912.6 lineto
stroke
newpath
54229.1 31162.7 moveto
54154.1 31125.2 lineto
54004.1 31125.2 lineto
53929.1 31162.7 lineto
53891.6 31237.7 lineto
53891.6 31537.7 lineto
53929.1 31612.7 lineto
54004.1 31650.2 lineto
54154.1 31650.2 lineto
54229.1 31612.7 lineto
54266.6 31537.7 lineto
54266.6 31462.7 lineto
53891.6 31387.7 lineto
stroke
newpath
54566.5 31162.7 moveto
54641.5 31125.2 lineto
54791.5 31125.2 lineto
54866.5 31162.7 lineto
54904 31237.7 lineto
54904 31275.2 lineto
54866.5 31350.2 lineto
54791.5 31387.7 lineto
54679 31387.7 lineto
54604 31425.2 lineto
54566.5 31500.2 lineto
54566.5 31537.7 lineto
54604 31612.7 lineto
54679 31650.2 lineto
54791.5 31650.2 lineto
54866.5 31612.7 lineto
stroke
newpath
55166.4 30825.3 moveto
55203.9 30862.8 lineto
55278.9 30975.3 lineto
55316.4 31050.3 lineto
55353.9 31162.7 lineto
55391.4 31350.2 lineto
55391.4 31500.2 lineto
55353.9 31687.7 lineto
55316.4 31800.2 lineto
55278.9 31875.2 lineto
55203.9 31987.6 lineto
55166.4 32025.1 lineto
stroke
newpath
35235.8 30835.8 moveto
35235.8 30048.4 lineto
stroke
newpath
34842.1 30442.1 moveto
35629.5 30442.1 lineto
stroke
182.319 setlinewidth
78.7401 setlinewidth
0 0 0 setrgbcolor
0 0 0 setrgbcolor
newpath
37056.2 30085.9 moveto
36606.3 30085.9 lineto
stroke
newpath
36831.2 30085.9 moveto
36831.2 30873.3 lineto
36756.2 30760.8 lineto
36681.2 30685.8 lineto
36606.3 30648.3 lineto
stroke
newpath
37393.7 30160.9 moveto
37431.2 30123.4 lineto
37393.7 30085.9 lineto
37356.2 30123.4 lineto
37393.7 30160.9 lineto
37393.7 30085.9 lineto
stroke
newpath
37918.6 30873.3 moveto
37993.6 30873.3 lineto
38068.6 30835.8 lineto
38106.1 30798.3 lineto
38143.6 30723.3 lineto
38181.1 30573.3 lineto
38181.1 30385.8 lineto
38143.6 30235.9 lineto
38106.1 30160.9 lineto
38068.6 30123.4 lineto
37993.6 30085.9 lineto
37918.6 30085.9 lineto
37843.6 30123.4 lineto
37806.1 30160.9 lineto
37768.6 30235.9 lineto
37731.1 30385.8 lineto
37731.1 30573.3 lineto
37768.6 30723.3 lineto
37806.1 30798.3 lineto
37843.6 30835.8 lineto
37918.6 30873.3 lineto
stroke
newpath
38668.5 30873.3 moveto
38743.5 30873.3 lineto
38818.5 30835.8 lineto
38856 30798.3 lineto
38893.5 30723.3 lineto
38931 30573.3 lineto
38931 30385.8 lineto
38893.5 30235.9 lineto
38856 30160.9 lineto
38818.5 30123.4 lineto
38743.5 30085.9 lineto
38668.5 30085.9 lineto
38593.5 30123.4 lineto
38556 30160.9 lineto
38518.5 30235.9 lineto
38481 30385.8 lineto
38481 30573.3 lineto
38518.5 30723.3 lineto
38556 30798.3 lineto
38593.5 30835.8 lineto
38668.5 30873.3 lineto
stroke
newpath
39418.4 30873.3 moveto
39493.4 30873.3 lineto
39568.4 30835.8 lineto
39605.9 30798.3 lineto
39643.4 30723.3 lineto
39680.9 30573.3 lineto
39680.9 30385.8 lineto
39643.4 30235.9 lineto
39605.9 30160.9 lineto
39568.4 30123.4 lineto
39493.4 30085.9 lineto
39418.4 30085.9 lineto
39343.4 30123.4 lineto
39305.9 30160.9 lineto
39268.4 30235.9 lineto
39230.9 30385.8 lineto
39230.9 30573.3 lineto
39268.4 30723.3 lineto
39305.9 30798.3 lineto
39343.4 30835.8 lineto
39418.4 30873.3 lineto
stroke
newpath
40018.3 30085.9 moveto
40018.3 30610.8 lineto
stroke
newpath
40018.3 30535.8 moveto
40055.8 30573.3 lineto
40130.8 30610.8 lineto
40243.3 30610.8 lineto
40318.3 30573.3 lineto
40355.8 30498.3 lineto
40355.8 30085.9 lineto
stroke
newpath
40355.8 30498.3 moveto
40393.3 30573.3 lineto
40468.3 30610.8 lineto
40580.8 30610.8 lineto
40655.8 30573.3 lineto
40693.2 30498.3 lineto
40693.2 30085.9 lineto
stroke
newpath
41068.2 30085.9 moveto
41068.2 30610.8 lineto
stroke
newpath
41068.2 30535.8 moveto
41105.7 30573.3 lineto
41180.7 30610.8 lineto
41293.2 30610.8 lineto
41368.2 30573.3 lineto
41405.7 30498.3 lineto
41405.7 30085.9 lineto
stroke
newpath
41405.7 30498.3 moveto
41443.2 30573.3 lineto
41518.1 30610.8 lineto
41630.6 30610.8 lineto
41705.6 30573.3 lineto
41743.1 30498.3 lineto
41743.1 30085.9 lineto
stroke
newpath
43280.4 30910.8 moveto
42605.5 29898.4 lineto
stroke
newpath
44292.8 30873.3 moveto
44367.8 30873.3 lineto
44442.8 30835.8 lineto
44480.3 30798.3 lineto
44517.8 30723.3 lineto
44555.3 30573.3 lineto
44555.3 30385.8 lineto
44517.8 30235.9 lineto
44480.3 30160.9 lineto
44442.8 30123.4 lineto
44367.8 30085.9 lineto
44292.8 30085.9 lineto
44217.8 30123.4 lineto
44180.3 30160.9 lineto
44142.8 30235.9 lineto
44105.3 30385.8 lineto
44105.3 30573.3 lineto
44142.8 30723.3 lineto
44180.3 30798.3 lineto
44217.8 30835.8 lineto
44292.8 30873.3 lineto
stroke
newpath
44892.7 30160.9 moveto
44930.2 30123.4 lineto
44892.7 30085.9 lineto
44855.2 30123.4 lineto
44892.7 30160.9 lineto
44892.7 30085.9 lineto
stroke
newpath
45417.7 30873.3 moveto
45492.6 30873.3 lineto
45567.6 30835.8 lineto
45605.1 30798.3 lineto
45642.6 30723.3 lineto
45680.1 30573.3 lineto
45680.1 30385.8 lineto
45642.6 30235.9 lineto
45605.1 30160.9 lineto
45567.6 30123.4 lineto
45492.6 30085.9 lineto
45417.7 30085.9 lineto
45342.7 30123.4 lineto
45305.2 30160.9 lineto
45267.7 30235.9 lineto
45230.2 30385.8 lineto
45230.2 30573.3 lineto
45267.7 30723.3 lineto
45305.2 30798.3 lineto
45342.7 30835.8 lineto
45417.7 30873.3 lineto
stroke
newpath
45942.6 30873.3 moveto
46430 30873.3 lineto
46167.6 30573.3 lineto
46280 30573.3 lineto
46355 30535.8 lineto
46392.5 30498.3 lineto
46430 30423.3 lineto
46430 30235.9 lineto
46392.5 30160.9 lineto
46355 30123.4 lineto
46280 30085.9 lineto
46055.1 30085.9 lineto
45980.1 30123.4 lineto
45942.6 30160.9 lineto
stroke
newpath
46805 30085.9 moveto
46955 30085.9 lineto
47030 30123.4 lineto
47067.4 30160.9 lineto
47142.4 30273.4 lineto
47179.9 30423.3 lineto
47179.9 30723.3 lineto
47142.4 30798.3 lineto
47104.9 30835.8 lineto
47030 30873.3 lineto
46880 30873.3 lineto
46805 30835.8 lineto
46767.5 30798.3 lineto
46730 30723.3 lineto
46730 30535.8 lineto
46767.5 30460.8 lineto
46805 30423.3 lineto
46880 30385.8 lineto
47030 30385.8 lineto
47104.9 30423.3 lineto
47142.4 30460.8 lineto
47179.9 30535.8 lineto
stroke
newpath
47854.9 30610.8 moveto
47854.9 30085.9 lineto
stroke
newpath
47667.4 30910.8 moveto
47479.9 30348.3 lineto
47967.3 30348.3 lineto
stroke
newpath
48229.8 30873.3 moveto
48229.8 30723.3 lineto
stroke
newpath
48529.8 30873.3 moveto
48529.8 30723.3 lineto
stroke
newpath
49692.1 29785.9 moveto
49654.6 29823.4 lineto
49579.6 29935.9 lineto
49542.1 30010.9 lineto
49504.6 30123.4 lineto
49467.2 30310.8 lineto
49467.2 30460.8 lineto
49504.6 30648.3 lineto
49542.1 30760.8 lineto
49579.6 30835.8 lineto
49654.6 30948.3 lineto
49692.1 30985.8 lineto
stroke
newpath
49954.6 30798.3 moveto
49992.1 30835.8 lineto
50067.1 30873.3 lineto
50254.6 30873.3 lineto
50329.5 30835.8 lineto
50367 30798.3 lineto
50404.5 30723.3 lineto
50404.5 30648.3 lineto
50367 30535.8 lineto
49917.1 30085.9 lineto
50404.5 30085.9 lineto
stroke
newpath
50667 30873.3 moveto
51191.9 30873.3 lineto
50854.5 30085.9 lineto
stroke
newpath
52091.8 30085.9 moveto
52091.8 30873.3 lineto
stroke
newpath
52429.3 30085.9 moveto
52429.3 30498.3 lineto
52391.8 30573.3 lineto
52316.8 30610.8 lineto
52204.3 30610.8 lineto
52129.3 30573.3 lineto
52091.8 30535.8 lineto
stroke
newpath
52916.7 30085.9 moveto
52841.7 30123.4 lineto
52804.2 30160.9 lineto
52766.7 30235.9 lineto
52766.7 30460.8 lineto
52804.2 30535.8 lineto
52841.7 30573.3 lineto
52916.7 30610.8 lineto
53029.2 30610.8 lineto
53104.2 30573.3 lineto
53141.7 30535.8 lineto
53179.2 30460.8 lineto
53179.2 30235.9 lineto
53141.7 30160.9 lineto
53104.2 30123.4 lineto
53029.2 30085.9 lineto
52916.7 30085.9 lineto
stroke
newpath
53629.1 30085.9 moveto
53554.1 30123.4 lineto
53516.6 30198.4 lineto
53516.6 30873.3 lineto
stroke
newpath
54229.1 30123.4 moveto
54154.1 30085.9 lineto
54004.1 30085.9 lineto
53929.1 30123.4 lineto
53891.6 30198.4 lineto
53891.6 30498.3 lineto
53929.1 30573.3 lineto
54004.1 30610.8 lineto
54154.1 30610.8 lineto
54229.1 30573.3 lineto
54266.6 30498.3 lineto
54266.6 30423.3 lineto
53891.6 30348.3 lineto
stroke
newpath
54566.5 30123.4 moveto
54641.5 30085.9 lineto
54791.5 30085.9 lineto
54866.5 30123.4 lineto
54904 30198.4 lineto
54904 30235.9 lineto
54866.5 30310.8 lineto
54791.5 30348.3 lineto
54679 30348.3 lineto
54604 30385.8 lineto
54566.5 30460.8 lineto
54566.5 30498.3 lineto
54604 30573.3 lineto
54679 30610.8 lineto
54791.5 30610.8 lineto
54866.5 30573.3 lineto
stroke
newpath
55166.4 29785.9 moveto
55203.9 29823.4 lineto
55278.9 29935.9 lineto
55316.4 30010.9 lineto
55353.9 30123.4 lineto
55391.4 30310.8 lineto
55391.4 30460.8 lineto
55353.9 30648.3 lineto
55316.4 30760.8 lineto
55278.9 30835.8 lineto
55203.9 30948.3 lineto
55166.4 30985.8 lineto
stroke
newpath
35514.2 28903.8 moveto
35514.2 29460.6 lineto
34957.4 29460.6 lineto
34957.4 28903.8 lineto
35514.2 28903.8 lineto
poly0
182.319 setlinewidth
78.7401 setlinewidth
0 0 0 setrgbcolor
0 0 0 setrgbcolor
newpath
37056.2 28826 moveto
36606.3 28826 lineto
stroke
newpath
36831.2 28826 moveto
36831.2 29613.4 lineto
36756.2 29500.9 lineto
36681.2 29426 lineto
36606.3 29388.5 lineto
stroke
newpath
37393.7 28901 moveto
37431.2 28863.5 lineto
37393.7 28826 lineto
37356.2 28863.5 lineto
37393.7 28901 lineto
37393.7 28826 lineto
stroke
newpath
38143.6 29613.4 moveto
37768.6 29613.4 lineto
37731.1 29238.5 lineto
37768.6 29276 lineto
37843.6 29313.5 lineto
38031.1 29313.5 lineto
38106.1 29276 lineto
38143.6 29238.5 lineto
38181.1 29163.5 lineto
38181.1 28976 lineto
38143.6 28901 lineto
38106.1 28863.5 lineto
38031.1 28826 lineto
37843.6 28826 lineto
37768.6 28863.5 lineto
37731.1 28901 lineto
stroke
newpath
38481 29538.4 moveto
38518.5 29575.9 lineto
38593.5 29613.4 lineto
38781 29613.4 lineto
38856 29575.9 lineto
38893.5 29538.4 lineto
38931 29463.5 lineto
38931 29388.5 lineto
38893.5 29276 lineto
38443.5 28826 lineto
38931 28826 lineto
stroke
newpath
39418.4 29613.4 moveto
39493.4 29613.4 lineto
39568.4 29575.9 lineto
39605.9 29538.4 lineto
39643.4 29463.5 lineto
39680.9 29313.5 lineto
39680.9 29126 lineto
39643.4 28976 lineto
39605.9 28901 lineto
39568.4 28863.5 lineto
39493.4 28826 lineto
39418.4 28826 lineto
39343.4 28863.5 lineto
39305.9 28901 lineto
39268.4 28976 lineto
39230.9 29126 lineto
39230.9 29313.5 lineto
39268.4 29463.5 lineto
39305.9 29538.4 lineto
39343.4 29575.9 lineto
39418.4 29613.4 lineto
stroke
newpath
40018.3 28826 moveto
40018.3 29351 lineto
stroke
newpath
40018.3 29276 moveto
40055.8 29313.5 lineto
40130.8 29351 lineto
40243.3 29351 lineto
40318.3 29313.5 lineto
40355.8 29238.5 lineto
40355.8 28826 lineto
stroke
newpath
40355.8 29238.5 moveto
40393.3 29313.5 lineto
40468.3 29351 lineto
40580.8 29351 lineto
40655.8 29313.5 lineto
40693.2 29238.5 lineto
40693.2 28826 lineto
stroke
newpath
41068.2 28826 moveto
41068.2 29351 lineto
stroke
newpath
41068.2 29276 moveto
41105.7 29313.5 lineto
41180.7 29351 lineto
41293.2 29351 lineto
41368.2 29313.5 lineto
41405.7 29238.5 lineto
41405.7 28826 lineto
stroke
newpath
41405.7 29238.5 moveto
41443.2 29313.5 lineto
41518.1 29351 lineto
41630.6 29351 lineto
41705.6 29313.5 lineto
41743.1 29238.5 lineto
41743.1 28826 lineto
stroke
newpath
43280.4 29650.9 moveto
42605.5 28638.6 lineto
stroke
newpath
44292.8 29613.4 moveto
44367.8 29613.4 lineto
44442.8 29575.9 lineto
44480.3 29538.4 lineto
44517.8 29463.5 lineto
44555.3 29313.5 lineto
44555.3 29126 lineto
44517.8 28976 lineto
44480.3 28901 lineto
44442.8 28863.5 lineto
44367.8 28826 lineto
44292.8 28826 lineto
44217.8 28863.5 lineto
44180.3 28901 lineto
44142.8 28976 lineto
44105.3 29126 lineto
44105.3 29313.5 lineto
44142.8 29463.5 lineto
44180.3 29538.4 lineto
44217.8 29575.9 lineto
44292.8 29613.4 lineto
stroke
newpath
44892.7 28901 moveto
44930.2 28863.5 lineto
44892.7 28826 lineto
44855.2 28863.5 lineto
44892.7 28901 lineto
44892.7 28826 lineto
stroke
newpath
45417.7 29613.4 moveto
45492.6 29613.4 lineto
45567.6 29575.9 lineto
45605.1 29538.4 lineto
45642.6 29463.5 lineto
45680.1 29313.5 lineto
45680.1 29126 lineto
45642.6 28976 lineto
45605.1 28901 lineto
45567.6 28863.5 lineto
45492.6 28826 lineto
45417.7 28826 lineto
45342.7 28863.5 lineto
45305.2 28901 lineto
45267.7 28976 lineto
45230.2 29126 lineto
45230.2 29313.5 lineto
45267.7 29463.5 lineto
45305.2 29538.4 lineto
45342.7 29575.9 lineto
45417.7 29613.4 lineto
stroke
newpath
46392.5 29613.4 moveto
46017.6 29613.4 lineto
45980.1 29238.5 lineto
46017.6 29276 lineto
46092.6 29313.5 lineto
46280 29313.5 lineto
46355 29276 lineto
46392.5 29238.5 lineto
46430 29163.5 lineto
46430 28976 lineto
46392.5 28901 lineto
46355 28863.5 lineto
46280 28826 lineto
46092.6 28826 lineto
46017.6 28863.5 lineto
45980.1 28901 lineto
stroke
newpath
46805 28826 moveto
46955 28826 lineto
47030 28863.5 lineto
47067.4 28901 lineto
47142.4 29013.5 lineto
47179.9 29163.5 lineto
47179.9 29463.5 lineto
47142.4 29538.4 lineto
47104.9 29575.9 lineto
47030 29613.4 lineto
46880 29613.4 lineto
46805 29575.9 lineto
46767.5 29538.4 lineto
46730 29463.5 lineto
46730 29276 lineto
46767.5 29201 lineto
46805 29163.5 lineto
46880 29126 lineto
47030 29126 lineto
47104.9 29163.5 lineto
47142.4 29201 lineto
47179.9 29276 lineto
stroke
newpath
47629.9 29276 moveto
47554.9 29313.5 lineto
47517.4 29351 lineto
47479.9 29426 lineto
47479.9 29463.5 lineto
47517.4 29538.4 lineto
47554.9 29575.9 lineto
47629.9 29613.4 lineto
47779.9 29613.4 lineto
47854.9 29575.9 lineto
47892.3 29538.4 lineto
47929.8 29463.5 lineto
47929.8 29426 lineto
47892.3 29351 lineto
47854.9 29313.5 lineto
47779.9 29276 lineto
47629.9 29276 lineto
47554.9 29238.5 lineto
47517.4 29201 lineto
47479.9 29126 lineto
47479.9 28976 lineto
47517.4 28901 lineto
47554.9 28863.5 lineto
47629.9 28826 lineto
47779.9 28826 lineto
47854.9 28863.5 lineto
47892.3 28901 lineto
47929.8 28976 lineto
47929.8 29126 lineto
47892.3 29201 lineto
47854.9 29238.5 lineto
47779.9 29276 lineto
stroke
newpath
48229.8 29613.4 moveto
48229.8 29463.5 lineto
stroke
newpath
48529.8 29613.4 moveto
48529.8 29463.5 lineto
stroke
newpath
49692.1 28526.1 moveto
49654.6 28563.6 lineto
49579.6 28676.1 lineto
49542.1 28751 lineto
49504.6 28863.5 lineto
49467.2 29051 lineto
49467.2 29201 lineto
49504.6 29388.5 lineto
49542.1 29500.9 lineto
49579.6 29575.9 lineto
49654.6 29688.4 lineto
49692.1 29725.9 lineto
stroke
newpath
50404.5 28826 moveto
49954.6 28826 lineto
stroke
newpath
50179.6 28826 moveto
50179.6 29613.4 lineto
50104.6 29500.9 lineto
50029.6 29426 lineto
49954.6 29388.5 lineto
stroke
newpath
51079.4 29613.4 moveto
50929.5 29613.4 lineto
50854.5 29575.9 lineto
50817 29538.4 lineto
50742 29426 lineto
50704.5 29276 lineto
50704.5 28976 lineto
50742 28901 lineto
50779.5 28863.5 lineto
50854.5 28826 lineto
51004.5 28826 lineto
51079.4 28863.5 lineto
51116.9 28901 lineto
51154.4 28976 lineto
51154.4 29163.5 lineto
51116.9 29238.5 lineto
51079.4 29276 lineto
51004.5 29313.5 lineto
50854.5 29313.5 lineto
50779.5 29276 lineto
50742 29238.5 lineto
50704.5 29163.5 lineto
stroke
newpath
52091.8 28826 moveto
52091.8 29613.4 lineto
stroke
newpath
52429.3 28826 moveto
52429.3 29238.5 lineto
52391.8 29313.5 lineto
52316.8 29351 lineto
52204.3 29351 lineto
52129.3 29313.5 lineto
52091.8 29276 lineto
stroke
newpath
52916.7 28826 moveto
52841.7 28863.5 lineto
52804.2 28901 lineto
52766.7 28976 lineto
52766.7 29201 lineto
52804.2 29276 lineto
52841.7 29313.5 lineto
52916.7 29351 lineto
53029.2 29351 lineto
53104.2 29313.5 lineto
53141.7 29276 lineto
53179.2 29201 lineto
53179.2 28976 lineto
53141.7 28901 lineto
53104.2 28863.5 lineto
53029.2 28826 lineto
52916.7 28826 lineto
stroke
newpath
53629.1 28826 moveto
53554.1 28863.5 lineto
53516.6 28938.5 lineto
53516.6 29613.4 lineto
stroke
newpath
54229.1 28863.5 moveto
54154.1 28826 lineto
54004.1 28826 lineto
53929.1 28863.5 lineto
53891.6 28938.5 lineto
53891.6 29238.5 lineto
53929.1 29313.5 lineto
54004.1 29351 lineto
54154.1 29351 lineto
54229.1 29313.5 lineto
54266.6 29238.5 lineto
54266.6 29163.5 lineto
53891.6 29088.5 lineto
stroke
newpath
54566.5 28863.5 moveto
54641.5 28826 lineto
54791.5 28826 lineto
54866.5 28863.5 lineto
54904 28938.5 lineto
54904 28976 lineto
54866.5 29051 lineto
54791.5 29088.5 lineto
54679 29088.5 lineto
54604 29126 lineto
54566.5 29201 lineto
54566.5 29238.5 lineto
54604 29313.5 lineto
54679 29351 lineto
54791.5 29351 lineto
54866.5 29313.5 lineto
stroke
newpath
55166.4 28526.1 moveto
55203.9 28563.6 lineto
55278.9 28676.1 lineto
55316.4 28751 lineto
55353.9 28863.5 lineto
55391.4 29051 lineto
55391.4 29201 lineto
55353.9 29388.5 lineto
55316.4 29500.9 lineto
55278.9 29575.9 lineto
55203.9 29688.4 lineto
55166.4 29725.9 lineto
stroke
showpage
grestore
%%EOF
