(kicad_symbol_lib (version 20210619) (generator kicad_symbol_editor)
  (symbol "MMC5633NJL:MMC5633NJL" (in_bom yes) (on_board yes)
    (property "Reference" "U" (id 0) (at -11.43 12.7 0)
      (effects (font (size 1.27 1.27)))
    )
    (property "Value" "MMC5633NJL" (id 1) (at -11.43 12.7 0)
      (effects (font (size 1.27 1.27)))
    )
    (property "Footprint" "" (id 2) (at -11.43 12.7 0)
      (effects (font (size 1.27 1.27)) hide)
    )
    (property "Datasheet" "" (id 3) (at -11.43 12.7 0)
      (effects (font (size 1.27 1.27)) hide)
    )
    (symbol "MMC5633NJL_0_1"
      (rectangle (start -5.08 5.08) (end 5.08 -5.08)
        (stroke (width 0.1524)) (fill (type none))
      )
    )
    (symbol "MMC5633NJL_1_1"
      (pin power_in line (at -7.62 -2.54 0) (length 2.54)
        (name "GND" (effects (font (size 1.27 1.27))))
        (number "A1" (effects (font (size 1.27 1.27))))
      )
      (pin input line (at 7.62 2.54 180) (length 2.54)
        (name "SCL" (effects (font (size 1.27 1.27))))
        (number "A2" (effects (font (size 1.27 1.27))))
      )
      (pin power_in line (at -7.62 2.54 0) (length 2.54)
        (name "VDD" (effects (font (size 1.27 1.27))))
        (number "B1" (effects (font (size 1.27 1.27))))
      )
      (pin bidirectional line (at 7.62 -2.54 180) (length 2.54)
        (name "SDA" (effects (font (size 1.27 1.27))))
        (number "B2" (effects (font (size 1.27 1.27))))
      )
    )
  )
)
