(kicad_sch (version 20211123) (generator eeschema)

  (uuid a76e32a9-0a7f-4065-ae3b-1dc7a2c01051)

  (paper "A4")

  (lib_symbols
    (symbol "Connector:TestPoint" (pin_numbers hide) (pin_names (offset 0.762) hide) (in_bom yes) (on_board yes)
      (property "Reference" "TP" (id 0) (at 0 6.858 0)
        (effects (font (size 1.27 1.27)))
      )
      (property "Value" "TestPoint" (id 1) (at 0 5.08 0)
        (effects (font (size 1.27 1.27)))
      )
      (property "Footprint" "" (id 2) (at 5.08 0 0)
        (effects (font (size 1.27 1.27)) hide)
      )
      (property "Datasheet" "~" (id 3) (at 5.08 0 0)
        (effects (font (size 1.27 1.27)) hide)
      )
      (property "ki_keywords" "test point tp" (id 4) (at 0 0 0)
        (effects (font (size 1.27 1.27)) hide)
      )
      (property "ki_description" "test point" (id 5) (at 0 0 0)
        (effects (font (size 1.27 1.27)) hide)
      )
      (property "ki_fp_filters" "Pin* Test*" (id 6) (at 0 0 0)
        (effects (font (size 1.27 1.27)) hide)
      )
      (symbol "TestPoint_0_1"
        (circle (center 0 3.302) (radius 0.762)
          (stroke (width 0) (type default) (color 0 0 0 0))
          (fill (type none))
        )
      )
      (symbol "TestPoint_1_1"
        (pin passive line (at 0 0 90) (length 2.54)
          (name "1" (effects (font (size 1.27 1.27))))
          (number "1" (effects (font (size 1.27 1.27))))
        )
      )
    )
    (symbol "Connector_Generic:Conn_01x08" (pin_names (offset 1.016) hide) (in_bom yes) (on_board yes)
      (property "Reference" "J" (id 0) (at 0 10.16 0)
        (effects (font (size 1.27 1.27)))
      )
      (property "Value" "Conn_01x08" (id 1) (at 0 -12.7 0)
        (effects (font (size 1.27 1.27)))
      )
      (property "Footprint" "" (id 2) (at 0 0 0)
        (effects (font (size 1.27 1.27)) hide)
      )
      (property "Datasheet" "~" (id 3) (at 0 0 0)
        (effects (font (size 1.27 1.27)) hide)
      )
      (property "ki_keywords" "connector" (id 4) (at 0 0 0)
        (effects (font (size 1.27 1.27)) hide)
      )
      (property "ki_description" "Generic connector, single row, 01x08, script generated (kicad-library-utils/schlib/autogen/connector/)" (id 5) (at 0 0 0)
        (effects (font (size 1.27 1.27)) hide)
      )
      (property "ki_fp_filters" "Connector*:*_1x??_*" (id 6) (at 0 0 0)
        (effects (font (size 1.27 1.27)) hide)
      )
      (symbol "Conn_01x08_1_1"
        (rectangle (start -1.27 -10.033) (end 0 -10.287)
          (stroke (width 0.1524) (type default) (color 0 0 0 0))
          (fill (type none))
        )
        (rectangle (start -1.27 -7.493) (end 0 -7.747)
          (stroke (width 0.1524) (type default) (color 0 0 0 0))
          (fill (type none))
        )
        (rectangle (start -1.27 -4.953) (end 0 -5.207)
          (stroke (width 0.1524) (type default) (color 0 0 0 0))
          (fill (type none))
        )
        (rectangle (start -1.27 -2.413) (end 0 -2.667)
          (stroke (width 0.1524) (type default) (color 0 0 0 0))
          (fill (type none))
        )
        (rectangle (start -1.27 0.127) (end 0 -0.127)
          (stroke (width 0.1524) (type default) (color 0 0 0 0))
          (fill (type none))
        )
        (rectangle (start -1.27 2.667) (end 0 2.413)
          (stroke (width 0.1524) (type default) (color 0 0 0 0))
          (fill (type none))
        )
        (rectangle (start -1.27 5.207) (end 0 4.953)
          (stroke (width 0.1524) (type default) (color 0 0 0 0))
          (fill (type none))
        )
        (rectangle (start -1.27 7.747) (end 0 7.493)
          (stroke (width 0.1524) (type default) (color 0 0 0 0))
          (fill (type none))
        )
        (rectangle (start -1.27 8.89) (end 1.27 -11.43)
          (stroke (width 0.254) (type default) (color 0 0 0 0))
          (fill (type background))
        )
        (pin passive line (at -5.08 7.62 0) (length 3.81)
          (name "Pin_1" (effects (font (size 1.27 1.27))))
          (number "1" (effects (font (size 1.27 1.27))))
        )
        (pin passive line (at -5.08 5.08 0) (length 3.81)
          (name "Pin_2" (effects (font (size 1.27 1.27))))
          (number "2" (effects (font (size 1.27 1.27))))
        )
        (pin passive line (at -5.08 2.54 0) (length 3.81)
          (name "Pin_3" (effects (font (size 1.27 1.27))))
          (number "3" (effects (font (size 1.27 1.27))))
        )
        (pin passive line (at -5.08 0 0) (length 3.81)
          (name "Pin_4" (effects (font (size 1.27 1.27))))
          (number "4" (effects (font (size 1.27 1.27))))
        )
        (pin passive line (at -5.08 -2.54 0) (length 3.81)
          (name "Pin_5" (effects (font (size 1.27 1.27))))
          (number "5" (effects (font (size 1.27 1.27))))
        )
        (pin passive line (at -5.08 -5.08 0) (length 3.81)
          (name "Pin_6" (effects (font (size 1.27 1.27))))
          (number "6" (effects (font (size 1.27 1.27))))
        )
        (pin passive line (at -5.08 -7.62 0) (length 3.81)
          (name "Pin_7" (effects (font (size 1.27 1.27))))
          (number "7" (effects (font (size 1.27 1.27))))
        )
        (pin passive line (at -5.08 -10.16 0) (length 3.81)
          (name "Pin_8" (effects (font (size 1.27 1.27))))
          (number "8" (effects (font (size 1.27 1.27))))
        )
      )
    )
    (symbol "Connector_Generic:Conn_01x10" (pin_names (offset 1.016) hide) (in_bom yes) (on_board yes)
      (property "Reference" "J" (id 0) (at 0 12.7 0)
        (effects (font (size 1.27 1.27)))
      )
      (property "Value" "Conn_01x10" (id 1) (at 0 -15.24 0)
        (effects (font (size 1.27 1.27)))
      )
      (property "Footprint" "" (id 2) (at 0 0 0)
        (effects (font (size 1.27 1.27)) hide)
      )
      (property "Datasheet" "~" (id 3) (at 0 0 0)
        (effects (font (size 1.27 1.27)) hide)
      )
      (property "ki_keywords" "connector" (id 4) (at 0 0 0)
        (effects (font (size 1.27 1.27)) hide)
      )
      (property "ki_description" "Generic connector, single row, 01x10, script generated (kicad-library-utils/schlib/autogen/connector/)" (id 5) (at 0 0 0)
        (effects (font (size 1.27 1.27)) hide)
      )
      (property "ki_fp_filters" "Connector*:*_1x??_*" (id 6) (at 0 0 0)
        (effects (font (size 1.27 1.27)) hide)
      )
      (symbol "Conn_01x10_1_1"
        (rectangle (start -1.27 -12.573) (end 0 -12.827)
          (stroke (width 0.1524) (type default) (color 0 0 0 0))
          (fill (type none))
        )
        (rectangle (start -1.27 -10.033) (end 0 -10.287)
          (stroke (width 0.1524) (type default) (color 0 0 0 0))
          (fill (type none))
        )
        (rectangle (start -1.27 -7.493) (end 0 -7.747)
          (stroke (width 0.1524) (type default) (color 0 0 0 0))
          (fill (type none))
        )
        (rectangle (start -1.27 -4.953) (end 0 -5.207)
          (stroke (width 0.1524) (type default) (color 0 0 0 0))
          (fill (type none))
        )
        (rectangle (start -1.27 -2.413) (end 0 -2.667)
          (stroke (width 0.1524) (type default) (color 0 0 0 0))
          (fill (type none))
        )
        (rectangle (start -1.27 0.127) (end 0 -0.127)
          (stroke (width 0.1524) (type default) (color 0 0 0 0))
          (fill (type none))
        )
        (rectangle (start -1.27 2.667) (end 0 2.413)
          (stroke (width 0.1524) (type default) (color 0 0 0 0))
          (fill (type none))
        )
        (rectangle (start -1.27 5.207) (end 0 4.953)
          (stroke (width 0.1524) (type default) (color 0 0 0 0))
          (fill (type none))
        )
        (rectangle (start -1.27 7.747) (end 0 7.493)
          (stroke (width 0.1524) (type default) (color 0 0 0 0))
          (fill (type none))
        )
        (rectangle (start -1.27 10.287) (end 0 10.033)
          (stroke (width 0.1524) (type default) (color 0 0 0 0))
          (fill (type none))
        )
        (rectangle (start -1.27 11.43) (end 1.27 -13.97)
          (stroke (width 0.254) (type default) (color 0 0 0 0))
          (fill (type background))
        )
        (pin passive line (at -5.08 10.16 0) (length 3.81)
          (name "Pin_1" (effects (font (size 1.27 1.27))))
          (number "1" (effects (font (size 1.27 1.27))))
        )
        (pin passive line (at -5.08 -12.7 0) (length 3.81)
          (name "Pin_10" (effects (font (size 1.27 1.27))))
          (number "10" (effects (font (size 1.27 1.27))))
        )
        (pin passive line (at -5.08 7.62 0) (length 3.81)
          (name "Pin_2" (effects (font (size 1.27 1.27))))
          (number "2" (effects (font (size 1.27 1.27))))
        )
        (pin passive line (at -5.08 5.08 0) (length 3.81)
          (name "Pin_3" (effects (font (size 1.27 1.27))))
          (number "3" (effects (font (size 1.27 1.27))))
        )
        (pin passive line (at -5.08 2.54 0) (length 3.81)
          (name "Pin_4" (effects (font (size 1.27 1.27))))
          (number "4" (effects (font (size 1.27 1.27))))
        )
        (pin passive line (at -5.08 0 0) (length 3.81)
          (name "Pin_5" (effects (font (size 1.27 1.27))))
          (number "5" (effects (font (size 1.27 1.27))))
        )
        (pin passive line (at -5.08 -2.54 0) (length 3.81)
          (name "Pin_6" (effects (font (size 1.27 1.27))))
          (number "6" (effects (font (size 1.27 1.27))))
        )
        (pin passive line (at -5.08 -5.08 0) (length 3.81)
          (name "Pin_7" (effects (font (size 1.27 1.27))))
          (number "7" (effects (font (size 1.27 1.27))))
        )
        (pin passive line (at -5.08 -7.62 0) (length 3.81)
          (name "Pin_8" (effects (font (size 1.27 1.27))))
          (number "8" (effects (font (size 1.27 1.27))))
        )
        (pin passive line (at -5.08 -10.16 0) (length 3.81)
          (name "Pin_9" (effects (font (size 1.27 1.27))))
          (number "9" (effects (font (size 1.27 1.27))))
        )
      )
    )
    (symbol "Device:C" (pin_numbers hide) (pin_names (offset 0.254)) (in_bom yes) (on_board yes)
      (property "Reference" "C" (id 0) (at 0.635 2.54 0)
        (effects (font (size 1.27 1.27)) (justify left))
      )
      (property "Value" "C" (id 1) (at 0.635 -2.54 0)
        (effects (font (size 1.27 1.27)) (justify left))
      )
      (property "Footprint" "" (id 2) (at 0.9652 -3.81 0)
        (effects (font (size 1.27 1.27)) hide)
      )
      (property "Datasheet" "~" (id 3) (at 0 0 0)
        (effects (font (size 1.27 1.27)) hide)
      )
      (property "ki_keywords" "cap capacitor" (id 4) (at 0 0 0)
        (effects (font (size 1.27 1.27)) hide)
      )
      (property "ki_description" "Unpolarized capacitor" (id 5) (at 0 0 0)
        (effects (font (size 1.27 1.27)) hide)
      )
      (property "ki_fp_filters" "C_*" (id 6) (at 0 0 0)
        (effects (font (size 1.27 1.27)) hide)
      )
      (symbol "C_0_1"
        (polyline
          (pts
            (xy -2.032 -0.762)
            (xy 2.032 -0.762)
          )
          (stroke (width 0.508) (type default) (color 0 0 0 0))
          (fill (type none))
        )
        (polyline
          (pts
            (xy -2.032 0.762)
            (xy 2.032 0.762)
          )
          (stroke (width 0.508) (type default) (color 0 0 0 0))
          (fill (type none))
        )
      )
      (symbol "C_1_1"
        (pin passive line (at 0 3.81 270) (length 2.794)
          (name "~" (effects (font (size 1.27 1.27))))
          (number "1" (effects (font (size 1.27 1.27))))
        )
        (pin passive line (at 0 -3.81 90) (length 2.794)
          (name "~" (effects (font (size 1.27 1.27))))
          (number "2" (effects (font (size 1.27 1.27))))
        )
      )
    )
    (symbol "Device:R" (pin_numbers hide) (pin_names (offset 0)) (in_bom yes) (on_board yes)
      (property "Reference" "R" (id 0) (at 2.032 0 90)
        (effects (font (size 1.27 1.27)))
      )
      (property "Value" "R" (id 1) (at 0 0 90)
        (effects (font (size 1.27 1.27)))
      )
      (property "Footprint" "" (id 2) (at -1.778 0 90)
        (effects (font (size 1.27 1.27)) hide)
      )
      (property "Datasheet" "~" (id 3) (at 0 0 0)
        (effects (font (size 1.27 1.27)) hide)
      )
      (property "ki_keywords" "R res resistor" (id 4) (at 0 0 0)
        (effects (font (size 1.27 1.27)) hide)
      )
      (property "ki_description" "Resistor" (id 5) (at 0 0 0)
        (effects (font (size 1.27 1.27)) hide)
      )
      (property "ki_fp_filters" "R_*" (id 6) (at 0 0 0)
        (effects (font (size 1.27 1.27)) hide)
      )
      (symbol "R_0_1"
        (rectangle (start -1.016 -2.54) (end 1.016 2.54)
          (stroke (width 0.254) (type default) (color 0 0 0 0))
          (fill (type none))
        )
      )
      (symbol "R_1_1"
        (pin passive line (at 0 3.81 270) (length 1.27)
          (name "~" (effects (font (size 1.27 1.27))))
          (number "1" (effects (font (size 1.27 1.27))))
        )
        (pin passive line (at 0 -3.81 90) (length 1.27)
          (name "~" (effects (font (size 1.27 1.27))))
          (number "2" (effects (font (size 1.27 1.27))))
        )
      )
    )
    (symbol "ICM42605:ICM42605" (in_bom yes) (on_board yes)
      (property "Reference" "U" (id 0) (at -7.62 8.89 0)
        (effects (font (size 1.27 1.27)))
      )
      (property "Value" "ICM42605" (id 1) (at 7.62 8.89 0)
        (effects (font (size 1.27 1.27)))
      )
      (property "Footprint" "Package_LGA:LGA-14_3x2.5mm_P0.5mm_LayoutBorder3x4y" (id 2) (at -21.59 31.75 0)
        (effects (font (size 1.27 1.27)) hide)
      )
      (property "Datasheet" "" (id 3) (at -21.59 31.75 0)
        (effects (font (size 1.27 1.27)) hide)
      )
      (symbol "ICM42605_0_1"
        (rectangle (start -12.7 7.62) (end 12.7 -7.62)
          (stroke (width 0.1524) (type default) (color 0 0 0 0))
          (fill (type background))
        )
      )
      (symbol "ICM42605_1_1"
        (pin bidirectional line (at -15.24 0 0) (length 2.54)
          (name "AD0/SDO" (effects (font (size 1.27 1.27))))
          (number "1" (effects (font (size 1.27 1.27))))
        )
        (pin passive line (at 15.24 -5.08 180) (length 2.54)
          (name "RESV" (effects (font (size 1.27 1.27))))
          (number "10" (effects (font (size 1.27 1.27))))
        )
        (pin passive line (at 15.24 -5.08 180) (length 2.54) hide
          (name "RESV" (effects (font (size 1.27 1.27))))
          (number "11" (effects (font (size 1.27 1.27))))
        )
        (pin input line (at -15.24 -2.54 0) (length 2.54)
          (name "nCS" (effects (font (size 1.27 1.27))))
          (number "12" (effects (font (size 1.27 1.27))))
        )
        (pin input line (at -15.24 5.08 0) (length 2.54)
          (name "SCL/SCLK" (effects (font (size 1.27 1.27))))
          (number "13" (effects (font (size 1.27 1.27))))
        )
        (pin bidirectional line (at -15.24 2.54 0) (length 2.54)
          (name "SDA/SDI" (effects (font (size 1.27 1.27))))
          (number "14" (effects (font (size 1.27 1.27))))
        )
        (pin passive line (at 15.24 0 180) (length 2.54)
          (name "RESV" (effects (font (size 1.27 1.27))))
          (number "2" (effects (font (size 1.27 1.27))))
        )
        (pin passive line (at 15.24 0 180) (length 2.54) hide
          (name "RESV" (effects (font (size 1.27 1.27))))
          (number "3" (effects (font (size 1.27 1.27))))
        )
        (pin output line (at -15.24 -5.08 0) (length 2.54)
          (name "INT" (effects (font (size 1.27 1.27))))
          (number "4" (effects (font (size 1.27 1.27))))
        )
        (pin power_in line (at 1.27 10.16 270) (length 2.54)
          (name "VDDIO" (effects (font (size 1.27 1.27))))
          (number "5" (effects (font (size 1.27 1.27))))
        )
        (pin power_in line (at 0 -10.16 90) (length 2.54)
          (name "GND" (effects (font (size 1.27 1.27))))
          (number "6" (effects (font (size 1.27 1.27))))
        )
        (pin passive line (at 15.24 -2.54 180) (length 2.54)
          (name "RESV" (effects (font (size 1.27 1.27))))
          (number "7" (effects (font (size 1.27 1.27))))
        )
        (pin power_in line (at -1.27 10.16 270) (length 2.54)
          (name "VDD" (effects (font (size 1.27 1.27))))
          (number "8" (effects (font (size 1.27 1.27))))
        )
        (pin output line (at 15.24 5.08 180) (length 2.54)
          (name "FSYNC" (effects (font (size 1.27 1.27))))
          (number "9" (effects (font (size 1.27 1.27))))
        )
      )
    )
    (symbol "LIS2MDL:LIS2MDLTR" (in_bom yes) (on_board yes)
      (property "Reference" "U6" (id 0) (at 2.54 -8.89 0)
        (effects (font (size 1.27 1.27)) (justify left))
      )
      (property "Value" "LIS2MDLTR" (id 1) (at 2.54 -11.43 0)
        (effects (font (size 1.27 1.27)) (justify left))
      )
      (property "Footprint" "Package_LGA:LGA-12_2x2mm_P0.5mm" (id 2) (at -21.59 31.75 0)
        (effects (font (size 1.27 1.27)) hide)
      )
      (property "Datasheet" "" (id 3) (at -21.59 31.75 0)
        (effects (font (size 1.27 1.27)) hide)
      )
      (symbol "LIS2MDLTR_0_1"
        (rectangle (start -12.7 7.62) (end 12.7 -7.62)
          (stroke (width 0.1524) (type default) (color 0 0 0 0))
          (fill (type background))
        )
      )
      (symbol "LIS2MDLTR_1_1"
        (pin input line (at -15.24 3.81 0) (length 2.54)
          (name "SCL/SCLK" (effects (font (size 1.27 1.27))))
          (number "1" (effects (font (size 1.27 1.27))))
        )
        (pin power_in line (at 1.27 10.16 270) (length 2.54)
          (name "VDDIO" (effects (font (size 1.27 1.27))))
          (number "10" (effects (font (size 1.27 1.27))))
        )
        (pin passive line (at 15.24 -1.27 180) (length 2.54)
          (name "NC" (effects (font (size 1.27 1.27))))
          (number "11" (effects (font (size 1.27 1.27))))
        )
        (pin passive line (at 15.24 1.27 180) (length 2.54)
          (name "NC" (effects (font (size 1.27 1.27))))
          (number "11" (effects (font (size 1.27 1.27))))
        )
        (pin passive line (at 15.24 -3.81 180) (length 2.54)
          (name "NC" (effects (font (size 1.27 1.27))))
          (number "12" (effects (font (size 1.27 1.27))))
        )
        (pin input line (at -15.24 -3.81 0) (length 2.54)
          (name "nCS" (effects (font (size 1.27 1.27))))
          (number "3" (effects (font (size 1.27 1.27))))
        )
        (pin bidirectional line (at -15.24 1.27 0) (length 2.54)
          (name "SDA/SDIO" (effects (font (size 1.27 1.27))))
          (number "4" (effects (font (size 1.27 1.27))))
        )
        (pin passive line (at 15.24 3.81 180) (length 2.54)
          (name "C1" (effects (font (size 1.27 1.27))))
          (number "5" (effects (font (size 1.27 1.27))))
        )
        (pin power_in line (at -1.27 -10.16 90) (length 2.54)
          (name "GND" (effects (font (size 1.27 1.27))))
          (number "6" (effects (font (size 1.27 1.27))))
        )
        (pin output line (at -15.24 -1.27 0) (length 2.54)
          (name "INT/SDO" (effects (font (size 1.27 1.27))))
          (number "7" (effects (font (size 1.27 1.27))))
        )
        (pin power_in line (at 1.27 -10.16 90) (length 2.54)
          (name "GND" (effects (font (size 1.27 1.27))))
          (number "8" (effects (font (size 1.27 1.27))))
        )
        (pin power_in line (at -1.27 10.16 270) (length 2.54)
          (name "VDD" (effects (font (size 1.27 1.27))))
          (number "9" (effects (font (size 1.27 1.27))))
        )
      )
    )
    (symbol "Transistor_FET:AO3401A" (pin_names hide) (in_bom yes) (on_board yes)
      (property "Reference" "Q" (id 0) (at 5.08 1.905 0)
        (effects (font (size 1.27 1.27)) (justify left))
      )
      (property "Value" "AO3401A" (id 1) (at 5.08 0 0)
        (effects (font (size 1.27 1.27)) (justify left))
      )
      (property "Footprint" "Package_TO_SOT_SMD:SOT-23" (id 2) (at 5.08 -1.905 0)
        (effects (font (size 1.27 1.27) italic) (justify left) hide)
      )
      (property "Datasheet" "http://www.aosmd.com/pdfs/datasheet/AO3401A.pdf" (id 3) (at 0 0 0)
        (effects (font (size 1.27 1.27)) (justify left) hide)
      )
      (property "ki_keywords" "P-Channel MOSFET" (id 4) (at 0 0 0)
        (effects (font (size 1.27 1.27)) hide)
      )
      (property "ki_description" "-4.0A Id, -30V Vds, P-Channel MOSFET, SOT-23" (id 5) (at 0 0 0)
        (effects (font (size 1.27 1.27)) hide)
      )
      (property "ki_fp_filters" "SOT?23*" (id 6) (at 0 0 0)
        (effects (font (size 1.27 1.27)) hide)
      )
      (symbol "AO3401A_0_1"
        (polyline
          (pts
            (xy 0.254 0)
            (xy -2.54 0)
          )
          (stroke (width 0) (type default) (color 0 0 0 0))
          (fill (type none))
        )
        (polyline
          (pts
            (xy 0.254 1.905)
            (xy 0.254 -1.905)
          )
          (stroke (width 0.254) (type default) (color 0 0 0 0))
          (fill (type none))
        )
        (polyline
          (pts
            (xy 0.762 -1.27)
            (xy 0.762 -2.286)
          )
          (stroke (width 0.254) (type default) (color 0 0 0 0))
          (fill (type none))
        )
        (polyline
          (pts
            (xy 0.762 0.508)
            (xy 0.762 -0.508)
          )
          (stroke (width 0.254) (type default) (color 0 0 0 0))
          (fill (type none))
        )
        (polyline
          (pts
            (xy 0.762 2.286)
            (xy 0.762 1.27)
          )
          (stroke (width 0.254) (type default) (color 0 0 0 0))
          (fill (type none))
        )
        (polyline
          (pts
            (xy 2.54 2.54)
            (xy 2.54 1.778)
          )
          (stroke (width 0) (type default) (color 0 0 0 0))
          (fill (type none))
        )
        (polyline
          (pts
            (xy 2.54 -2.54)
            (xy 2.54 0)
            (xy 0.762 0)
          )
          (stroke (width 0) (type default) (color 0 0 0 0))
          (fill (type none))
        )
        (polyline
          (pts
            (xy 0.762 1.778)
            (xy 3.302 1.778)
            (xy 3.302 -1.778)
            (xy 0.762 -1.778)
          )
          (stroke (width 0) (type default) (color 0 0 0 0))
          (fill (type none))
        )
        (polyline
          (pts
            (xy 2.286 0)
            (xy 1.27 0.381)
            (xy 1.27 -0.381)
            (xy 2.286 0)
          )
          (stroke (width 0) (type default) (color 0 0 0 0))
          (fill (type outline))
        )
        (polyline
          (pts
            (xy 2.794 -0.508)
            (xy 2.921 -0.381)
            (xy 3.683 -0.381)
            (xy 3.81 -0.254)
          )
          (stroke (width 0) (type default) (color 0 0 0 0))
          (fill (type none))
        )
        (polyline
          (pts
            (xy 3.302 -0.381)
            (xy 2.921 0.254)
            (xy 3.683 0.254)
            (xy 3.302 -0.381)
          )
          (stroke (width 0) (type default) (color 0 0 0 0))
          (fill (type none))
        )
        (circle (center 1.651 0) (radius 2.794)
          (stroke (width 0.254) (type default) (color 0 0 0 0))
          (fill (type none))
        )
        (circle (center 2.54 -1.778) (radius 0.254)
          (stroke (width 0) (type default) (color 0 0 0 0))
          (fill (type outline))
        )
        (circle (center 2.54 1.778) (radius 0.254)
          (stroke (width 0) (type default) (color 0 0 0 0))
          (fill (type outline))
        )
      )
      (symbol "AO3401A_1_1"
        (pin input line (at -5.08 0 0) (length 2.54)
          (name "G" (effects (font (size 1.27 1.27))))
          (number "1" (effects (font (size 1.27 1.27))))
        )
        (pin passive line (at 2.54 -5.08 90) (length 2.54)
          (name "S" (effects (font (size 1.27 1.27))))
          (number "2" (effects (font (size 1.27 1.27))))
        )
        (pin passive line (at 2.54 5.08 270) (length 2.54)
          (name "D" (effects (font (size 1.27 1.27))))
          (number "3" (effects (font (size 1.27 1.27))))
        )
      )
    )
    (symbol "power:+3V3" (power) (pin_names (offset 0)) (in_bom yes) (on_board yes)
      (property "Reference" "#PWR" (id 0) (at 0 -3.81 0)
        (effects (font (size 1.27 1.27)) hide)
      )
      (property "Value" "+3V3" (id 1) (at 0 3.556 0)
        (effects (font (size 1.27 1.27)))
      )
      (property "Footprint" "" (id 2) (at 0 0 0)
        (effects (font (size 1.27 1.27)) hide)
      )
      (property "Datasheet" "" (id 3) (at 0 0 0)
        (effects (font (size 1.27 1.27)) hide)
      )
      (property "ki_keywords" "power-flag" (id 4) (at 0 0 0)
        (effects (font (size 1.27 1.27)) hide)
      )
      (property "ki_description" "Power symbol creates a global label with name \"+3V3\"" (id 5) (at 0 0 0)
        (effects (font (size 1.27 1.27)) hide)
      )
      (symbol "+3V3_0_1"
        (polyline
          (pts
            (xy -0.762 1.27)
            (xy 0 2.54)
          )
          (stroke (width 0) (type default) (color 0 0 0 0))
          (fill (type none))
        )
        (polyline
          (pts
            (xy 0 0)
            (xy 0 2.54)
          )
          (stroke (width 0) (type default) (color 0 0 0 0))
          (fill (type none))
        )
        (polyline
          (pts
            (xy 0 2.54)
            (xy 0.762 1.27)
          )
          (stroke (width 0) (type default) (color 0 0 0 0))
          (fill (type none))
        )
      )
      (symbol "+3V3_1_1"
        (pin power_in line (at 0 0 90) (length 0) hide
          (name "+3V3" (effects (font (size 1.27 1.27))))
          (number "1" (effects (font (size 1.27 1.27))))
        )
      )
    )
    (symbol "power:+5V" (power) (pin_names (offset 0)) (in_bom yes) (on_board yes)
      (property "Reference" "#PWR" (id 0) (at 0 -3.81 0)
        (effects (font (size 1.27 1.27)) hide)
      )
      (property "Value" "+5V" (id 1) (at 0 3.556 0)
        (effects (font (size 1.27 1.27)))
      )
      (property "Footprint" "" (id 2) (at 0 0 0)
        (effects (font (size 1.27 1.27)) hide)
      )
      (property "Datasheet" "" (id 3) (at 0 0 0)
        (effects (font (size 1.27 1.27)) hide)
      )
      (property "ki_keywords" "power-flag" (id 4) (at 0 0 0)
        (effects (font (size 1.27 1.27)) hide)
      )
      (property "ki_description" "Power symbol creates a global label with name \"+5V\"" (id 5) (at 0 0 0)
        (effects (font (size 1.27 1.27)) hide)
      )
      (symbol "+5V_0_1"
        (polyline
          (pts
            (xy -0.762 1.27)
            (xy 0 2.54)
          )
          (stroke (width 0) (type default) (color 0 0 0 0))
          (fill (type none))
        )
        (polyline
          (pts
            (xy 0 0)
            (xy 0 2.54)
          )
          (stroke (width 0) (type default) (color 0 0 0 0))
          (fill (type none))
        )
        (polyline
          (pts
            (xy 0 2.54)
            (xy 0.762 1.27)
          )
          (stroke (width 0) (type default) (color 0 0 0 0))
          (fill (type none))
        )
      )
      (symbol "+5V_1_1"
        (pin power_in line (at 0 0 90) (length 0) hide
          (name "+5V" (effects (font (size 1.27 1.27))))
          (number "1" (effects (font (size 1.27 1.27))))
        )
      )
    )
    (symbol "power:GND" (power) (pin_names (offset 0)) (in_bom yes) (on_board yes)
      (property "Reference" "#PWR" (id 0) (at 0 -6.35 0)
        (effects (font (size 1.27 1.27)) hide)
      )
      (property "Value" "GND" (id 1) (at 0 -3.81 0)
        (effects (font (size 1.27 1.27)))
      )
      (property "Footprint" "" (id 2) (at 0 0 0)
        (effects (font (size 1.27 1.27)) hide)
      )
      (property "Datasheet" "" (id 3) (at 0 0 0)
        (effects (font (size 1.27 1.27)) hide)
      )
      (property "ki_keywords" "power-flag" (id 4) (at 0 0 0)
        (effects (font (size 1.27 1.27)) hide)
      )
      (property "ki_description" "Power symbol creates a global label with name \"GND\" , ground" (id 5) (at 0 0 0)
        (effects (font (size 1.27 1.27)) hide)
      )
      (symbol "GND_0_1"
        (polyline
          (pts
            (xy 0 0)
            (xy 0 -1.27)
            (xy 1.27 -1.27)
            (xy 0 -2.54)
            (xy -1.27 -1.27)
            (xy 0 -1.27)
          )
          (stroke (width 0) (type default) (color 0 0 0 0))
          (fill (type none))
        )
      )
      (symbol "GND_1_1"
        (pin power_in line (at 0 0 270) (length 0) hide
          (name "GND" (effects (font (size 1.27 1.27))))
          (number "1" (effects (font (size 1.27 1.27))))
        )
      )
    )
  )

  (junction (at 121.92 54.61) (diameter 0.9144) (color 0 0 0 0)
    (uuid 404af0f9-b564-4e27-b2f2-50e876cad2e8)
  )
  (junction (at 53.34 52.07) (diameter 0.9144) (color 0 0 0 0)
    (uuid 6142aa12-33d6-4653-8db1-0ba1cf17f3c0)
  )
  (junction (at 219.71 67.31) (diameter 0) (color 0 0 0 0)
    (uuid 80590f6e-2acd-4d2f-a773-472e9833b545)
  )
  (junction (at 114.3 44.45) (diameter 0.9144) (color 0 0 0 0)
    (uuid 88c9782b-819e-4a5a-b24e-2542733a589a)
  )
  (junction (at 114.3 54.61) (diameter 0.9144) (color 0 0 0 0)
    (uuid b8073454-e60c-4dd2-9b14-2bde866bd4fa)
  )
  (junction (at 118.11 80.01) (diameter 0) (color 0 0 0 0)
    (uuid d8e848df-f970-4e40-ab63-b1012304d09c)
  )
  (junction (at 45.72 52.07) (diameter 0.9144) (color 0 0 0 0)
    (uuid ead377b6-1cde-45e6-b7c7-55443c706d1c)
  )
  (junction (at 45.72 41.91) (diameter 0.9144) (color 0 0 0 0)
    (uuid ee61e494-c001-4474-be77-698c93affeb4)
  )

  (no_connect (at 64.77 67.31) (uuid 3b97b0f3-620c-48ff-bbc1-42a0c25a2fca))
  (no_connect (at 64.77 64.77) (uuid 45cdbcb8-45c9-42f6-a33b-2a8b29eb1abf))
  (no_connect (at 64.77 69.85) (uuid 6895781b-02de-4faf-930d-ad6ce61ad3ef))
  (no_connect (at 133.35 71.12) (uuid 8c88899d-b113-4470-9afd-c31686c09d46))
  (no_connect (at 133.35 68.58) (uuid 9ddc0b6a-0ab0-4afc-ba91-40288d7a9d96))
  (no_connect (at 107.95 124.46) (uuid a534a130-5e62-475c-816b-1c1290110a88))
  (no_connect (at 107.95 119.38) (uuid bb8b4832-acf1-482d-b990-18f0a077d246))
  (no_connect (at 107.95 121.92) (uuid bb8b4832-acf1-482d-b990-18f0a077d247))
  (no_connect (at 133.35 66.04) (uuid f483b548-bc8d-4f11-9ff6-dc129345f4f8))

  (wire (pts (xy 166.37 85.09) (xy 184.15 85.09))
    (stroke (width 0) (type default) (color 0 0 0 0))
    (uuid 00bd0cb4-bd2d-4007-9e02-7144539c7d1d)
  )
  (wire (pts (xy 121.92 54.61) (xy 124.46 54.61))
    (stroke (width 0) (type solid) (color 0 0 0 0))
    (uuid 016c636b-7852-49aa-b393-713c2e9dd476)
  )
  (wire (pts (xy 219.71 64.77) (xy 219.71 67.31))
    (stroke (width 0) (type default) (color 0 0 0 0))
    (uuid 01742f78-8c16-4a96-a37f-bef74b6d565d)
  )
  (wire (pts (xy 114.3 54.61) (xy 111.76 54.61))
    (stroke (width 0) (type solid) (color 0 0 0 0))
    (uuid 033dfc52-d741-4e41-96d8-8714f508905c)
  )
  (wire (pts (xy 255.27 77.47) (xy 255.27 80.01))
    (stroke (width 0) (type solid) (color 0 0 0 0))
    (uuid 0482283e-d8bc-4101-b50f-371e88db6b9a)
  )
  (wire (pts (xy 48.26 54.61) (xy 48.26 52.07))
    (stroke (width 0) (type solid) (color 0 0 0 0))
    (uuid 05456cc2-7402-46de-9ae0-b72ba50ff2e5)
  )
  (wire (pts (xy 116.84 54.61) (xy 114.3 54.61))
    (stroke (width 0) (type solid) (color 0 0 0 0))
    (uuid 08f1e1ae-8181-4f5a-bac2-8a06c5bd7579)
  )
  (wire (pts (xy 100.33 71.12) (xy 102.87 71.12))
    (stroke (width 0) (type default) (color 0 0 0 0))
    (uuid 0b108d35-b807-4994-b131-3d0c5e2b86d9)
  )
  (wire (pts (xy 102.87 114.3) (xy 107.95 114.3))
    (stroke (width 0) (type default) (color 0 0 0 0))
    (uuid 0bb1bd29-5338-4aa2-9a94-7f9b7be68c6a)
  )
  (wire (pts (xy 166.37 69.85) (xy 195.58 69.85))
    (stroke (width 0) (type default) (color 0 0 0 0))
    (uuid 0f6c6008-0f64-46e2-a715-eef223730b59)
  )
  (wire (pts (xy 50.8 52.07) (xy 53.34 52.07))
    (stroke (width 0) (type solid) (color 0 0 0 0))
    (uuid 11c6751c-cdb3-42c0-ade0-95cea2227593)
  )
  (wire (pts (xy 166.37 67.31) (xy 184.15 67.31))
    (stroke (width 0) (type default) (color 0 0 0 0))
    (uuid 11c8952a-721d-4db3-b99a-7012988e9533)
  )
  (wire (pts (xy 53.34 49.53) (xy 53.34 52.07))
    (stroke (width 0) (type solid) (color 0 0 0 0))
    (uuid 13ad8399-66ac-4696-8af3-fed1fc2510d4)
  )
  (wire (pts (xy 166.37 62.23) (xy 184.15 62.23))
    (stroke (width 0) (type default) (color 0 0 0 0))
    (uuid 18b0b249-52dd-49b6-bb1d-9057c629c490)
  )
  (wire (pts (xy 259.08 72.39) (xy 255.27 72.39))
    (stroke (width 0) (type solid) (color 0 0 0 0))
    (uuid 1a30128d-7b42-4c5c-9e27-c4c24893ccba)
  )
  (wire (pts (xy 217.17 67.31) (xy 219.71 67.31))
    (stroke (width 0) (type default) (color 0 0 0 0))
    (uuid 1c9b5038-7d1a-40aa-b7fb-d9e1311d1319)
  )
  (wire (pts (xy 146.05 66.04) (xy 146.05 63.5))
    (stroke (width 0) (type default) (color 0 0 0 0))
    (uuid 1fe940c4-209f-49d6-bb86-b118f0bbba73)
  )
  (wire (pts (xy 255.27 54.61) (xy 255.27 52.07))
    (stroke (width 0) (type solid) (color 0 0 0 0))
    (uuid 241c48f3-8699-4bef-817d-593383fb6fe6)
  )
  (wire (pts (xy 49.53 74.93) (xy 49.53 77.47))
    (stroke (width 0) (type solid) (color 0 0 0 0))
    (uuid 267de941-02c6-42c3-9aa2-02836a6136ec)
  )
  (wire (pts (xy 105.41 129.54) (xy 105.41 111.76))
    (stroke (width 0) (type default) (color 0 0 0 0))
    (uuid 26b76b92-ff6b-4ded-aa21-1cbecb9294d8)
  )
  (wire (pts (xy 132.08 54.61) (xy 134.62 54.61))
    (stroke (width 0) (type solid) (color 0 0 0 0))
    (uuid 27e9d4b8-fee4-420d-8395-3a504cbcef48)
  )
  (wire (pts (xy 17.78 69.85) (xy 34.29 69.85))
    (stroke (width 0) (type default) (color 0 0 0 0))
    (uuid 3063d3cb-0c46-436a-b25a-a6a00dbe1cd3)
  )
  (wire (pts (xy 229.87 74.93) (xy 259.08 74.93))
    (stroke (width 0) (type default) (color 0 0 0 0))
    (uuid 32ffa73f-a777-4724-b8ef-1ba30c979ef3)
  )
  (wire (pts (xy 101.6 44.45) (xy 104.14 44.45))
    (stroke (width 0) (type solid) (color 0 0 0 0))
    (uuid 35137e35-90c2-4bc9-88ff-92d35dcdd34a)
  )
  (wire (pts (xy 116.84 57.15) (xy 116.84 54.61))
    (stroke (width 0) (type solid) (color 0 0 0 0))
    (uuid 3e02162c-4089-47bf-a4aa-34773f9f040d)
  )
  (wire (pts (xy 243.84 69.85) (xy 259.08 69.85))
    (stroke (width 0) (type default) (color 0 0 0 0))
    (uuid 51f3d9d7-479c-459d-8df1-2e59f12da1f0)
  )
  (wire (pts (xy 166.37 59.69) (xy 184.15 59.69))
    (stroke (width 0) (type default) (color 0 0 0 0))
    (uuid 521e5462-2411-4789-8c0c-e6d024ba64a9)
  )
  (wire (pts (xy 116.84 80.01) (xy 118.11 80.01))
    (stroke (width 0) (type default) (color 0 0 0 0))
    (uuid 52aa2c18-1594-4496-9f48-35e86a3454a6)
  )
  (wire (pts (xy 17.78 59.69) (xy 34.29 59.69))
    (stroke (width 0) (type default) (color 0 0 0 0))
    (uuid 58e39092-a334-4725-993a-15319843cfd5)
  )
  (wire (pts (xy 105.41 109.22) (xy 107.95 109.22))
    (stroke (width 0) (type default) (color 0 0 0 0))
    (uuid 5f2aff10-b01e-4c65-916b-7c7691de5ac4)
  )
  (wire (pts (xy 118.11 80.01) (xy 119.38 80.01))
    (stroke (width 0) (type default) (color 0 0 0 0))
    (uuid 5f790e1c-8401-4c35-9b32-714c361abd20)
  )
  (wire (pts (xy 116.84 77.47) (xy 116.84 80.01))
    (stroke (width 0) (type default) (color 0 0 0 0))
    (uuid 6009c0e9-d68b-4cf5-8ef7-0565e164775f)
  )
  (wire (pts (xy 105.41 111.76) (xy 107.95 111.76))
    (stroke (width 0) (type default) (color 0 0 0 0))
    (uuid 60a7607f-8cbe-4f10-897f-87dbcd332894)
  )
  (wire (pts (xy 17.78 67.31) (xy 34.29 67.31))
    (stroke (width 0) (type default) (color 0 0 0 0))
    (uuid 6180a4df-169d-4392-8fe8-cd26f7f7ac27)
  )
  (wire (pts (xy 184.15 74.93) (xy 166.37 74.93))
    (stroke (width 0) (type default) (color 0 0 0 0))
    (uuid 62eb8a64-fc27-4fe5-9884-6711afdeeb9c)
  )
  (wire (pts (xy 102.87 127) (xy 107.95 127))
    (stroke (width 0) (type default) (color 0 0 0 0))
    (uuid 66811104-26ba-4356-8776-7429181dd9ee)
  )
  (wire (pts (xy 45.72 52.07) (xy 43.18 52.07))
    (stroke (width 0) (type solid) (color 0 0 0 0))
    (uuid 67d9f6a2-ca05-4e00-8dc4-cae9ad852c39)
  )
  (wire (pts (xy 85.09 63.5) (xy 102.87 63.5))
    (stroke (width 0) (type default) (color 0 0 0 0))
    (uuid 69b439ff-354e-4953-b7e2-1d3a5905223d)
  )
  (wire (pts (xy 118.11 82.55) (xy 118.11 80.01))
    (stroke (width 0) (type default) (color 0 0 0 0))
    (uuid 6f11a479-45ee-4547-abac-2433b8af3e0f)
  )
  (wire (pts (xy 229.87 59.69) (xy 229.87 62.23))
    (stroke (width 0) (type default) (color 0 0 0 0))
    (uuid 78ea8e87-2092-46f7-b255-0658f2855a81)
  )
  (wire (pts (xy 166.37 82.55) (xy 184.15 82.55))
    (stroke (width 0) (type default) (color 0 0 0 0))
    (uuid 7911b7b4-b28c-472c-995f-32eb42e601e6)
  )
  (wire (pts (xy 229.87 72.39) (xy 229.87 74.93))
    (stroke (width 0) (type default) (color 0 0 0 0))
    (uuid 7be11e2d-05e5-46a8-a8af-f5e545766878)
  )
  (wire (pts (xy 114.3 44.45) (xy 114.3 54.61))
    (stroke (width 0) (type solid) (color 0 0 0 0))
    (uuid 7f54f110-81da-46f0-8013-37648c283d32)
  )
  (wire (pts (xy 133.35 63.5) (xy 135.89 63.5))
    (stroke (width 0) (type default) (color 0 0 0 0))
    (uuid 83f11fd0-ba10-4858-a731-729172dc2791)
  )
  (wire (pts (xy 45.72 39.37) (xy 45.72 41.91))
    (stroke (width 0) (type solid) (color 0 0 0 0))
    (uuid 8431bcb4-c434-4fb7-9bb4-5b5c6ad47a51)
  )
  (wire (pts (xy 259.08 77.47) (xy 255.27 77.47))
    (stroke (width 0) (type solid) (color 0 0 0 0))
    (uuid 86841c02-d9cc-4873-bda4-efe47be7d113)
  )
  (wire (pts (xy 85.09 66.04) (xy 102.87 66.04))
    (stroke (width 0) (type default) (color 0 0 0 0))
    (uuid 86b1ad4f-1889-4a4c-b9a2-b402faa73878)
  )
  (wire (pts (xy 166.37 54.61) (xy 184.15 54.61))
    (stroke (width 0) (type default) (color 0 0 0 0))
    (uuid 86e8d548-6826-442e-8c04-8bb226d344a3)
  )
  (wire (pts (xy 53.34 52.07) (xy 55.88 52.07))
    (stroke (width 0) (type solid) (color 0 0 0 0))
    (uuid 8ea38b62-a4b9-40f0-9ae2-8270737ebcab)
  )
  (wire (pts (xy 101.6 54.61) (xy 104.14 54.61))
    (stroke (width 0) (type solid) (color 0 0 0 0))
    (uuid 8f6cf4a0-f3e9-435b-b228-587eaa7b70ad)
  )
  (wire (pts (xy 17.78 62.23) (xy 34.29 62.23))
    (stroke (width 0) (type default) (color 0 0 0 0))
    (uuid 8fe2adaa-4b6c-48d6-b56f-3061fba3b7f0)
  )
  (wire (pts (xy 166.37 80.01) (xy 184.15 80.01))
    (stroke (width 0) (type default) (color 0 0 0 0))
    (uuid 9178afa9-a34e-476a-a822-4958949a3783)
  )
  (wire (pts (xy 119.38 80.01) (xy 119.38 77.47))
    (stroke (width 0) (type default) (color 0 0 0 0))
    (uuid 92801c1c-f71f-4b05-9512-1c7492ecb392)
  )
  (wire (pts (xy 33.02 52.07) (xy 35.56 52.07))
    (stroke (width 0) (type solid) (color 0 0 0 0))
    (uuid 982b1998-1475-491f-aa76-3caf2c8750ea)
  )
  (wire (pts (xy 114.3 41.91) (xy 114.3 44.45))
    (stroke (width 0) (type solid) (color 0 0 0 0))
    (uuid 9af5c2e3-b928-487f-b0f4-c3c2c81efc5a)
  )
  (wire (pts (xy 105.41 106.68) (xy 105.41 109.22))
    (stroke (width 0) (type default) (color 0 0 0 0))
    (uuid a22b1e65-5405-474d-b1be-0a774a13d3fb)
  )
  (wire (pts (xy 102.87 116.84) (xy 107.95 116.84))
    (stroke (width 0) (type default) (color 0 0 0 0))
    (uuid a4188de6-7946-4593-98bb-d2319a57b965)
  )
  (wire (pts (xy 166.37 64.77) (xy 184.15 64.77))
    (stroke (width 0) (type default) (color 0 0 0 0))
    (uuid a8d4846b-4984-4dc8-a84a-e5167245ec26)
  )
  (wire (pts (xy 219.71 67.31) (xy 222.25 67.31))
    (stroke (width 0) (type default) (color 0 0 0 0))
    (uuid a91b7f5c-19ff-4e5d-8cc7-e3b8aa563005)
  )
  (wire (pts (xy 43.18 41.91) (xy 45.72 41.91))
    (stroke (width 0) (type solid) (color 0 0 0 0))
    (uuid aa193353-9d95-4c68-b036-3856e107ec77)
  )
  (wire (pts (xy 45.72 41.91) (xy 45.72 52.07))
    (stroke (width 0) (type solid) (color 0 0 0 0))
    (uuid aa510c09-6266-4e52-8afb-da979bd962de)
  )
  (wire (pts (xy 243.84 62.23) (xy 259.08 62.23))
    (stroke (width 0) (type default) (color 0 0 0 0))
    (uuid af2ce838-e246-4e6e-adc4-65a7b033b1a3)
  )
  (wire (pts (xy 33.02 41.91) (xy 35.56 41.91))
    (stroke (width 0) (type solid) (color 0 0 0 0))
    (uuid b2a6e0de-23a2-421d-a8fb-91f0ec3ca4cd)
  )
  (wire (pts (xy 146.05 63.5) (xy 143.51 63.5))
    (stroke (width 0) (type default) (color 0 0 0 0))
    (uuid b2c21443-f5e1-478f-bfd2-408df509f7d8)
  )
  (wire (pts (xy 85.09 68.58) (xy 102.87 68.58))
    (stroke (width 0) (type default) (color 0 0 0 0))
    (uuid b3557378-6d4a-4009-b45e-37f29d5e2062)
  )
  (wire (pts (xy 243.84 67.31) (xy 259.08 67.31))
    (stroke (width 0) (type default) (color 0 0 0 0))
    (uuid b5c37567-3300-47fd-b18f-244f23783d3c)
  )
  (wire (pts (xy 119.38 57.15) (xy 119.38 54.61))
    (stroke (width 0) (type solid) (color 0 0 0 0))
    (uuid b6807983-6adf-408d-8eb4-40b8cc60a1b1)
  )
  (wire (pts (xy 243.84 57.15) (xy 259.08 57.15))
    (stroke (width 0) (type default) (color 0 0 0 0))
    (uuid bd807d8b-f603-41ea-aa94-70b555f1eb1c)
  )
  (wire (pts (xy 111.76 44.45) (xy 114.3 44.45))
    (stroke (width 0) (type solid) (color 0 0 0 0))
    (uuid beb819bf-6699-4fa8-b4b4-fd21dcfb39d8)
  )
  (wire (pts (xy 166.37 77.47) (xy 184.15 77.47))
    (stroke (width 0) (type default) (color 0 0 0 0))
    (uuid c02f6db2-6e45-49c5-8b95-78bcc66b033b)
  )
  (wire (pts (xy 166.37 72.39) (xy 195.58 72.39))
    (stroke (width 0) (type default) (color 0 0 0 0))
    (uuid ccfc5072-c1d4-4b56-adde-ef38eddaefc1)
  )
  (wire (pts (xy 243.84 59.69) (xy 259.08 59.69))
    (stroke (width 0) (type default) (color 0 0 0 0))
    (uuid cf5e2195-da87-40a3-be3a-de789d2c8088)
  )
  (wire (pts (xy 219.71 77.47) (xy 219.71 80.01))
    (stroke (width 0) (type default) (color 0 0 0 0))
    (uuid d01de8f3-f915-49d1-9160-c6f17d1db106)
  )
  (wire (pts (xy 119.38 54.61) (xy 121.92 54.61))
    (stroke (width 0) (type solid) (color 0 0 0 0))
    (uuid d1aef877-2bb2-4c01-a5c9-24a1a06b08b4)
  )
  (wire (pts (xy 259.08 54.61) (xy 255.27 54.61))
    (stroke (width 0) (type solid) (color 0 0 0 0))
    (uuid d7fdc347-5227-4fd1-9ad3-5311bd3a4b2a)
  )
  (wire (pts (xy 50.8 54.61) (xy 50.8 52.07))
    (stroke (width 0) (type solid) (color 0 0 0 0))
    (uuid d919ba9e-de20-4aba-8d22-e64a75a77134)
  )
  (wire (pts (xy 64.77 59.69) (xy 81.28 59.69))
    (stroke (width 0) (type default) (color 0 0 0 0))
    (uuid dc459ddc-1966-4270-82a9-d03cf2b632c3)
  )
  (wire (pts (xy 219.71 67.31) (xy 219.71 69.85))
    (stroke (width 0) (type default) (color 0 0 0 0))
    (uuid e005ed48-582b-4b6e-a0f1-dc71f33ea8b8)
  )
  (wire (pts (xy 63.5 52.07) (xy 66.04 52.07))
    (stroke (width 0) (type solid) (color 0 0 0 0))
    (uuid e39f79aa-7233-4b0c-ae72-6cd7d1ca16ca)
  )
  (wire (pts (xy 48.26 52.07) (xy 45.72 52.07))
    (stroke (width 0) (type solid) (color 0 0 0 0))
    (uuid e84781ff-a7dd-4dbc-b33d-0f207f31b977)
  )
  (wire (pts (xy 121.92 52.07) (xy 121.92 54.61))
    (stroke (width 0) (type solid) (color 0 0 0 0))
    (uuid ee952897-164b-4834-95fb-a83d03fdf976)
  )
  (wire (pts (xy 166.37 57.15) (xy 184.15 57.15))
    (stroke (width 0) (type default) (color 0 0 0 0))
    (uuid fa25cca5-a859-4226-8279-e8de5ab12ac9)
  )
  (wire (pts (xy 17.78 64.77) (xy 34.29 64.77))
    (stroke (width 0) (type default) (color 0 0 0 0))
    (uuid fdee7219-a563-43cf-ba6c-1d510d1fac61)
  )
  (wire (pts (xy 232.41 83.82) (xy 232.41 86.36))
    (stroke (width 0) (type default) (color 0 0 0 0))
    (uuid fe137a61-dc2e-4d55-bdc6-d64f6223c332)
  )
  (wire (pts (xy 243.84 64.77) (xy 259.08 64.77))
    (stroke (width 0) (type default) (color 0 0 0 0))
    (uuid ff32e7ad-fbaa-4943-9a0a-b772b5b6d37f)
  )

  (text "LIS2MDLTR Magnetometer" (at 105.41 35.56 0)
    (effects (font (size 1.27 1.27)) (justify left bottom))
    (uuid 74889292-9fb5-4f85-b095-005a606e22b8)
  )
  (text "ICM-42605 IMU" (at 41.91 33.02 0)
    (effects (font (size 1.27 1.27)) (justify left bottom))
    (uuid 7b7551b1-e6b4-4fad-89d6-4f5fa1a5218b)
  )
  (text "DS-009 GNSS Connector\n" (at 242.57 46.99 0)
    (effects (font (size 1.27 1.27)) (justify left bottom))
    (uuid 80e31361-9bc1-493c-b8b3-f03ab72720fe)
  )

  (label "UART_TX_GNSS" (at 243.84 57.15 0)
    (effects (font (size 1.27 1.27)) (justify left bottom))
    (uuid 0ff00802-4b6a-4529-bca6-ccac3f76a0d5)
  )
  (label "MISO_ICM42605" (at 184.15 59.69 180)
    (effects (font (size 1.27 1.27)) (justify right bottom))
    (uuid 187ae4ff-4f62-4cb8-842e-4ce53b8fbc1f)
  )
  (label "SCK_ICM42605" (at 17.78 59.69 0)
    (effects (font (size 1.27 1.27)) (justify left bottom))
    (uuid 2d11a777-2865-4ca4-9734-3b67ed695d0c)
  )
  (label "SDA_LIS2MDLTR" (at 184.15 72.39 180)
    (effects (font (size 1.27 1.27)) (justify right bottom))
    (uuid 2f5d6e79-c857-4541-a300-03f3580e1028)
  )
  (label "INT2_ICM42605" (at 81.28 59.69 180)
    (effects (font (size 1.27 1.27)) (justify right bottom))
    (uuid 30a16f72-1cbe-4189-8be0-349772c6cc4f)
  )
  (label "SDA_GNSS" (at 243.84 64.77 0)
    (effects (font (size 1.27 1.27)) (justify left bottom))
    (uuid 349898e4-d0b2-447a-a0e5-b294dea36d7d)
  )
  (label "SAFETY_SWITCH" (at 184.15 82.55 180)
    (effects (font (size 1.27 1.27)) (justify right bottom))
    (uuid 37d9793c-2c4e-48e4-9d84-c89319b40bca)
  )
  (label "INT_LIS2MDLTR" (at 184.15 74.93 180)
    (effects (font (size 1.27 1.27)) (justify right bottom))
    (uuid 51e46f49-b027-4b5d-963d-f75f77e4ba92)
  )
  (label "SDA_LIS2MDLTR" (at 85.09 66.04 0)
    (effects (font (size 1.27 1.27)) (justify left bottom))
    (uuid 68ffe593-73e4-4fa3-b663-3c9578068578)
  )
  (label "SAFETY_LED" (at 243.84 69.85 0)
    (effects (font (size 1.27 1.27)) (justify left bottom))
    (uuid 6b40fa69-05c7-48e1-992f-508f06531cad)
  )
  (label "UART_RX_GNSS" (at 184.15 80.01 180)
    (effects (font (size 1.27 1.27)) (justify right bottom))
    (uuid 9d8e869e-46ab-4473-af02-d3031b8b3b46)
  )
  (label "INT_LIS2MDLTR" (at 85.09 68.58 0)
    (effects (font (size 1.27 1.27)) (justify left bottom))
    (uuid a88beeb2-f691-4ceb-9cb4-57a1082a1b69)
  )
  (label "SCL_GNSS" (at 243.84 62.23 0)
    (effects (font (size 1.27 1.27)) (justify left bottom))
    (uuid a9064ae4-31d9-411a-abcb-2130f8ac83d8)
  )
  (label "SAFETY_SWITCH" (at 243.84 67.31 0)
    (effects (font (size 1.27 1.27)) (justify left bottom))
    (uuid ab16833c-ffbd-4f8a-af5a-de63ca8d53d0)
  )
  (label "MOSI_ICM42605" (at 184.15 57.15 180)
    (effects (font (size 1.27 1.27)) (justify right bottom))
    (uuid b11fb088-a7ff-4a25-86fb-c37d042f2c96)
  )
  (label "MISO_ICM42605" (at 17.78 64.77 0)
    (effects (font (size 1.27 1.27)) (justify left bottom))
    (uuid b36ebcf7-30e9-40ff-a4bb-a7de06793a2b)
  )
  (label "UART_RX_GNSS" (at 243.84 59.69 0)
    (effects (font (size 1.27 1.27)) (justify left bottom))
    (uuid b3e9fb1e-e598-4a29-a3f6-b57e2664aec3)
  )
  (label "SDA_GNSS" (at 195.58 72.39 180)
    (effects (font (size 1.27 1.27)) (justify right bottom))
    (uuid b4f53a91-a5bc-41a5-8df9-5a9e56c622e9)
  )
  (label "SCL_GNSS" (at 195.58 69.85 180)
    (effects (font (size 1.27 1.27)) (justify right bottom))
    (uuid c1883f41-668e-4b89-9e94-a2d6e40c4514)
  )
  (label "SCK_ICM42605" (at 184.15 54.61 180)
    (effects (font (size 1.27 1.27)) (justify right bottom))
    (uuid c783c925-2d48-45e2-b408-58574e0874b4)
  )
  (label "SAFETY_LED" (at 184.15 85.09 180)
    (effects (font (size 1.27 1.27)) (justify right bottom))
    (uuid cc006e0f-84a2-4d33-a925-2dc6b0d5eab8)
  )
  (label "nCS_ICM42605" (at 17.78 67.31 0)
    (effects (font (size 1.27 1.27)) (justify left bottom))
    (uuid d3a8c0f0-eb88-4301-9955-f244ecfcf416)
  )
  (label "MOSI_ICM42605" (at 17.78 62.23 0)
    (effects (font (size 1.27 1.27)) (justify left bottom))
    (uuid d7221b91-58ab-4250-b32a-a8ac47e60258)
  )
  (label "nCS_ICM42605" (at 184.15 62.23 180)
    (effects (font (size 1.27 1.27)) (justify right bottom))
    (uuid d88821fd-939c-496c-ab56-3882dcca675d)
  )
  (label "INT_ICM42605" (at 17.78 69.85 0)
    (effects (font (size 1.27 1.27)) (justify left bottom))
    (uuid ddfde017-48c7-4212-881a-3b0018d5638e)
  )
  (label "INT_ICM42605" (at 184.15 64.77 180)
    (effects (font (size 1.27 1.27)) (justify right bottom))
    (uuid e1b5c366-4ce4-400b-ae45-496fd8749e36)
  )
  (label "SCL_LIS2MDLTR" (at 85.09 63.5 0)
    (effects (font (size 1.27 1.27)) (justify left bottom))
    (uuid e1f2e31b-bce7-49b7-adb1-d0a3bce20be8)
  )
  (label "UART_TX_GNSS" (at 184.15 77.47 180)
    (effects (font (size 1.27 1.27)) (justify right bottom))
    (uuid ee5b2295-2d27-46e1-b976-365073b47452)
  )
  (label "SCL_LIS2MDLTR" (at 184.15 69.85 180)
    (effects (font (size 1.27 1.27)) (justify right bottom))
    (uuid f98fe248-2f2a-4319-ac76-faf126ea64d2)
  )
  (label "INT2_ICM42605" (at 184.15 67.31 180)
    (effects (font (size 1.27 1.27)) (justify right bottom))
    (uuid fba9096c-c947-4eff-b63a-df48db33537f)
  )

  (hierarchical_label "SAFETY_LED" (shape input) (at 166.37 85.09 180)
    (effects (font (size 1.27 1.27)) (justify right))
    (uuid 05843ade-c9ba-4986-8970-e7ffab0c14b0)
  )
  (hierarchical_label "INT_IMU" (shape input) (at 102.87 127 180)
    (effects (font (size 1.27 1.27)) (justify right))
    (uuid 08bd2a46-69f1-4c85-b813-5fc4a62b93d6)
  )
  (hierarchical_label "SCL_MAG{slash}GNSS" (shape input) (at 102.87 114.3 180)
    (effects (font (size 1.27 1.27)) (justify right))
    (uuid 0b28b465-d1bf-43fb-9697-38f5cf76e84a)
  )
  (hierarchical_label "nCS_IMU" (shape input) (at 166.37 62.23 180)
    (effects (font (size 1.27 1.27)) (justify right))
    (uuid 0c1bcd72-5bbb-4053-8165-dc37484394e2)
  )
  (hierarchical_label "VDD" (shape input) (at 114.3 41.91 90) (fields_autoplaced)
    (effects (font (size 1.27 1.27)) (justify left))
    (uuid 148153cf-9389-4a17-b201-b5ce2083653a)
  )
  (hierarchical_label "VDD" (shape input) (at 45.72 39.37 90) (fields_autoplaced)
    (effects (font (size 1.27 1.27)) (justify left))
    (uuid 16506715-284c-4521-b2a5-21219cbbc9bf)
  )
  (hierarchical_label "INT_MAG" (shape input) (at 166.37 74.93 180)
    (effects (font (size 1.27 1.27)) (justify right))
    (uuid 22d59613-2687-4065-9476-c46b9db6d64a)
  )
  (hierarchical_label "VDD" (shape input) (at 121.92 52.07 90) (fields_autoplaced)
    (effects (font (size 1.27 1.27)) (justify left))
    (uuid 25aac758-e30a-45ad-9dc0-c3bfa33f63e8)
  )
  (hierarchical_label "SAFETY_SWITCH" (shape input) (at 166.37 82.55 180)
    (effects (font (size 1.27 1.27)) (justify right))
    (uuid 25ce3442-bebe-4430-a883-50e2ea7394c2)
  )
  (hierarchical_label "INT_IMU" (shape input) (at 166.37 64.77 180)
    (effects (font (size 1.27 1.27)) (justify right))
    (uuid 2ec2059b-9c81-40ee-8b1e-08e7259a0bae)
  )
  (hierarchical_label "SDA_MAG{slash}GNSS" (shape input) (at 166.37 72.39 180)
    (effects (font (size 1.27 1.27)) (justify right))
    (uuid 34f55c94-b2ea-41f9-8650-74e736b6677a)
  )
  (hierarchical_label "VDD" (shape input) (at 53.34 49.53 90) (fields_autoplaced)
    (effects (font (size 1.27 1.27)) (justify left))
    (uuid 47a51152-046b-476e-b49e-58bb6babd414)
  )
  (hierarchical_label "UART_TX_GNSS" (shape input) (at 166.37 77.47 180)
    (effects (font (size 1.27 1.27)) (justify right))
    (uuid 4b4c031c-5ba9-4cf6-883a-535347fe3945)
  )
  (hierarchical_label "INT2_IMU" (shape input) (at 166.37 67.31 180)
    (effects (font (size 1.27 1.27)) (justify right))
    (uuid 55ab6811-427f-4cde-b3d6-79fd6ea11430)
  )
  (hierarchical_label "SCK_IMU" (shape input) (at 166.37 54.61 180)
    (effects (font (size 1.27 1.27)) (justify right))
    (uuid 5dc78dc9-5dcf-47e5-a916-9ac085633686)
  )
  (hierarchical_label "MISO_IMU" (shape input) (at 166.37 59.69 180)
    (effects (font (size 1.27 1.27)) (justify right))
    (uuid 6037a921-8c8f-4f93-ba08-8bc14d5c8f7d)
  )
  (hierarchical_label "UART_RX_GNSS" (shape input) (at 166.37 80.01 180)
    (effects (font (size 1.27 1.27)) (justify right))
    (uuid 7b35ac57-4f2b-48e7-b5da-4e1155813434)
  )
  (hierarchical_label "MOSI_IMU" (shape input) (at 166.37 57.15 180)
    (effects (font (size 1.27 1.27)) (justify right))
    (uuid 953f59fc-79ca-4291-8f18-2b712d494410)
  )
  (hierarchical_label "SDA_MAG{slash}GNSS" (shape input) (at 102.87 116.84 180)
    (effects (font (size 1.27 1.27)) (justify right))
    (uuid 9cd04295-ec27-4db8-8570-ab500e58d15d)
  )
  (hierarchical_label "SCL_MAG{slash}GNSS" (shape input) (at 166.37 69.85 180)
    (effects (font (size 1.27 1.27)) (justify right))
    (uuid a6178725-649f-40dc-bf35-451fc77a0df3)
  )
  (hierarchical_label "BUZZER" (shape input) (at 217.17 67.31 180)
    (effects (font (size 1.27 1.27)) (justify right))
    (uuid b3bd1088-6c75-474a-84dc-cb37e5d1d3c2)
  )

  (symbol (lib_id "Transistor_FET:AO3401A") (at 227.33 67.31 0) (unit 1)
    (in_bom yes) (on_board yes) (fields_autoplaced)
    (uuid 0894f94d-8907-4cec-8f2b-79f84ab37774)
    (property "Reference" "Q1" (id 0) (at 233.68 66.0399 0)
      (effects (font (size 1.27 1.27)) (justify left))
    )
    (property "Value" "AO3401A" (id 1) (at 233.68 68.5799 0)
      (effects (font (size 1.27 1.27)) (justify left))
    )
    (property "Footprint" "Package_TO_SOT_SMD:SOT-23" (id 2) (at 232.41 69.215 0)
      (effects (font (size 1.27 1.27) italic) (justify left) hide)
    )
    (property "Datasheet" "http://www.aosmd.com/pdfs/datasheet/AO3401A.pdf" (id 3) (at 227.33 67.31 0)
      (effects (font (size 1.27 1.27)) (justify left) hide)
    )
    (property "LCSC" "C15127" (id 4) (at 227.33 67.31 0)
      (effects (font (size 1.27 1.27)) hide)
    )
    (pin "1" (uuid e51724cf-48c9-47f2-ab24-c07e49a056f7))
    (pin "2" (uuid 50306dfb-73d8-4007-9903-8964dd43981b))
    (pin "3" (uuid 9bdfb27f-c9ad-4974-8286-b25e5ffa2770))
  )

  (symbol (lib_id "power:GND") (at 101.6 54.61 270) (unit 1)
    (in_bom yes) (on_board yes) (fields_autoplaced)
    (uuid 0c7f3af7-51e1-42c2-a34e-199362a9a31e)
    (property "Reference" "#PWR033" (id 0) (at 95.25 54.61 0)
      (effects (font (size 1.27 1.27)) hide)
    )
    (property "Value" "GND" (id 1) (at 97.79 55.2449 90)
      (effects (font (size 1.27 1.27)) (justify right))
    )
    (property "Footprint" "" (id 2) (at 101.6 54.61 0)
      (effects (font (size 1.27 1.27)) hide)
    )
    (property "Datasheet" "" (id 3) (at 101.6 54.61 0)
      (effects (font (size 1.27 1.27)) hide)
    )
    (pin "1" (uuid 990a93fc-c431-4f79-8a35-b626b277a364))
  )

  (symbol (lib_id "Device:C") (at 107.95 44.45 90) (unit 1)
    (in_bom yes) (on_board yes) (fields_autoplaced)
    (uuid 24ae74de-90b1-4c74-b26c-2bc1b1d9631a)
    (property "Reference" "C21" (id 0) (at 107.95 36.83 90))
    (property "Value" "10uF" (id 1) (at 107.95 39.37 90))
    (property "Footprint" "Capacitor_SMD:C_0402_1005Metric" (id 2) (at 111.76 43.4848 0)
      (effects (font (size 1.27 1.27)) hide)
    )
    (property "Datasheet" "~" (id 3) (at 107.95 44.45 0)
      (effects (font (size 1.27 1.27)) hide)
    )
    (property "LCSC" "C15525" (id 4) (at 107.95 44.45 90)
      (effects (font (size 1.27 1.27)) hide)
    )
    (pin "1" (uuid 91050d99-975c-4cec-9261-0ac5b41b2b81))
    (pin "2" (uuid 45f29137-c6c0-495a-aac4-ee6e4fb78702))
  )

  (symbol (lib_id "power:GND") (at 146.05 66.04 0) (unit 1)
    (in_bom yes) (on_board yes) (fields_autoplaced)
    (uuid 38614e2b-8aa4-468d-b133-724cf5e662a6)
    (property "Reference" "#PWR036" (id 0) (at 146.05 72.39 0)
      (effects (font (size 1.27 1.27)) hide)
    )
    (property "Value" "GND" (id 1) (at 146.05 71.12 0))
    (property "Footprint" "" (id 2) (at 146.05 66.04 0)
      (effects (font (size 1.27 1.27)) hide)
    )
    (property "Datasheet" "" (id 3) (at 146.05 66.04 0)
      (effects (font (size 1.27 1.27)) hide)
    )
    (pin "1" (uuid b1a8362c-0cd1-4b79-bf5e-08b20ae0ddca))
  )

  (symbol (lib_id "power:+3V3") (at 255.27 72.39 90) (unit 1)
    (in_bom yes) (on_board yes)
    (uuid 3cd9af8e-d0e3-4165-8351-73ce3039a06b)
    (property "Reference" "#PWR0146" (id 0) (at 259.08 72.39 0)
      (effects (font (size 1.27 1.27)) hide)
    )
    (property "Value" "+3V3" (id 1) (at 251.46 71.7549 90)
      (effects (font (size 1.27 1.27)) (justify left))
    )
    (property "Footprint" "" (id 2) (at 255.27 72.39 0)
      (effects (font (size 1.27 1.27)) hide)
    )
    (property "Datasheet" "" (id 3) (at 255.27 72.39 0)
      (effects (font (size 1.27 1.27)) hide)
    )
    (pin "1" (uuid f25697e3-1a2f-4267-9808-a96b5ad2cc37))
  )

  (symbol (lib_id "power:GND") (at 219.71 80.01 0) (unit 1)
    (in_bom yes) (on_board yes) (fields_autoplaced)
    (uuid 4fb3762a-32f9-4fe8-b491-0a1562a2c84e)
    (property "Reference" "#PWR046" (id 0) (at 219.71 86.36 0)
      (effects (font (size 1.27 1.27)) hide)
    )
    (property "Value" "GND" (id 1) (at 219.71 85.09 0))
    (property "Footprint" "" (id 2) (at 219.71 80.01 0)
      (effects (font (size 1.27 1.27)) hide)
    )
    (property "Datasheet" "" (id 3) (at 219.71 80.01 0)
      (effects (font (size 1.27 1.27)) hide)
    )
    (pin "1" (uuid ebecb5e5-a59c-4286-b3fe-831b9ea37a00))
  )

  (symbol (lib_id "power:GND") (at 33.02 41.91 270) (unit 1)
    (in_bom yes) (on_board yes) (fields_autoplaced)
    (uuid 60d78a5d-fb17-4efb-9cd3-7a48e73e6e44)
    (property "Reference" "#PWR027" (id 0) (at 26.67 41.91 0)
      (effects (font (size 1.27 1.27)) hide)
    )
    (property "Value" "GND" (id 1) (at 29.21 42.5449 90)
      (effects (font (size 1.27 1.27)) (justify right))
    )
    (property "Footprint" "" (id 2) (at 33.02 41.91 0)
      (effects (font (size 1.27 1.27)) hide)
    )
    (property "Datasheet" "" (id 3) (at 33.02 41.91 0)
      (effects (font (size 1.27 1.27)) hide)
    )
    (pin "1" (uuid ac48f61d-e30d-45d2-925b-ec1f7102a80b))
  )

  (symbol (lib_id "Device:C") (at 59.69 52.07 90) (unit 1)
    (in_bom yes) (on_board yes) (fields_autoplaced)
    (uuid 61661da8-968b-4c92-bb8c-d22de2e91b64)
    (property "Reference" "C20" (id 0) (at 59.69 45.72 90))
    (property "Value" "10nF" (id 1) (at 59.69 48.26 90))
    (property "Footprint" "Capacitor_SMD:C_0402_1005Metric" (id 2) (at 63.5 51.1048 0)
      (effects (font (size 1.27 1.27)) hide)
    )
    (property "Datasheet" "~" (id 3) (at 59.69 52.07 0)
      (effects (font (size 1.27 1.27)) hide)
    )
    (property "LCSC" "C15195" (id 4) (at 59.69 52.07 0)
      (effects (font (size 1.27 1.27)) hide)
    )
    (pin "1" (uuid 5707dcf3-7183-437c-97ae-7ee39496b4f6))
    (pin "2" (uuid 55e0a33f-6f93-4150-81f1-8ec53ad0baa2))
  )

  (symbol (lib_id "power:GND") (at 66.04 52.07 90) (unit 1)
    (in_bom yes) (on_board yes) (fields_autoplaced)
    (uuid 71d0f46c-bc1f-47ba-ba6b-388d21b8442c)
    (property "Reference" "#PWR030" (id 0) (at 72.39 52.07 0)
      (effects (font (size 1.27 1.27)) hide)
    )
    (property "Value" "GND" (id 1) (at 69.85 52.7049 90)
      (effects (font (size 1.27 1.27)) (justify right))
    )
    (property "Footprint" "" (id 2) (at 66.04 52.07 0)
      (effects (font (size 1.27 1.27)) hide)
    )
    (property "Datasheet" "" (id 3) (at 66.04 52.07 0)
      (effects (font (size 1.27 1.27)) hide)
    )
    (pin "1" (uuid 37f4c9b8-254b-4441-a4c7-7f63425d95ab))
  )

  (symbol (lib_id "Connector:TestPoint") (at 232.41 83.82 0) (unit 1)
    (in_bom yes) (on_board yes)
    (uuid 768b81a1-a5b0-4c5a-9ff6-880ac929c568)
    (property "Reference" "TP4" (id 0) (at 231.14 77.47 0)
      (effects (font (size 1.27 1.27)) (justify left))
    )
    (property "Value" "TestPoint" (id 1) (at 234.95 81.7879 0)
      (effects (font (size 1.27 1.27)) (justify left) hide)
    )
    (property "Footprint" "TestPoint:TestPoint_Pad_D1.0mm" (id 2) (at 237.49 83.82 0)
      (effects (font (size 1.27 1.27)) hide)
    )
    (property "Datasheet" "~" (id 3) (at 237.49 83.82 0)
      (effects (font (size 1.27 1.27)) hide)
    )
    (pin "1" (uuid 4161ab09-dcb7-422c-a142-deff5370300d))
  )

  (symbol (lib_id "power:GND") (at 101.6 44.45 270) (unit 1)
    (in_bom yes) (on_board yes) (fields_autoplaced)
    (uuid 78544aab-bc4b-47f7-b40d-766b9b6ac156)
    (property "Reference" "#PWR032" (id 0) (at 95.25 44.45 0)
      (effects (font (size 1.27 1.27)) hide)
    )
    (property "Value" "GND" (id 1) (at 97.79 45.0849 90)
      (effects (font (size 1.27 1.27)) (justify right))
    )
    (property "Footprint" "" (id 2) (at 101.6 44.45 0)
      (effects (font (size 1.27 1.27)) hide)
    )
    (property "Datasheet" "" (id 3) (at 101.6 44.45 0)
      (effects (font (size 1.27 1.27)) hide)
    )
    (pin "1" (uuid fd434be5-4773-4140-8df4-9bf2f19c980a))
  )

  (symbol (lib_id "power:+5V") (at 255.27 52.07 0) (unit 1)
    (in_bom yes) (on_board yes) (fields_autoplaced)
    (uuid 7a85456e-0642-4686-ba88-4c3a7cfa33b0)
    (property "Reference" "#PWR0131" (id 0) (at 255.27 55.88 0)
      (effects (font (size 1.27 1.27)) hide)
    )
    (property "Value" "+5V" (id 1) (at 255.27 48.26 0))
    (property "Footprint" "" (id 2) (at 255.27 52.07 0)
      (effects (font (size 1.27 1.27)) hide)
    )
    (property "Datasheet" "" (id 3) (at 255.27 52.07 0)
      (effects (font (size 1.27 1.27)) hide)
    )
    (pin "1" (uuid e4071f87-7ddf-4fd1-90e9-4b7566abe142))
  )

  (symbol (lib_id "Connector:TestPoint") (at 219.71 64.77 0) (unit 1)
    (in_bom yes) (on_board yes)
    (uuid 833d9ff7-eae3-400f-9c85-25bab6eec801)
    (property "Reference" "TP3" (id 0) (at 218.44 59.69 0)
      (effects (font (size 1.27 1.27)) (justify left))
    )
    (property "Value" "TestPoint" (id 1) (at 222.25 62.7379 0)
      (effects (font (size 1.27 1.27)) (justify left) hide)
    )
    (property "Footprint" "TestPoint:TestPoint_Pad_D1.0mm" (id 2) (at 224.79 64.77 0)
      (effects (font (size 1.27 1.27)) hide)
    )
    (property "Datasheet" "~" (id 3) (at 224.79 64.77 0)
      (effects (font (size 1.27 1.27)) hide)
    )
    (pin "1" (uuid a627b902-ade7-4458-974a-368367bcaf1d))
  )

  (symbol (lib_id "power:+3V3") (at 105.41 106.68 0) (unit 1)
    (in_bom yes) (on_board yes) (fields_autoplaced)
    (uuid 89d20141-a0e8-4d45-82f4-1c2abbf3351f)
    (property "Reference" "#PWR049" (id 0) (at 105.41 110.49 0)
      (effects (font (size 1.27 1.27)) hide)
    )
    (property "Value" "+3V3" (id 1) (at 105.41 101.6 0))
    (property "Footprint" "" (id 2) (at 105.41 106.68 0)
      (effects (font (size 1.27 1.27)) hide)
    )
    (property "Datasheet" "" (id 3) (at 105.41 106.68 0)
      (effects (font (size 1.27 1.27)) hide)
    )
    (pin "1" (uuid b0f1972f-9975-47b5-8318-46e6ad72abaf))
  )

  (symbol (lib_id "power:GND") (at 255.27 80.01 0) (unit 1)
    (in_bom yes) (on_board yes) (fields_autoplaced)
    (uuid 8d319371-b5c0-404d-9a99-edea36a67cd4)
    (property "Reference" "#PWR0132" (id 0) (at 255.27 86.36 0)
      (effects (font (size 1.27 1.27)) hide)
    )
    (property "Value" "GND" (id 1) (at 255.27 85.09 0))
    (property "Footprint" "" (id 2) (at 255.27 80.01 0)
      (effects (font (size 1.27 1.27)) hide)
    )
    (property "Datasheet" "" (id 3) (at 255.27 80.01 0)
      (effects (font (size 1.27 1.27)) hide)
    )
    (pin "1" (uuid 65549055-f1c2-48eb-bc5c-082a6ddb89f8))
  )

  (symbol (lib_id "power:GND") (at 118.11 82.55 0) (unit 1)
    (in_bom yes) (on_board yes) (fields_autoplaced)
    (uuid 926c1f01-b018-4b50-a304-69c404841707)
    (property "Reference" "#PWR034" (id 0) (at 118.11 88.9 0)
      (effects (font (size 1.27 1.27)) hide)
    )
    (property "Value" "GND" (id 1) (at 118.11 87.63 0))
    (property "Footprint" "" (id 2) (at 118.11 82.55 0)
      (effects (font (size 1.27 1.27)) hide)
    )
    (property "Datasheet" "" (id 3) (at 118.11 82.55 0)
      (effects (font (size 1.27 1.27)) hide)
    )
    (pin "1" (uuid cadd4609-e7ec-4657-a57d-9dd66d16ad61))
  )

  (symbol (lib_id "Device:R") (at 219.71 73.66 0) (unit 1)
    (in_bom yes) (on_board yes) (fields_autoplaced)
    (uuid 937bdfcc-efcd-4a30-8ca4-bbcfd674db91)
    (property "Reference" "R14" (id 0) (at 222.25 72.3899 0)
      (effects (font (size 1.27 1.27)) (justify left))
    )
    (property "Value" "10K" (id 1) (at 222.25 74.9299 0)
      (effects (font (size 1.27 1.27)) (justify left))
    )
    (property "Footprint" "" (id 2) (at 217.932 73.66 90)
      (effects (font (size 1.27 1.27)) hide)
    )
    (property "Datasheet" "~" (id 3) (at 219.71 73.66 0)
      (effects (font (size 1.27 1.27)) hide)
    )
    (property "LCSC" "C25744" (id 4) (at 219.71 73.66 0)
      (effects (font (size 1.27 1.27)) hide)
    )
    (pin "1" (uuid 8fdaa659-e193-400d-bdcf-eed518b6f97a))
    (pin "2" (uuid 8f04555f-4bad-4361-a93c-6610dbc24c69))
  )

  (symbol (lib_id "Device:C") (at 39.37 41.91 90) (unit 1)
    (in_bom yes) (on_board yes) (fields_autoplaced)
    (uuid a488637f-cdaa-4a5e-88ff-3e4c5197667b)
    (property "Reference" "C18" (id 0) (at 39.37 34.29 90))
    (property "Value" "2.2uF" (id 1) (at 39.37 36.83 90))
    (property "Footprint" "Capacitor_SMD:C_0402_1005Metric" (id 2) (at 43.18 40.9448 0)
      (effects (font (size 1.27 1.27)) hide)
    )
    (property "Datasheet" "~" (id 3) (at 39.37 41.91 0)
      (effects (font (size 1.27 1.27)) hide)
    )
    (property "LCSC" "C23733" (id 4) (at 39.37 41.91 90)
      (effects (font (size 1.27 1.27)) hide)
    )
    (pin "1" (uuid 3e10351c-7c34-484a-b5bc-ab7921b9aff8))
    (pin "2" (uuid 5ae099cf-bb97-4078-bb29-3cfcd096ab0f))
  )

  (symbol (lib_id "Device:C") (at 39.37 52.07 90) (unit 1)
    (in_bom yes) (on_board yes) (fields_autoplaced)
    (uuid adfa9d5a-eb56-4642-be3a-08338a0398cc)
    (property "Reference" "C19" (id 0) (at 39.37 45.72 90))
    (property "Value" "0.1uF" (id 1) (at 39.37 48.26 90))
    (property "Footprint" "Capacitor_SMD:C_0402_1005Metric" (id 2) (at 43.18 51.1048 0)
      (effects (font (size 1.27 1.27)) hide)
    )
    (property "Datasheet" "~" (id 3) (at 39.37 52.07 0)
      (effects (font (size 1.27 1.27)) hide)
    )
    (property "LCSC" "C1525" (id 4) (at 39.37 52.07 90)
      (effects (font (size 1.27 1.27)) hide)
    )
    (pin "1" (uuid f942c586-5ec7-4875-9840-6b7d201e9fb2))
    (pin "2" (uuid 5192381f-4a5b-4940-bdc6-03c4512c8fdb))
  )

  (symbol (lib_id "power:GND") (at 134.62 54.61 90) (unit 1)
    (in_bom yes) (on_board yes) (fields_autoplaced)
    (uuid b8e3b3a4-c4de-4b8a-aa6f-32718515aa76)
    (property "Reference" "#PWR035" (id 0) (at 140.97 54.61 0)
      (effects (font (size 1.27 1.27)) hide)
    )
    (property "Value" "GND" (id 1) (at 138.43 55.2449 90)
      (effects (font (size 1.27 1.27)) (justify right))
    )
    (property "Footprint" "" (id 2) (at 134.62 54.61 0)
      (effects (font (size 1.27 1.27)) hide)
    )
    (property "Datasheet" "" (id 3) (at 134.62 54.61 0)
      (effects (font (size 1.27 1.27)) hide)
    )
    (pin "1" (uuid 93b587cd-29f3-4abe-8cc0-db5bfbd97524))
  )

  (symbol (lib_id "power:+3V3") (at 100.33 71.12 90) (unit 1)
    (in_bom yes) (on_board yes) (fields_autoplaced)
    (uuid bdc52982-d830-4b33-aae8-a297c9d28e69)
    (property "Reference" "#PWR031" (id 0) (at 104.14 71.12 0)
      (effects (font (size 1.27 1.27)) hide)
    )
    (property "Value" "+3V3" (id 1) (at 96.52 71.1199 90)
      (effects (font (size 1.27 1.27)) (justify left))
    )
    (property "Footprint" "" (id 2) (at 100.33 71.12 0)
      (effects (font (size 1.27 1.27)) hide)
    )
    (property "Datasheet" "" (id 3) (at 100.33 71.12 0)
      (effects (font (size 1.27 1.27)) hide)
    )
    (pin "1" (uuid dcfbf0d2-5a1b-47b5-8456-23f0dec4441c))
  )

  (symbol (lib_id "Connector_Generic:Conn_01x10") (at 264.16 64.77 0) (unit 1)
    (in_bom yes) (on_board yes) (fields_autoplaced)
    (uuid c40da08b-fdca-4643-b54c-5c6cbd8d0663)
    (property "Reference" "J9" (id 0) (at 266.7 65.4049 0)
      (effects (font (size 1.27 1.27)) (justify left))
    )
    (property "Value" "Conn_01x10" (id 1) (at 266.7 67.9449 0)
      (effects (font (size 1.27 1.27)) (justify left))
    )
    (property "Footprint" "Connector_JST:JST_GH_SM10B-GHS-TB_1x10-1MP_P1.25mm_Horizontal" (id 2) (at 264.16 64.77 0)
      (effects (font (size 1.27 1.27)) hide)
    )
    (property "Datasheet" "~" (id 3) (at 264.16 64.77 0)
      (effects (font (size 1.27 1.27)) hide)
    )
    (pin "1" (uuid 85520156-764b-4e15-a01b-94fee7c04f83))
    (pin "10" (uuid fa7090f1-5489-4f36-80ed-4f36f8388132))
    (pin "2" (uuid e4ee9fc7-1054-4b85-ae4e-387a61d99190))
    (pin "3" (uuid e2bd07f2-0879-4bbf-94d2-6f371ac1344e))
    (pin "4" (uuid 1a9b9788-ae34-44c1-b0df-fcea63e9948e))
    (pin "5" (uuid 0d288936-caa4-4d03-8670-74e069280b9c))
    (pin "6" (uuid 168660b2-4a0d-4cba-9178-6169909044f4))
    (pin "7" (uuid d8569f03-6a44-4d2c-9a44-c556d4a95776))
    (pin "8" (uuid 41167837-c897-4605-971f-1ef9f71b4bfa))
    (pin "9" (uuid 21f86bdf-b5df-40fa-a589-8f81dc69fab7))
  )

  (symbol (lib_id "power:GND") (at 49.53 77.47 0) (unit 1)
    (in_bom yes) (on_board yes) (fields_autoplaced)
    (uuid cd0a208f-dd60-45be-8584-4004a1415d83)
    (property "Reference" "#PWR029" (id 0) (at 49.53 83.82 0)
      (effects (font (size 1.27 1.27)) hide)
    )
    (property "Value" "GND" (id 1) (at 49.53 82.55 0))
    (property "Footprint" "" (id 2) (at 49.53 77.47 0)
      (effects (font (size 1.27 1.27)) hide)
    )
    (property "Datasheet" "" (id 3) (at 49.53 77.47 0)
      (effects (font (size 1.27 1.27)) hide)
    )
    (pin "1" (uuid c96c9e2c-8e6b-47fe-b673-082ce35dfc77))
  )

  (symbol (lib_id "power:+5V") (at 229.87 59.69 0) (unit 1)
    (in_bom yes) (on_board yes) (fields_autoplaced)
    (uuid cf1883e4-3d5c-44e5-a546-d5136fe864b4)
    (property "Reference" "#PWR047" (id 0) (at 229.87 63.5 0)
      (effects (font (size 1.27 1.27)) hide)
    )
    (property "Value" "+5V" (id 1) (at 229.87 54.61 0))
    (property "Footprint" "" (id 2) (at 229.87 59.69 0)
      (effects (font (size 1.27 1.27)) hide)
    )
    (property "Datasheet" "" (id 3) (at 229.87 59.69 0)
      (effects (font (size 1.27 1.27)) hide)
    )
    (pin "1" (uuid a19cfa28-0c97-4565-bf3b-ab3b90276a53))
  )

  (symbol (lib_id "Device:C") (at 128.27 54.61 90) (unit 1)
    (in_bom yes) (on_board yes) (fields_autoplaced)
    (uuid cf3ec43b-a1fb-4df4-ad1f-0ed4c7ce1d1e)
    (property "Reference" "C23" (id 0) (at 128.27 46.99 90))
    (property "Value" "0.1uF" (id 1) (at 128.27 49.53 90))
    (property "Footprint" "Capacitor_SMD:C_0402_1005Metric" (id 2) (at 132.08 53.6448 0)
      (effects (font (size 1.27 1.27)) hide)
    )
    (property "Datasheet" "~" (id 3) (at 128.27 54.61 0)
      (effects (font (size 1.27 1.27)) hide)
    )
    (property "LCSC" "C1525" (id 4) (at 128.27 54.61 0)
      (effects (font (size 1.27 1.27)) hide)
    )
    (pin "1" (uuid 7345d533-053a-49de-9eef-e53b9fe0bad3))
    (pin "2" (uuid 5f139451-64e6-4e01-81c2-4e62ffc84605))
  )

  (symbol (lib_id "ICM42605:ICM42605") (at 49.53 64.77 0) (unit 1)
    (in_bom yes) (on_board yes) (fields_autoplaced)
    (uuid d2014921-d8ad-427e-a8be-77eae18c8564)
    (property "Reference" "U4" (id 0) (at 51.5494 74.93 0)
      (effects (font (size 1.27 1.27)) (justify left))
    )
    (property "Value" "ICM42605" (id 1) (at 51.5494 77.47 0)
      (effects (font (size 1.27 1.27)) (justify left))
    )
    (property "Footprint" "Package_LGA:LGA-14_3x2.5mm_P0.5mm_LayoutBorder3x4y" (id 2) (at 27.94 33.02 0)
      (effects (font (size 1.27 1.27)) hide)
    )
    (property "Datasheet" "" (id 3) (at 27.94 33.02 0)
      (effects (font (size 1.27 1.27)) hide)
    )
    (pin "1" (uuid c5559c7f-8b52-4b9b-853a-9edd44c66ce4))
    (pin "10" (uuid 99ac6486-9794-46da-a542-31726f6c53f8))
    (pin "11" (uuid 73e9a5fd-1522-4928-bae1-cf1904fb3ac6))
    (pin "12" (uuid 0fcf9a1e-aa10-4ec1-9122-741da4b5c03d))
    (pin "13" (uuid 32a4d257-1594-471d-9935-f674e9a2df6f))
    (pin "14" (uuid 7d93fcf4-39ba-4936-94b6-d1ab32d0f344))
    (pin "2" (uuid e69317cd-42a5-487e-a936-6c2354651372))
    (pin "3" (uuid f359fce7-a3cf-4016-bad9-7cc964dc849e))
    (pin "4" (uuid 4226d6b7-91fb-4f3c-8faf-45766a9fc25a))
    (pin "5" (uuid e4315bd1-27c6-41b1-aa6d-bbd9c3653639))
    (pin "6" (uuid f2436e0a-27a6-4baf-ba0a-8b4ba1537c3a))
    (pin "7" (uuid 24a32602-8082-4c8a-895e-c500cb3ed839))
    (pin "8" (uuid 90a98055-c96a-43d1-bf15-b08e526ece9f))
    (pin "9" (uuid 53d2146b-ab73-4faa-aed4-422e8ea13599))
  )

  (symbol (lib_id "Connector_Generic:Conn_01x08") (at 113.03 116.84 0) (unit 1)
    (in_bom yes) (on_board yes) (fields_autoplaced)
    (uuid d221c811-4bb3-412a-affe-7ed0bbfe6f70)
    (property "Reference" "J8" (id 0) (at 115.57 116.8399 0)
      (effects (font (size 1.27 1.27)) (justify left))
    )
    (property "Value" "Conn_01x08" (id 1) (at 115.57 119.3799 0)
      (effects (font (size 1.27 1.27)) (justify left))
    )
    (property "Footprint" "Connector_PinHeader_2.54mm:PinHeader_1x08_P2.54mm_Vertical" (id 2) (at 113.03 116.84 0)
      (effects (font (size 1.27 1.27)) hide)
    )
    (property "Datasheet" "~" (id 3) (at 113.03 116.84 0)
      (effects (font (size 1.27 1.27)) hide)
    )
    (pin "1" (uuid f2025426-80ae-4fe9-b775-b67fb2629ff8))
    (pin "2" (uuid f2e6910a-8f2d-4440-88af-e4b84767aca2))
    (pin "3" (uuid 02acdfd6-4596-4d48-86fe-59905c34c736))
    (pin "4" (uuid 7b1aa27d-b392-4c93-9f0b-4aebedf478a0))
    (pin "5" (uuid 994684c0-6380-4ae8-8f36-a8271a7c94b8))
    (pin "6" (uuid 7fe99559-a9c4-4603-9dc3-ac3ac5c736f5))
    (pin "7" (uuid 85e5109e-92f7-4a2c-8147-8d29215ea4a7))
    (pin "8" (uuid dae0b3f1-4371-4733-b109-94d1643c9fae))
  )

  (symbol (lib_id "Device:C") (at 107.95 54.61 90) (unit 1)
    (in_bom yes) (on_board yes) (fields_autoplaced)
    (uuid d6960ff4-c38e-4296-b9dd-7af25fd77ff5)
    (property "Reference" "C22" (id 0) (at 107.95 48.26 90))
    (property "Value" "0.1uF" (id 1) (at 107.95 50.8 90))
    (property "Footprint" "Capacitor_SMD:C_0402_1005Metric" (id 2) (at 111.76 53.6448 0)
      (effects (font (size 1.27 1.27)) hide)
    )
    (property "Datasheet" "~" (id 3) (at 107.95 54.61 0)
      (effects (font (size 1.27 1.27)) hide)
    )
    (property "LCSC" "C1525" (id 4) (at 107.95 54.61 90)
      (effects (font (size 1.27 1.27)) hide)
    )
    (pin "1" (uuid 886885ea-4ee6-4086-a261-b6a840ee437d))
    (pin "2" (uuid 21853576-d215-4aaf-9f69-760fe04a20c7))
  )

  (symbol (lib_id "power:GND") (at 33.02 52.07 270) (unit 1)
    (in_bom yes) (on_board yes) (fields_autoplaced)
    (uuid da39f1b5-aa1d-40e8-bd17-4dd627a0d9ff)
    (property "Reference" "#PWR028" (id 0) (at 26.67 52.07 0)
      (effects (font (size 1.27 1.27)) hide)
    )
    (property "Value" "GND" (id 1) (at 29.21 52.7049 90)
      (effects (font (size 1.27 1.27)) (justify right))
    )
    (property "Footprint" "" (id 2) (at 33.02 52.07 0)
      (effects (font (size 1.27 1.27)) hide)
    )
    (property "Datasheet" "" (id 3) (at 33.02 52.07 0)
      (effects (font (size 1.27 1.27)) hide)
    )
    (pin "1" (uuid efd0090d-0f84-44cb-bc39-8903c7e35401))
  )

  (symbol (lib_id "power:GND") (at 232.41 86.36 0) (unit 1)
    (in_bom yes) (on_board yes) (fields_autoplaced)
    (uuid e137a020-d9a2-4c12-aa87-823cb0c2e8ba)
    (property "Reference" "#PWR048" (id 0) (at 232.41 92.71 0)
      (effects (font (size 1.27 1.27)) hide)
    )
    (property "Value" "GND" (id 1) (at 232.41 91.44 0))
    (property "Footprint" "" (id 2) (at 232.41 86.36 0)
      (effects (font (size 1.27 1.27)) hide)
    )
    (property "Datasheet" "" (id 3) (at 232.41 86.36 0)
      (effects (font (size 1.27 1.27)) hide)
    )
    (pin "1" (uuid 49412cd9-4242-4c64-8601-d9ae3fd9fdf9))
  )

  (symbol (lib_id "LIS2MDL:LIS2MDLTR") (at 118.11 67.31 0) (unit 1)
    (in_bom yes) (on_board yes)
    (uuid ec293728-eacb-4832-b81d-05e55b5101e3)
    (property "Reference" "U5" (id 0) (at 120.65 76.2 0)
      (effects (font (size 1.27 1.27)) (justify left))
    )
    (property "Value" "LIS2MDLTR" (id 1) (at 120.65 78.74 0)
      (effects (font (size 1.27 1.27)) (justify left))
    )
    (property "Footprint" "Package_LGA:LGA-12_2x2mm_P0.5mm" (id 2) (at 96.52 35.56 0)
      (effects (font (size 1.27 1.27)) hide)
    )
    (property "Datasheet" "" (id 3) (at 96.52 35.56 0)
      (effects (font (size 1.27 1.27)) hide)
    )
    (property "LCSC" "C919695" (id 4) (at 118.11 67.31 0)
      (effects (font (size 1.27 1.27)) hide)
    )
    (pin "1" (uuid 76cec873-43ff-4923-be69-d6b4035b0d9b))
    (pin "10" (uuid 01e64fa8-c377-4fbf-9462-6f1ee162caf5))
    (pin "11" (uuid b89db679-c46b-4c5b-86a2-4d3e1ac0a802))
    (pin "11" (uuid b89db679-c46b-4c5b-86a2-4d3e1ac0a802))
    (pin "12" (uuid 680ed124-c93d-4e1b-b4a2-eacee0dfebbe))
    (pin "3" (uuid 229aca0d-bbe5-459b-8b24-fa79867f72d9))
    (pin "4" (uuid 8e9d24d4-8182-49b7-a590-b6a363acd892))
    (pin "5" (uuid f3283fbf-1747-4380-88de-fc7c9f03933b))
    (pin "6" (uuid b52038b8-a341-44ef-a8b1-ca80e1d065de))
    (pin "7" (uuid 5ea77e59-35bd-4224-abda-1e278b820cb4))
    (pin "8" (uuid 460d38ae-0628-43cd-b822-399089cea0d4))
    (pin "9" (uuid c9b34a24-21ab-4476-96c7-81e1ed941874))
  )

  (symbol (lib_id "Device:C") (at 139.7 63.5 90) (unit 1)
    (in_bom yes) (on_board yes)
    (uuid eec51c8e-15cc-4596-9954-b5412318964e)
    (property "Reference" "C24" (id 0) (at 139.7 59.69 90))
    (property "Value" "220nF" (id 1) (at 139.7 67.31 90))
    (property "Footprint" "Capacitor_SMD:C_0402_1005Metric" (id 2) (at 143.51 62.5348 0)
      (effects (font (size 1.27 1.27)) hide)
    )
    (property "Datasheet" "~" (id 3) (at 139.7 63.5 0)
      (effects (font (size 1.27 1.27)) hide)
    )
    (property "LCSC" "C16772" (id 4) (at 139.7 63.5 0)
      (effects (font (size 1.27 1.27)) hide)
    )
    (pin "1" (uuid 10d4044d-4656-488b-93d7-9a8b7e93a742))
    (pin "2" (uuid 516646bc-bae6-4fd2-a9a5-429eae2accb6))
  )

  (symbol (lib_id "power:GND") (at 105.41 129.54 0) (unit 1)
    (in_bom yes) (on_board yes) (fields_autoplaced)
    (uuid f559dae3-9a8d-4077-946c-7f0f2216a8e1)
    (property "Reference" "#PWR050" (id 0) (at 105.41 135.89 0)
      (effects (font (size 1.27 1.27)) hide)
    )
    (property "Value" "GND" (id 1) (at 105.41 134.62 0))
    (property "Footprint" "" (id 2) (at 105.41 129.54 0)
      (effects (font (size 1.27 1.27)) hide)
    )
    (property "Datasheet" "" (id 3) (at 105.41 129.54 0)
      (effects (font (size 1.27 1.27)) hide)
    )
    (pin "1" (uuid 8fa5046a-6d48-4f70-97a9-b9183ce5602f))
  )
)
