(kicad_symbol_lib (version 20210619) (generator kicad_symbol_editor)
  (symbol "Regulators:HX6211A332MR" (in_bom yes) (on_board yes)
    (property "Reference" "U" (id 0) (at 0 7.62 0)
      (effects (font (size 1.27 1.27)))
    )
    (property "Value" "HX6211A332MR" (id 1) (at 0 5.08 0)
      (effects (font (size 1.27 1.27)))
    )
    (property "Footprint" "" (id 2) (at -22.86 11.43 0)
      (effects (font (size 1.27 1.27)) hide)
    )
    (property "Datasheet" "" (id 3) (at -22.86 11.43 0)
      (effects (font (size 1.27 1.27)) hide)
    )
    (symbol "HX6211A332MR_0_0"
      (pin power_in line (at -8.89 1.27 0) (length 2.54)
        (name "VIN" (effects (font (size 1.27 1.27))))
        (number "1" (effects (font (size 1.27 1.27))))
      )
      (pin power_in line (at 8.89 -1.27 180) (length 2.54)
        (name "GND" (effects (font (size 1.27 1.27))))
        (number "2" (effects (font (size 1.27 1.27))))
      )
      (pin input line (at -8.89 -1.27 0) (length 2.54)
        (name "CE" (effects (font (size 1.27 1.27))))
        (number "3" (effects (font (size 1.27 1.27))))
      )
      (pin power_out line (at 8.89 1.27 180) (length 2.54)
        (name "VOUT" (effects (font (size 1.27 1.27))))
        (number "5" (effects (font (size 1.27 1.27))))
      )
    )
    (symbol "HX6211A332MR_0_1"
      (rectangle (start -6.35 3.81) (end 6.35 -3.81)
        (stroke (width 0.1524)) (fill (type none))
      )
    )
  )
  (symbol "Regulators:LDK120M18R" (in_bom yes) (on_board yes)
    (property "Reference" "U" (id 0) (at 0 8.89 0)
      (effects (font (size 1.27 1.27)))
    )
    (property "Value" "LDK120M18R" (id 1) (at 0 6.35 0)
      (effects (font (size 1.27 1.27)))
    )
    (property "Footprint" "" (id 2) (at -15.24 16.51 0)
      (effects (font (size 1.27 1.27)) hide)
    )
    (property "Datasheet" "" (id 3) (at -15.24 16.51 0)
      (effects (font (size 1.27 1.27)) hide)
    )
    (symbol "LDK120M18R_0_1"
      (rectangle (start -6.35 5.08) (end 6.35 -5.08)
        (stroke (width 0.1524)) (fill (type none))
      )
    )
    (symbol "LDK120M18R_1_1"
      (pin power_in line (at -8.89 2.54 0) (length 2.54)
        (name "VIN" (effects (font (size 1.27 1.27))))
        (number "1" (effects (font (size 1.27 1.27))))
      )
      (pin power_in line (at -8.89 -2.54 0) (length 2.54)
        (name "GND" (effects (font (size 1.27 1.27))))
        (number "2" (effects (font (size 1.27 1.27))))
      )
      (pin input line (at -8.89 0 0) (length 2.54)
        (name "EN" (effects (font (size 1.27 1.27))))
        (number "3" (effects (font (size 1.27 1.27))))
      )
      (pin passive line (at 8.89 -2.54 180) (length 2.54)
        (name "BYP" (effects (font (size 1.27 1.27))))
        (number "4" (effects (font (size 1.27 1.27))))
      )
      (pin power_out line (at 8.89 2.54 180) (length 2.54)
        (name "VOUT" (effects (font (size 1.27 1.27))))
        (number "5" (effects (font (size 1.27 1.27))))
      )
    )
  )
)
