(kicad_symbol_lib (version 20211014) (generator kicad_symbol_editor)
  (symbol "ICM42605" (in_bom yes) (on_board yes)
    (property "Reference" "U" (id 0) (at -7.62 8.89 0)
      (effects (font (size 1.27 1.27)))
    )
    (property "Value" "ICM42605" (id 1) (at 7.62 8.89 0)
      (effects (font (size 1.27 1.27)))
    )
    (property "Footprint" "Package_LGA:LGA-14_3x2.5mm_P0.5mm_LayoutBorder3x4y" (id 2) (at -21.59 31.75 0)
      (effects (font (size 1.27 1.27)) hide)
    )
    (property "Datasheet" "" (id 3) (at -21.59 31.75 0)
      (effects (font (size 1.27 1.27)) hide)
    )
    (symbol "ICM42605_0_1"
      (rectangle (start -12.7 7.62) (end 12.7 -7.62)
        (stroke (width 0.1524) (type default) (color 0 0 0 0))
        (fill (type background))
      )
    )
    (symbol "ICM42605_1_1"
      (pin bidirectional line (at -15.24 0 0) (length 2.54)
        (name "AD0/SDO" (effects (font (size 1.27 1.27))))
        (number "1" (effects (font (size 1.27 1.27))))
      )
      (pin passive line (at 15.24 -5.08 180) (length 2.54)
        (name "RESV" (effects (font (size 1.27 1.27))))
        (number "10" (effects (font (size 1.27 1.27))))
      )
      (pin passive line (at 15.24 -5.08 180) (length 2.54) hide
        (name "RESV" (effects (font (size 1.27 1.27))))
        (number "11" (effects (font (size 1.27 1.27))))
      )
      (pin input line (at -15.24 -2.54 0) (length 2.54)
        (name "nCS" (effects (font (size 1.27 1.27))))
        (number "12" (effects (font (size 1.27 1.27))))
      )
      (pin input line (at -15.24 5.08 0) (length 2.54)
        (name "SCL/SCLK" (effects (font (size 1.27 1.27))))
        (number "13" (effects (font (size 1.27 1.27))))
      )
      (pin bidirectional line (at -15.24 2.54 0) (length 2.54)
        (name "SDA/SDI" (effects (font (size 1.27 1.27))))
        (number "14" (effects (font (size 1.27 1.27))))
      )
      (pin passive line (at 15.24 0 180) (length 2.54)
        (name "RESV" (effects (font (size 1.27 1.27))))
        (number "2" (effects (font (size 1.27 1.27))))
      )
      (pin passive line (at 15.24 0 180) (length 2.54) hide
        (name "RESV" (effects (font (size 1.27 1.27))))
        (number "3" (effects (font (size 1.27 1.27))))
      )
      (pin output line (at -15.24 -5.08 0) (length 2.54)
        (name "INT" (effects (font (size 1.27 1.27))))
        (number "4" (effects (font (size 1.27 1.27))))
      )
      (pin power_in line (at 1.27 10.16 270) (length 2.54)
        (name "VDDIO" (effects (font (size 1.27 1.27))))
        (number "5" (effects (font (size 1.27 1.27))))
      )
      (pin power_in line (at 0 -10.16 90) (length 2.54)
        (name "GND" (effects (font (size 1.27 1.27))))
        (number "6" (effects (font (size 1.27 1.27))))
      )
      (pin passive line (at 15.24 -2.54 180) (length 2.54)
        (name "RESV" (effects (font (size 1.27 1.27))))
        (number "7" (effects (font (size 1.27 1.27))))
      )
      (pin power_in line (at -1.27 10.16 270) (length 2.54)
        (name "VDD" (effects (font (size 1.27 1.27))))
        (number "8" (effects (font (size 1.27 1.27))))
      )
      (pin output line (at 15.24 5.08 180) (length 2.54)
        (name "FSYNC" (effects (font (size 1.27 1.27))))
        (number "9" (effects (font (size 1.27 1.27))))
      )
    )
  )
)
