%TF.GenerationSoftware,KiCad,Pcbnew,(6.0.4)*%
%TF.CreationDate,2022-04-19T00:11:33-07:00*%
%TF.ProjectId,antenna-tracker-hat,616e7465-6e6e-4612-9d74-7261636b6572,rev?*%
%TF.SameCoordinates,Original*%
%TF.FileFunction,Paste,Top*%
%TF.FilePolarity,Positive*%
%FSLAX46Y46*%
G04 Gerber Fmt 4.6, Leading zero omitted, Abs format (unit mm)*
G04 Created by KiCad (PCBNEW (6.0.4)) date 2022-04-19 00:11:33*
%MOMM*%
%LPD*%
G01*
G04 APERTURE LIST*
G04 Aperture macros list*
%AMRoundRect*
0 Rectangle with rounded corners*
0 $1 Rounding radius*
0 $2 $3 $4 $5 $6 $7 $8 $9 X,Y pos of 4 corners*
0 Add a 4 corners polygon primitive as box body*
4,1,4,$2,$3,$4,$5,$6,$7,$8,$9,$2,$3,0*
0 Add four circle primitives for the rounded corners*
1,1,$1+$1,$2,$3*
1,1,$1+$1,$4,$5*
1,1,$1+$1,$6,$7*
1,1,$1+$1,$8,$9*
0 Add four rect primitives between the rounded corners*
20,1,$1+$1,$2,$3,$4,$5,0*
20,1,$1+$1,$4,$5,$6,$7,0*
20,1,$1+$1,$6,$7,$8,$9,0*
20,1,$1+$1,$8,$9,$2,$3,0*%
%AMFreePoly0*
4,1,48,0.036020,0.199191,0.037970,0.199714,0.040958,0.198321,0.057086,0.195477,0.069630,0.184951,0.084467,0.178033,0.290533,-0.028033,0.293203,-0.031847,0.294953,-0.032857,0.296081,-0.035957,0.305473,-0.049370,0.306900,-0.065680,0.312500,-0.081066,0.312500,-0.125000,0.310782,-0.134742,0.311361,-0.138024,0.309695,-0.140910,0.307977,-0.150652,0.295451,-0.165579,0.285709,-0.182453,
0.279350,-0.184767,0.275000,-0.189952,0.255809,-0.193336,0.237500,-0.200000,-0.237500,-0.200000,-0.247242,-0.198282,-0.250524,-0.198861,-0.253410,-0.197195,-0.263152,-0.195477,-0.278079,-0.182951,-0.294953,-0.173209,-0.297267,-0.166850,-0.302452,-0.162500,-0.305836,-0.143309,-0.312500,-0.125000,-0.312500,0.125000,-0.310782,0.134742,-0.311361,0.138024,-0.309695,0.140910,-0.307977,0.150652,
-0.295451,0.165579,-0.285709,0.182453,-0.279350,0.184767,-0.275000,0.189952,-0.255809,0.193336,-0.237500,0.200000,0.031434,0.200000,0.036020,0.199191,0.036020,0.199191,$1*%
%AMFreePoly1*
4,1,48,0.247242,0.198282,0.250524,0.198861,0.253410,0.197195,0.263152,0.195477,0.278079,0.182951,0.294953,0.173209,0.297267,0.166850,0.302452,0.162500,0.305836,0.143309,0.312500,0.125000,0.312500,0.081066,0.311691,0.076480,0.312214,0.074529,0.310820,0.071540,0.307977,0.055414,0.297452,0.042871,0.290533,0.028033,0.084467,-0.178033,0.080653,-0.180703,0.079643,-0.182453,
0.076543,-0.183581,0.063130,-0.192973,0.046819,-0.194400,0.031434,-0.200000,-0.237500,-0.200000,-0.247242,-0.198282,-0.250524,-0.198861,-0.253410,-0.197195,-0.263152,-0.195477,-0.278079,-0.182951,-0.294953,-0.173209,-0.297267,-0.166850,-0.302452,-0.162500,-0.305836,-0.143309,-0.312500,-0.125000,-0.312500,0.125000,-0.310782,0.134742,-0.311361,0.138024,-0.309695,0.140910,-0.307977,0.150652,
-0.295451,0.165579,-0.285709,0.182453,-0.279350,0.184767,-0.275000,0.189952,-0.255809,0.193336,-0.237500,0.200000,0.237500,0.200000,0.247242,0.198282,0.247242,0.198282,$1*%
%AMFreePoly2*
4,1,48,0.134742,0.310782,0.138024,0.311361,0.140910,0.309695,0.150652,0.307977,0.165579,0.295451,0.182453,0.285709,0.184767,0.279350,0.189952,0.275000,0.193336,0.255809,0.200000,0.237500,0.200000,-0.237500,0.198282,-0.247242,0.198861,-0.250524,0.197195,-0.253410,0.195477,-0.263152,0.182951,-0.278079,0.173209,-0.294953,0.166850,-0.297267,0.162500,-0.302452,0.143309,-0.305836,
0.125000,-0.312500,-0.125000,-0.312500,-0.134742,-0.310782,-0.138024,-0.311361,-0.140910,-0.309695,-0.150652,-0.307977,-0.165579,-0.295451,-0.182453,-0.285709,-0.184767,-0.279350,-0.189952,-0.275000,-0.193336,-0.255809,-0.200000,-0.237500,-0.200000,0.031434,-0.199191,0.036020,-0.199714,0.037970,-0.198321,0.040958,-0.195477,0.057086,-0.184951,0.069630,-0.178033,0.084467,0.028033,0.290533,
0.031847,0.293203,0.032857,0.294953,0.035957,0.296081,0.049370,0.305473,0.065680,0.306900,0.081066,0.312500,0.125000,0.312500,0.134742,0.310782,0.134742,0.310782,$1*%
%AMFreePoly3*
4,1,48,-0.076480,0.311691,-0.074530,0.312214,-0.071542,0.310821,-0.055414,0.307977,-0.042870,0.297451,-0.028033,0.290533,0.178033,0.084467,0.180703,0.080653,0.182453,0.079643,0.183581,0.076543,0.192973,0.063130,0.194400,0.046820,0.200000,0.031434,0.200000,-0.237500,0.198282,-0.247242,0.198861,-0.250524,0.197195,-0.253410,0.195477,-0.263152,0.182951,-0.278079,0.173209,-0.294953,
0.166850,-0.297267,0.162500,-0.302452,0.143309,-0.305836,0.125000,-0.312500,-0.125000,-0.312500,-0.134742,-0.310782,-0.138024,-0.311361,-0.140910,-0.309695,-0.150652,-0.307977,-0.165579,-0.295451,-0.182453,-0.285709,-0.184767,-0.279350,-0.189952,-0.275000,-0.193336,-0.255809,-0.200000,-0.237500,-0.200000,0.237500,-0.198282,0.247242,-0.198861,0.250524,-0.197195,0.253410,-0.195477,0.263152,
-0.182951,0.278079,-0.173209,0.294953,-0.166850,0.297267,-0.162500,0.302452,-0.143309,0.305836,-0.125000,0.312500,-0.081066,0.312500,-0.076480,0.311691,-0.076480,0.311691,$1*%
%AMFreePoly4*
4,1,48,0.247242,0.198282,0.250524,0.198861,0.253410,0.197195,0.263152,0.195477,0.278079,0.182951,0.294953,0.173209,0.297267,0.166850,0.302452,0.162500,0.305836,0.143309,0.312500,0.125000,0.312500,-0.125000,0.310782,-0.134742,0.311361,-0.138024,0.309695,-0.140910,0.307977,-0.150652,0.295451,-0.165579,0.285709,-0.182453,0.279350,-0.184767,0.275000,-0.189952,0.255809,-0.193336,
0.237500,-0.200000,-0.031434,-0.200000,-0.036020,-0.199191,-0.037971,-0.199714,-0.040960,-0.198320,-0.057086,-0.195477,-0.069629,-0.184952,-0.084467,-0.178033,-0.290533,0.028033,-0.293203,0.031847,-0.294953,0.032857,-0.296081,0.035957,-0.305473,0.049370,-0.306900,0.065681,-0.312500,0.081066,-0.312500,0.125000,-0.310782,0.134742,-0.311361,0.138024,-0.309695,0.140910,-0.307977,0.150652,
-0.295451,0.165579,-0.285709,0.182453,-0.279350,0.184767,-0.275000,0.189952,-0.255809,0.193336,-0.237500,0.200000,0.237500,0.200000,0.247242,0.198282,0.247242,0.198282,$1*%
%AMFreePoly5*
4,1,48,0.247242,0.198282,0.250524,0.198861,0.253410,0.197195,0.263152,0.195477,0.278079,0.182951,0.294953,0.173209,0.297267,0.166850,0.302452,0.162500,0.305836,0.143309,0.312500,0.125000,0.312500,-0.125000,0.310782,-0.134742,0.311361,-0.138024,0.309695,-0.140910,0.307977,-0.150652,0.295451,-0.165579,0.285709,-0.182453,0.279350,-0.184767,0.275000,-0.189952,0.255809,-0.193336,
0.237500,-0.200000,-0.237500,-0.200000,-0.247242,-0.198282,-0.250524,-0.198861,-0.253410,-0.197195,-0.263152,-0.195477,-0.278079,-0.182951,-0.294953,-0.173209,-0.297267,-0.166850,-0.302452,-0.162500,-0.305836,-0.143309,-0.312500,-0.125000,-0.312500,-0.081066,-0.311691,-0.076480,-0.312214,-0.074530,-0.310821,-0.071542,-0.307977,-0.055414,-0.297451,-0.042870,-0.290533,-0.028033,-0.084467,0.178033,
-0.080653,0.180703,-0.079643,0.182453,-0.076543,0.183581,-0.063130,0.192973,-0.046820,0.194400,-0.031434,0.200000,0.237500,0.200000,0.247242,0.198282,0.247242,0.198282,$1*%
%AMFreePoly6*
4,1,48,0.134742,0.310782,0.138024,0.311361,0.140910,0.309695,0.150652,0.307977,0.165579,0.295451,0.182453,0.285709,0.184767,0.279350,0.189952,0.275000,0.193336,0.255809,0.200000,0.237500,0.200000,-0.031434,0.199191,-0.036020,0.199714,-0.037971,0.198320,-0.040960,0.195477,-0.057086,0.184952,-0.069629,0.178033,-0.084467,-0.028033,-0.290533,-0.031847,-0.293203,-0.032857,-0.294953,
-0.035957,-0.296081,-0.049370,-0.305473,-0.065681,-0.306900,-0.081066,-0.312500,-0.125000,-0.312500,-0.134742,-0.310782,-0.138024,-0.311361,-0.140910,-0.309695,-0.150652,-0.307977,-0.165579,-0.295451,-0.182453,-0.285709,-0.184767,-0.279350,-0.189952,-0.275000,-0.193336,-0.255809,-0.200000,-0.237500,-0.200000,0.237500,-0.198282,0.247242,-0.198861,0.250524,-0.197195,0.253410,-0.195477,0.263152,
-0.182951,0.278079,-0.173209,0.294953,-0.166850,0.297267,-0.162500,0.302452,-0.143309,0.305836,-0.125000,0.312500,0.125000,0.312500,0.134742,0.310782,0.134742,0.310782,$1*%
%AMFreePoly7*
4,1,48,0.134742,0.310782,0.138024,0.311361,0.140910,0.309695,0.150652,0.307977,0.165579,0.295451,0.182453,0.285709,0.184767,0.279350,0.189952,0.275000,0.193336,0.255809,0.200000,0.237500,0.200000,-0.237500,0.198282,-0.247242,0.198861,-0.250524,0.197195,-0.253410,0.195477,-0.263152,0.182951,-0.278079,0.173209,-0.294953,0.166850,-0.297267,0.162500,-0.302452,0.143309,-0.305836,
0.125000,-0.312500,0.081066,-0.312500,0.076480,-0.311691,0.074529,-0.312214,0.071540,-0.310820,0.055414,-0.307977,0.042871,-0.297452,0.028033,-0.290533,-0.178033,-0.084467,-0.180703,-0.080653,-0.182453,-0.079643,-0.183581,-0.076543,-0.192973,-0.063130,-0.194400,-0.046819,-0.200000,-0.031434,-0.200000,0.237500,-0.198282,0.247242,-0.198861,0.250524,-0.197195,0.253410,-0.195477,0.263152,
-0.182951,0.278079,-0.173209,0.294953,-0.166850,0.297267,-0.162500,0.302452,-0.143309,0.305836,-0.125000,0.312500,0.125000,0.312500,0.134742,0.310782,0.134742,0.310782,$1*%
G04 Aperture macros list end*
%ADD10RoundRect,0.200000X-0.275000X0.200000X-0.275000X-0.200000X0.275000X-0.200000X0.275000X0.200000X0*%
%ADD11RoundRect,0.200000X0.275000X-0.200000X0.275000X0.200000X-0.275000X0.200000X-0.275000X-0.200000X0*%
%ADD12RoundRect,0.200000X-0.200000X-0.275000X0.200000X-0.275000X0.200000X0.275000X-0.200000X0.275000X0*%
%ADD13RoundRect,0.200000X0.200000X0.275000X-0.200000X0.275000X-0.200000X-0.275000X0.200000X-0.275000X0*%
%ADD14R,0.375000X0.350000*%
%ADD15R,0.350000X0.375000*%
%ADD16RoundRect,0.140000X-0.140000X-0.170000X0.140000X-0.170000X0.140000X0.170000X-0.140000X0.170000X0*%
%ADD17RoundRect,0.150000X0.700000X-0.150000X0.700000X0.150000X-0.700000X0.150000X-0.700000X-0.150000X0*%
%ADD18RoundRect,0.250000X1.100000X-0.250000X1.100000X0.250000X-1.100000X0.250000X-1.100000X-0.250000X0*%
%ADD19R,1.350000X0.400000*%
%ADD20R,1.600000X2.100000*%
%ADD21R,1.900000X1.900000*%
%ADD22RoundRect,0.218750X0.218750X0.256250X-0.218750X0.256250X-0.218750X-0.256250X0.218750X-0.256250X0*%
%ADD23RoundRect,0.140000X0.170000X-0.140000X0.170000X0.140000X-0.170000X0.140000X-0.170000X-0.140000X0*%
%ADD24RoundRect,0.250000X-0.292217X0.292217X-0.292217X-0.292217X0.292217X-0.292217X0.292217X0.292217X0*%
%ADD25RoundRect,0.050000X-0.050000X0.387500X-0.050000X-0.387500X0.050000X-0.387500X0.050000X0.387500X0*%
%ADD26RoundRect,0.050000X-0.387500X0.050000X-0.387500X-0.050000X0.387500X-0.050000X0.387500X0.050000X0*%
%ADD27R,2.000000X1.050000*%
%ADD28RoundRect,0.150000X-0.825000X-0.150000X0.825000X-0.150000X0.825000X0.150000X-0.825000X0.150000X0*%
%ADD29FreePoly0,0.000000*%
%ADD30RoundRect,0.100000X-0.212500X-0.100000X0.212500X-0.100000X0.212500X0.100000X-0.212500X0.100000X0*%
%ADD31FreePoly1,0.000000*%
%ADD32FreePoly2,0.000000*%
%ADD33RoundRect,0.100000X-0.100000X-0.212500X0.100000X-0.212500X0.100000X0.212500X-0.100000X0.212500X0*%
%ADD34FreePoly3,0.000000*%
%ADD35FreePoly4,0.000000*%
%ADD36FreePoly5,0.000000*%
%ADD37FreePoly6,0.000000*%
%ADD38FreePoly7,0.000000*%
%ADD39RoundRect,0.150000X0.150000X-0.587500X0.150000X0.587500X-0.150000X0.587500X-0.150000X-0.587500X0*%
%ADD40RoundRect,0.150000X-0.650000X-0.150000X0.650000X-0.150000X0.650000X0.150000X-0.650000X0.150000X0*%
%ADD41RoundRect,0.140000X0.140000X0.170000X-0.140000X0.170000X-0.140000X-0.170000X0.140000X-0.170000X0*%
%ADD42R,1.200000X1.400000*%
%ADD43RoundRect,0.218750X-0.256250X0.218750X-0.256250X-0.218750X0.256250X-0.218750X0.256250X0.218750X0*%
%ADD44RoundRect,0.225000X-0.225000X-0.250000X0.225000X-0.250000X0.225000X0.250000X-0.225000X0.250000X0*%
%ADD45R,1.050000X2.000000*%
%ADD46RoundRect,0.225000X0.225000X0.250000X-0.225000X0.250000X-0.225000X-0.250000X0.225000X-0.250000X0*%
%ADD47RoundRect,0.140000X-0.170000X0.140000X-0.170000X-0.140000X0.170000X-0.140000X0.170000X0.140000X0*%
G04 APERTURE END LIST*
D10*
%TO.C,R23*%
X92700000Y-70325000D03*
X92700000Y-68675000D03*
%TD*%
%TO.C,R22*%
X91100000Y-68675000D03*
X91100000Y-70325000D03*
%TD*%
%TO.C,R21*%
X89500000Y-70325000D03*
X89500000Y-68675000D03*
%TD*%
%TO.C,R20*%
X87900000Y-68700000D03*
X87900000Y-70350000D03*
%TD*%
%TO.C,R19*%
X117300000Y-68675000D03*
X117300000Y-70325000D03*
%TD*%
%TO.C,R18*%
X115700000Y-68675000D03*
X115700000Y-70325000D03*
%TD*%
%TO.C,R17*%
X114100000Y-70325000D03*
X114100000Y-68675000D03*
%TD*%
%TO.C,R16*%
X112500000Y-68675000D03*
X112500000Y-70325000D03*
%TD*%
D11*
%TO.C,R15*%
X90450000Y-62575000D03*
X90450000Y-60925000D03*
%TD*%
D12*
%TO.C,R14*%
X123875000Y-44700000D03*
X125525000Y-44700000D03*
%TD*%
D11*
%TO.C,R13*%
X88700000Y-67325000D03*
X88700000Y-65675000D03*
%TD*%
%TO.C,R12*%
X114900000Y-67325000D03*
X114900000Y-65675000D03*
%TD*%
%TO.C,R11*%
X90300000Y-67335000D03*
X90300000Y-65685000D03*
%TD*%
%TO.C,R10*%
X116500000Y-67325000D03*
X116500000Y-65675000D03*
%TD*%
D12*
%TO.C,R9*%
X118675000Y-41600000D03*
X120325000Y-41600000D03*
%TD*%
%TO.C,R8*%
X118675000Y-43205000D03*
X120325000Y-43205000D03*
%TD*%
D11*
%TO.C,R7*%
X118800000Y-39925000D03*
X118800000Y-38275000D03*
%TD*%
D10*
%TO.C,R6*%
X109300000Y-41675000D03*
X109300000Y-43325000D03*
%TD*%
D11*
%TO.C,R3*%
X114000000Y-49725000D03*
X114000000Y-48075000D03*
%TD*%
D13*
%TO.C,R2*%
X127045000Y-56850000D03*
X125395000Y-56850000D03*
%TD*%
D10*
%TO.C,R1*%
X115600000Y-48075000D03*
X115600000Y-49725000D03*
%TD*%
D14*
%TO.C,U5*%
X80837500Y-40450000D03*
X80837500Y-40950000D03*
X80837500Y-41450000D03*
X80837500Y-41950000D03*
D15*
X81350000Y-41962500D03*
X81850000Y-41962500D03*
D14*
X82362500Y-41950000D03*
X82362500Y-41450000D03*
X82362500Y-40950000D03*
X82362500Y-40450000D03*
D15*
X81850000Y-40437500D03*
X81350000Y-40437500D03*
%TD*%
D16*
%TO.C,C14*%
X108120000Y-62000000D03*
X109080000Y-62000000D03*
%TD*%
D17*
%TO.C,J9*%
X129650000Y-51124999D03*
X129650000Y-49874999D03*
X129650000Y-48624999D03*
X129650000Y-47374999D03*
X129650000Y-46124999D03*
X129650000Y-44874999D03*
X129650000Y-43624999D03*
X129650000Y-42374999D03*
X129650000Y-41124999D03*
X129650000Y-39874999D03*
D18*
X132850000Y-38024999D03*
X132850000Y-52974999D03*
%TD*%
D19*
%TO.C,J2*%
X130787500Y-60200000D03*
X130787500Y-59550000D03*
X130787500Y-58900000D03*
X130787500Y-58250000D03*
X130787500Y-57600000D03*
D20*
X130912500Y-55800000D03*
D21*
X133462500Y-60100000D03*
D20*
X130912500Y-62000000D03*
D21*
X133462500Y-57700000D03*
%TD*%
D12*
%TO.C,R4*%
X125425000Y-58450000D03*
X127075000Y-58450000D03*
%TD*%
D22*
%TO.C,D1*%
X126987500Y-55250000D03*
X125412500Y-55250000D03*
%TD*%
D16*
%TO.C,C8*%
X108120000Y-59000000D03*
X109080000Y-59000000D03*
%TD*%
D23*
%TO.C,C6*%
X112525000Y-49770000D03*
X112525000Y-48810000D03*
%TD*%
D24*
%TO.C,U1*%
X103137500Y-57612500D03*
X101862500Y-57612500D03*
X101862500Y-58887500D03*
X103137500Y-58887500D03*
D25*
X105100000Y-54812500D03*
X104700000Y-54812500D03*
X104300000Y-54812500D03*
X103900000Y-54812500D03*
X103500000Y-54812500D03*
X103100000Y-54812500D03*
X102700000Y-54812500D03*
X102300000Y-54812500D03*
X101900000Y-54812500D03*
X101500000Y-54812500D03*
X101100000Y-54812500D03*
X100700000Y-54812500D03*
X100300000Y-54812500D03*
X99900000Y-54812500D03*
D26*
X99062500Y-55650000D03*
X99062500Y-56050000D03*
X99062500Y-56450000D03*
X99062500Y-56850000D03*
X99062500Y-57250000D03*
X99062500Y-57650000D03*
X99062500Y-58050000D03*
X99062500Y-58450000D03*
X99062500Y-58850000D03*
X99062500Y-59250000D03*
X99062500Y-59650000D03*
X99062500Y-60050000D03*
X99062500Y-60450000D03*
X99062500Y-60850000D03*
D25*
X99900000Y-61687500D03*
X100300000Y-61687500D03*
X100700000Y-61687500D03*
X101100000Y-61687500D03*
X101500000Y-61687500D03*
X101900000Y-61687500D03*
X102300000Y-61687500D03*
X102700000Y-61687500D03*
X103100000Y-61687500D03*
X103500000Y-61687500D03*
X103900000Y-61687500D03*
X104300000Y-61687500D03*
X104700000Y-61687500D03*
X105100000Y-61687500D03*
D26*
X105937500Y-60850000D03*
X105937500Y-60450000D03*
X105937500Y-60050000D03*
X105937500Y-59650000D03*
X105937500Y-59250000D03*
X105937500Y-58850000D03*
X105937500Y-58450000D03*
X105937500Y-58050000D03*
X105937500Y-57650000D03*
X105937500Y-57250000D03*
X105937500Y-56850000D03*
X105937500Y-56450000D03*
X105937500Y-56050000D03*
X105937500Y-55650000D03*
%TD*%
D23*
%TO.C,C18*%
X105142500Y-41737500D03*
X105142500Y-40777500D03*
%TD*%
%TO.C,C13*%
X105400000Y-53400000D03*
X105400000Y-52440000D03*
%TD*%
D27*
%TO.C,SW1*%
X120800000Y-55925000D03*
X120800000Y-51475000D03*
%TD*%
D23*
%TO.C,C22*%
X83600000Y-41680000D03*
X83600000Y-40720000D03*
%TD*%
D28*
%TO.C,U3*%
X111550000Y-39395000D03*
X111550000Y-40665000D03*
X111550000Y-41935000D03*
X111550000Y-43205000D03*
X116500000Y-43205000D03*
X116500000Y-41935000D03*
X116500000Y-40665000D03*
X116500000Y-39395000D03*
%TD*%
D29*
%TO.C,U4*%
X101400000Y-39137500D03*
D30*
X101400000Y-39637500D03*
X101400000Y-40137500D03*
D31*
X101400000Y-40637500D03*
D32*
X102062500Y-40800000D03*
D33*
X102562500Y-40800000D03*
D34*
X103062500Y-40800000D03*
D35*
X103725000Y-40637500D03*
D30*
X103725000Y-40137500D03*
X103725000Y-39637500D03*
D36*
X103725000Y-39137500D03*
D37*
X103062500Y-38975000D03*
D33*
X102562500Y-38975000D03*
D38*
X102062500Y-38975000D03*
%TD*%
D39*
%TO.C,Q1*%
X123750000Y-42900000D03*
X125650000Y-42900000D03*
X124700000Y-41025000D03*
%TD*%
D16*
%TO.C,C20*%
X101062500Y-42057500D03*
X102022500Y-42057500D03*
%TD*%
D40*
%TO.C,U2*%
X108700000Y-51595000D03*
X108700000Y-52865000D03*
X108700000Y-54135000D03*
X108700000Y-55405000D03*
X115900000Y-55405000D03*
X115900000Y-54135000D03*
X115900000Y-52865000D03*
X115900000Y-51595000D03*
%TD*%
D41*
%TO.C,C10*%
X97650000Y-58750000D03*
X96690000Y-58750000D03*
%TD*%
D42*
%TO.C,Y1*%
X92750000Y-56550000D03*
X92750000Y-58750000D03*
X94450000Y-58750000D03*
X94450000Y-56550000D03*
%TD*%
D43*
%TO.C,D2*%
X119400000Y-68712500D03*
X119400000Y-70287500D03*
%TD*%
D44*
%TO.C,C12*%
X84825000Y-57800000D03*
X86375000Y-57800000D03*
%TD*%
D45*
%TO.C,SW2*%
X83425000Y-61700000D03*
X87875000Y-61700000D03*
%TD*%
D46*
%TO.C,C3*%
X94375000Y-54600000D03*
X92825000Y-54600000D03*
%TD*%
D23*
%TO.C,C21*%
X84600000Y-41680000D03*
X84600000Y-40720000D03*
%TD*%
D47*
%TO.C,C9*%
X105000000Y-63120000D03*
X105000000Y-64080000D03*
%TD*%
D46*
%TO.C,C5*%
X94375000Y-60750000D03*
X92825000Y-60750000D03*
%TD*%
D41*
%TO.C,C23*%
X82080000Y-39200000D03*
X81120000Y-39200000D03*
%TD*%
D47*
%TO.C,C15*%
X117800000Y-51220000D03*
X117800000Y-52180000D03*
%TD*%
D43*
%TO.C,D3*%
X94900000Y-68725000D03*
X94900000Y-70300000D03*
%TD*%
D16*
%TO.C,C19*%
X103062500Y-42057500D03*
X104022500Y-42057500D03*
%TD*%
D12*
%TO.C,R5*%
X125425000Y-59950000D03*
X127075000Y-59950000D03*
%TD*%
D47*
%TO.C,C16*%
X106000000Y-63120000D03*
X106000000Y-64080000D03*
%TD*%
D16*
%TO.C,C1*%
X108120000Y-58000000D03*
X109080000Y-58000000D03*
%TD*%
%TO.C,C11*%
X108120000Y-60000000D03*
X109080000Y-60000000D03*
%TD*%
%TO.C,C17*%
X115145000Y-37700000D03*
X116105000Y-37700000D03*
%TD*%
%TO.C,C4*%
X108120000Y-61000000D03*
X109080000Y-61000000D03*
%TD*%
D41*
%TO.C,C2*%
X97650000Y-59750000D03*
X96690000Y-59750000D03*
%TD*%
D47*
%TO.C,C7*%
X101500000Y-65840000D03*
X101500000Y-66800000D03*
%TD*%
D16*
%TO.C,C24*%
X81120000Y-43200000D03*
X82080000Y-43200000D03*
%TD*%
M02*
