M48
; DRILL file {KiCad (6.0.4)} date Tue 19 Apr 2022 12:11:39 AM PDT
; FORMAT={-:-/ absolute / inch / decimal}
; #@! TF.CreationDate,2022-04-19T00:11:39-07:00
; #@! TF.GenerationSoftware,Kicad,Pcbnew,(6.0.4)
; #@! TF.FileFunction,Plated,1,4,PTH
FMAT,2
INCH
; #@! TA.AperFunction,Plated,PTH,ViaDrill
T1C0.0118
; #@! TA.AperFunction,Plated,PTH,ComponentDrill
T2C0.0138
; #@! TA.AperFunction,Plated,PTH,ViaDrill
T3C0.0157
; #@! TA.AperFunction,Plated,PTH,ComponentDrill
T4C0.0197
; #@! TA.AperFunction,Plated,PTH,ComponentDrill
T5C0.0394
; #@! TA.AperFunction,Plated,PTH,ComponentDrill
T6C0.0472
%
G90
G05
T1
X3.0754Y-1.7514
X3.1555Y-1.5118
X3.1555Y-1.5433
X3.1555Y-1.5925
X3.1555Y-1.6319
X3.1555Y-1.6654
X3.2598Y-1.6693
X3.2598Y-1.7008
X3.2835Y-2.2756
X3.2835Y-2.3465
X3.2913Y-1.5748
X3.2913Y-1.6693
X3.3307Y-1.5748
X3.3307Y-1.6693
X3.3701Y-1.752
X3.3937Y-1.811
X3.4026Y-1.5778
X3.5236Y-1.8563
X3.7835Y-2.313
X3.7835Y-2.3524
X3.8268Y-2.3819
X3.9441Y-2.2901
X3.9449Y-2.3622
X3.9451Y-2.3304
X3.9508Y-1.655
X3.9626Y-2.6063
X3.9961Y-2.6531
X4.0128Y-2.0827
X4.0166Y-1.6885
X4.0433Y-2.0827
X4.0576Y-1.6885
X4.0748Y-2.0827
X4.0954Y-1.6885
X4.1083Y-2.4843
X4.1167Y-2.3238
X4.1167Y-2.3573
X4.1339Y-2.5472
X4.1339Y-2.2675
X4.1398Y-1.6708
X4.1496Y-2.0394
X4.1693Y-1.6058
X4.1732Y-2.5472
X4.1806Y-2.0861
X4.2008Y-2.485
X4.2126Y-2.3071
X4.22Y-2.3784
X4.2567Y-2.4724
X4.3189Y-2.2776
X4.3189Y-2.3101
X4.3189Y-2.372
X4.3189Y-2.4016
X4.3189Y-2.4409
X4.4291Y-1.9878
X4.5335Y-1.4587
X4.5994Y-1.4843
X4.8898Y-1.7933
X5.0443Y-1.7175
X5.0443Y-1.7667
T2
X3.9852Y-2.2431
X3.9852Y-2.2933
X3.9852Y-2.3435
X4.0354Y-2.2431
X4.0354Y-2.2933
X4.0354Y-2.3435
X4.0856Y-2.2431
X4.0856Y-2.2933
X4.0856Y-2.3435
T3
X3.2402Y-2.1398
X3.3209Y-2.1398
X3.4016Y-2.2323
X3.4921Y-2.5472
X3.5669Y-1.7343
X3.5827Y-1.6339
X3.6024Y-2.5591
X3.6063Y-2.4646
X3.6181Y-2.1496
X3.6201Y-2.3917
X3.6614Y-1.8898
X3.7362Y-2.6653
X3.8268Y-1.8898
X3.8661Y-1.7402
X3.8937Y-1.7667
X3.9235Y-1.7923
X3.9449Y-2.2539
X3.9606Y-1.8179
X3.9961Y-2.2008
X4.0138Y-1.8504
X4.126Y-1.561
X4.126Y-2.2028
X4.2598Y-1.7047
X4.3386Y-2.1811
X4.4724Y-2.5827
X4.5866Y-2.6141
X4.6732Y-2.0167
X4.689Y-2.2008
X4.7008Y-2.6614
X4.7205Y-1.5079
X4.7402Y-1.8504
X4.7756Y-1.9735
X4.7795Y-1.6378
X4.7795Y-1.7008
X4.8971Y-2.1752
X4.8996Y-2.3012
X4.8996Y-2.3563
X4.9094Y-1.6801
X4.9129Y-2.2382
X4.9646Y-1.7598
X5.0354Y-1.5709
X5.0433Y-1.6673
X5.0965Y-2.3701
X5.1043Y-2.0531
X5.1949Y-2.2756
T5
X2.8583Y-1.5512
X2.8583Y-1.6512
X2.8583Y-1.7512
X2.8583Y-1.8512
X2.9583Y-1.5512
X2.9583Y-1.6512
X2.9583Y-1.7512
X2.9583Y-1.8512
X3.0709Y-2.0177
X3.0709Y-2.2441
X3.0709Y-2.3441
X3.0709Y-2.4441
X3.0709Y-2.5441
X3.0709Y-2.6441
X3.0709Y-2.7441
X3.0709Y-2.8441
X3.0709Y-2.9441
X3.0856Y-1.2685
X3.0856Y-1.3685
X3.1709Y-2.0177
X3.1856Y-1.2685
X3.1856Y-1.3685
X3.2709Y-2.0177
X3.2856Y-1.2685
X3.2856Y-1.3685
X3.3709Y-2.0177
X3.3856Y-1.2685
X3.3856Y-1.3685
X3.436Y-1.5157
X3.4709Y-2.0177
X3.4856Y-1.2685
X3.4856Y-1.3685
X3.536Y-1.5157
X3.5856Y-1.2685
X3.5856Y-1.3685
X3.6856Y-1.2685
X3.6856Y-1.3685
X3.7856Y-1.2685
X3.7856Y-1.3685
X3.8856Y-1.2685
X3.8856Y-1.3685
X3.9856Y-1.2685
X3.9856Y-1.3685
X4.0856Y-1.2685
X4.0856Y-1.3685
X4.1856Y-1.2685
X4.1856Y-1.3685
X4.2856Y-1.2685
X4.2856Y-1.3685
X4.3856Y-1.2685
X4.3856Y-1.3685
X4.4856Y-1.2685
X4.4856Y-1.3685
X4.5856Y-1.2685
X4.5856Y-1.3685
X4.6856Y-1.2685
X4.6856Y-1.3685
X4.7856Y-1.2685
X4.7856Y-1.3685
X4.8856Y-1.2685
X4.8856Y-1.3685
X4.9856Y-1.2685
X4.9856Y-1.3685
T6
X3.2067Y-3.189
X3.3445Y-3.189
X3.4823Y-3.189
X3.6201Y-3.189
X3.7579Y-3.189
X3.8957Y-3.189
X4.1732Y-3.189
X4.311Y-3.189
X4.4488Y-3.189
X4.5866Y-3.189
X4.7244Y-3.189
X4.8622Y-3.189
T4
G00X5.2406Y-2.2077
M15
G01X5.2682Y-2.2077
M16
G05
G00X5.2406Y-2.4301
M15
G01X5.2682Y-2.4301
M16
G05
T0
M30
