%!PS-Adobe-3.0
%%Creator: PCBNEW
%%CreationDate: Thu Mar 17 01:23:09 2022
%%Title: ()
%%Pages: 1
%%PageOrder: Ascend
%%BoundingBox: 0 0 596 842
%%DocumentMedia: A4 595 842 0 () ()
%%Orientation: Landscape
%%EndComments
%%BeginProlog
/line { newpath moveto lineto stroke } bind def
/cir0 { newpath 0 360 arc stroke } bind def
/cir1 { newpath 0 360 arc gsave fill grestore stroke } bind def
/cir2 { newpath 0 360 arc gsave fill grestore stroke } bind def
/arc0 { newpath arc stroke } bind def
/arc1 { newpath 4 index 4 index moveto arc closepath gsave fill
    grestore stroke } bind def
/arc2 { newpath 4 index 4 index moveto arc closepath gsave fill
    grestore stroke } bind def
/poly0 { stroke } bind def
/poly1 { closepath gsave fill grestore stroke } bind def
/poly2 { closepath gsave fill grestore stroke } bind def
/rect0 { rectstroke } bind def
/rect1 { rectfill } bind def
/rect2 { rectfill } bind def
/linemode0 { 0 setlinecap 0 setlinejoin 0 setlinewidth } bind def
/linemode1 { 1 setlinecap 1 setlinejoin } bind def
/dashedline { [200] 100 setdash } bind def
/solidline { [] 0 setdash } bind def
/phantomshow { moveto
    /KicadFont findfont 0.000001 scalefont setfont
    show } bind def
/textshow { gsave
    findfont exch scalefont setfont concat 1 scale 0 0 moveto show
    } bind def
/reencodefont {
  findfont dup length dict begin
  { 1 index /FID ne
    { def }
    { pop pop } ifelse
  } forall
  /Encoding ISOLatin1Encoding def
  currentdict
  end } bind def
/KicadFont /Helvetica reencodefont definefont pop
/KicadFont-Bold /Helvetica-Bold reencodefont definefont pop
/KicadFont-Oblique /Helvetica-Oblique reencodefont definefont pop
/KicadFont-BoldOblique /Helvetica-BoldOblique reencodefont definefont pop
%%EndProlog
%%Page: 1 1
%%BeginPageSetup
gsave
0.0072 0.0072 scale
linemode1
82680 0 translate 90 rotate
161.382 setlinewidth
%%EndPageSetup
0 0 0 setrgbcolor
80.6908 setlinewidth
newpath
33047.4 64936.4 moveto
35468.1 64936.4 lineto
stroke
0 0 0 setrgbcolor
35468.1 52025.9 806.907 -90.0001 5.72958e-05 arc0
0 0 0 setrgbcolor
34661.2 37501.6 2420.72 -180 -90 arc0
0 0 0 setrgbcolor
newpath
34661.2 80671.2 moveto
82268.8 80671.2 lineto
stroke
0 0 0 setrgbcolor
82268.8 37501.6 2420.72 -90 -1.90986e-05 arc0
0 0 0 setrgbcolor
35468.1 64129.5 806.907 -5.72958e-05 90.0001 arc0
0 0 0 setrgbcolor
34661.2 78250.4 2420.72 90 180 arc0
0 0 0 setrgbcolor
newpath
84689.5 78250.4 moveto
84689.5 37501.6 lineto
stroke
0 0 0 setrgbcolor
newpath
32240.5 65743.4 moveto
32240.5 78250.4 lineto
stroke
0 0 0 setrgbcolor
newpath
32240.5 37501.6 moveto
32240.5 50412.1 lineto
stroke
0 0 0 setrgbcolor
82268.8 78250.4 2420.72 1.90986e-05 90 arc0
0 0 0 setrgbcolor
newpath
36275 64129.5 moveto
36275 52025.9 lineto
stroke
0 0 0 setrgbcolor
newpath
82268.8 35080.8 moveto
34661.2 35080.8 lineto
stroke
0 0 0 setrgbcolor
33047.4 65743.4 806.907 -180 -89.9999 arc0
0 0 0 setrgbcolor
33047.4 50412.1 806.907 -270 -180 arc0
0 0 0 setrgbcolor
newpath
35468.1 51219 moveto
33047.4 51219 lineto
stroke
161.382 setlinewidth
24.2072 setlinewidth
newpath
38666.9 69103.5 moveto
38909 68861.4 lineto
stroke
newpath
38909 69103.5 moveto
38666.9 68861.4 lineto
stroke
newpath
40309.6 73368.6 moveto
40551.6 73126.6 lineto
stroke
newpath
40551.6 73368.6 moveto
40309.6 73126.6 lineto
stroke
newpath
40309.6 72360 moveto
40551.6 72117.9 lineto
stroke
newpath
40551.6 72360 moveto
40309.6 72117.9 lineto
stroke
newpath
40309.6 71553.1 moveto
40551.6 71311 lineto
stroke
newpath
40551.6 71553.1 moveto
40309.6 71311 lineto
stroke
newpath
40309.6 70867.2 moveto
40551.6 70625.1 lineto
stroke
newpath
40551.6 70867.2 moveto
40309.6 70625.1 lineto
stroke
newpath
42447.9 70786.5 moveto
42689.9 70544.5 lineto
stroke
newpath
42689.9 70786.5 moveto
42447.9 70544.5 lineto
stroke
newpath
42447.9 70141 moveto
42689.9 69898.9 lineto
stroke
newpath
42689.9 70141 moveto
42447.9 69898.9 lineto
stroke
newpath
42932 58360.1 moveto
43174.1 58118.1 lineto
stroke
newpath
43174.1 58360.1 moveto
42932 58118.1 lineto
stroke
newpath
42932 56907.7 moveto
43174.1 56665.6 lineto
stroke
newpath
43174.1 56907.7 moveto
42932 56665.6 lineto
stroke
newpath
43093.4 72723.1 moveto
43335.5 72481 lineto
stroke
newpath
43335.5 72723.1 moveto
43093.4 72481 lineto
stroke
newpath
43093.4 70786.5 moveto
43335.5 70544.5 lineto
stroke
newpath
43335.5 70786.5 moveto
43093.4 70544.5 lineto
stroke
newpath
43900.3 72723.1 moveto
44142.4 72481 lineto
stroke
newpath
44142.4 72723.1 moveto
43900.3 72481 lineto
stroke
newpath
43900.3 70786.5 moveto
44142.4 70544.5 lineto
stroke
newpath
44142.4 70786.5 moveto
43900.3 70544.5 lineto
stroke
newpath
44707.2 69092 moveto
44949.3 68849.9 lineto
stroke
newpath
44949.3 69092 moveto
44707.2 68849.9 lineto
stroke
newpath
45191.4 67881.7 moveto
45433.4 67639.6 lineto
stroke
newpath
45433.4 67881.7 moveto
45191.4 67639.6 lineto
stroke
newpath
45372.9 72662.6 moveto
45615 72420.5 lineto
stroke
newpath
45615 72662.6 moveto
45372.9 72420.5 lineto
stroke
newpath
47854.2 66954.1 moveto
48096.2 66712 lineto
stroke
newpath
48096.2 66954.1 moveto
47854.2 66712 lineto
stroke
newpath
49225.9 54769.4 moveto
49468 54527.3 lineto
stroke
newpath
49468 54769.4 moveto
49225.9 54527.3 lineto
stroke
newpath
53179.8 57593.6 moveto
53421.8 57351.5 lineto
stroke
newpath
53421.8 57593.6 moveto
53179.8 57351.5 lineto
stroke
newpath
53179.8 56786.7 moveto
53421.8 56544.6 lineto
stroke
newpath
53421.8 56786.7 moveto
53179.8 56544.6 lineto
stroke
newpath
54067.4 56181.5 moveto
54309.4 55939.4 lineto
stroke
newpath
54309.4 56181.5 moveto
54067.4 55939.4 lineto
stroke
newpath
56472.9 58062.6 moveto
56715 57820.5 lineto
stroke
newpath
56715 58062.6 moveto
56472.9 57820.5 lineto
stroke
newpath
56488.1 56584.9 moveto
56730.1 56342.9 lineto
stroke
newpath
56730.1 56584.9 moveto
56488.1 56342.9 lineto
stroke
newpath
56492.8 57235.8 moveto
56734.9 56993.7 lineto
stroke
newpath
56734.9 57235.8 moveto
56492.8 56993.7 lineto
stroke
newpath
56609.1 71079 moveto
56851.2 70837 lineto
stroke
newpath
56851.2 71079 moveto
56609.1 70837 lineto
stroke
newpath
56851.2 51582.1 moveto
57093.3 51340 lineto
stroke
newpath
57093.3 51582.1 moveto
56851.2 51340 lineto
stroke
newpath
57537.1 50621.9 moveto
57779.1 50379.8 lineto
stroke
newpath
57779.1 50621.9 moveto
57537.1 50379.8 lineto
stroke
newpath
57859.8 62314 moveto
58101.9 62071.9 lineto
stroke
newpath
58101.9 62314 moveto
57859.8 62071.9 lineto
stroke
newpath
57958.7 70393.2 moveto
58200.7 70151.1 lineto
stroke
newpath
58200.7 70393.2 moveto
57958.7 70151.1 lineto
stroke
newpath
58505.3 62314 moveto
58747.4 62071.9 lineto
stroke
newpath
58747.4 62314 moveto
58505.3 62071.9 lineto
stroke
newpath
58797.8 70393.2 moveto
59039.9 70151.1 lineto
stroke
newpath
59039.9 70393.2 moveto
58797.8 70151.1 lineto
stroke
newpath
59150.9 62314 moveto
59392.9 62071.9 lineto
stroke
newpath
59392.9 62314 moveto
59150.9 62071.9 lineto
stroke
newpath
59572.5 70393.2 moveto
59814.6 70151.1 lineto
stroke
newpath
59814.6 70393.2 moveto
59572.5 70151.1 lineto
stroke
newpath
59836.7 54083.5 moveto
60078.8 53841.5 lineto
stroke
newpath
60078.8 54083.5 moveto
59836.7 53841.5 lineto
stroke
newpath
60009.9 57371.7 moveto
60252 57129.6 lineto
stroke
newpath
60252 57371.7 moveto
60009.9 57129.6 lineto
stroke
newpath
60009.9 56685.8 moveto
60252 56443.7 lineto
stroke
newpath
60252 56685.8 moveto
60009.9 56443.7 lineto
stroke
newpath
60361.2 52792.5 moveto
60603.3 52550.4 lineto
stroke
newpath
60603.3 52792.5 moveto
60361.2 52550.4 lineto
stroke
newpath
60362.3 58526.2 moveto
60604.4 58284.1 lineto
stroke
newpath
60604.4 58526.2 moveto
60362.3 58284.1 lineto
stroke
newpath
60482.3 70756.3 moveto
60724.3 70514.2 lineto
stroke
newpath
60724.3 70756.3 moveto
60482.3 70514.2 lineto
stroke
newpath
60684 63201.6 moveto
60926.1 62959.5 lineto
stroke
newpath
60926.1 63201.6 moveto
60684 62959.5 lineto
stroke
newpath
61087.5 72087.7 moveto
61329.5 71845.6 lineto
stroke
newpath
61329.5 72087.7 moveto
61087.5 71845.6 lineto
stroke
newpath
61168.1 52792.5 moveto
61410.2 52550.4 lineto
stroke
newpath
61410.2 52792.5 moveto
61168.1 52550.4 lineto
stroke
newpath
61318.6 62244.2 moveto
61560.7 62002.2 lineto
stroke
newpath
61560.7 62244.2 moveto
61318.6 62002.2 lineto
stroke
newpath
61733 54067.4 moveto
61975 53825.3 lineto
stroke
newpath
61975 54067.4 moveto
61733 53825.3 lineto
stroke
newpath
61975 57714.6 moveto
62217.1 57472.5 lineto
stroke
newpath
62217.1 57714.6 moveto
61975 57472.5 lineto
stroke
newpath
62127.2 56253 moveto
62369.3 56010.9 lineto
stroke
newpath
62369.3 56253 moveto
62127.2 56010.9 lineto
stroke
newpath
62701.3 60861.6 moveto
62943.3 60619.5 lineto
stroke
newpath
62943.3 60861.6 moveto
62701.3 60619.5 lineto
stroke
newpath
62878.8 54325.6 moveto
63120.9 54083.5 lineto
stroke
newpath
63120.9 54325.6 moveto
62878.8 54083.5 lineto
stroke
newpath
63104.7 59812.6 moveto
63346.8 59570.5 lineto
stroke
newpath
63346.8 59812.6 moveto
63104.7 59570.5 lineto
stroke
newpath
64153.7 58319.8 moveto
64395.8 58077.7 lineto
stroke
newpath
64395.8 58319.8 moveto
64153.7 58077.7 lineto
stroke
newpath
64153.7 57653.7 moveto
64395.8 57411.6 lineto
stroke
newpath
64395.8 57653.7 moveto
64153.7 57411.6 lineto
stroke
newpath
64153.7 56383.2 moveto
64395.8 56141.1 lineto
stroke
newpath
64395.8 56383.2 moveto
64153.7 56141.1 lineto
stroke
newpath
64153.7 55778 moveto
64395.8 55536 lineto
stroke
newpath
64395.8 55778 moveto
64153.7 55536 lineto
stroke
newpath
64153.7 54971.1 moveto
64395.8 54729.1 lineto
stroke
newpath
64395.8 54971.1 moveto
64153.7 54729.1 lineto
stroke
newpath
64718.5 63524.4 moveto
64960.6 63282.3 lineto
stroke
newpath
64960.6 63524.4 moveto
64718.5 63282.3 lineto
stroke
newpath
64879.9 58844.3 moveto
65122 58602.2 lineto
stroke
newpath
65122 58844.3 moveto
64879.9 58602.2 lineto
stroke
newpath
65565.8 60780.9 moveto
65807.9 60538.8 lineto
stroke
newpath
65807.9 60780.9 moveto
65565.8 60538.8 lineto
stroke
newpath
65565.8 60000.2 moveto
65807.9 59758.1 lineto
stroke
newpath
65807.9 60000.2 moveto
65565.8 59758.1 lineto
stroke
newpath
66493.7 65501.3 moveto
66735.8 65259.2 lineto
stroke
newpath
66735.8 65501.3 moveto
66493.7 65259.2 lineto
stroke
newpath
68551.3 75103.5 moveto
68793.4 74861.4 lineto
stroke
newpath
68793.4 75103.5 moveto
68551.3 74861.4 lineto
stroke
newpath
69902.9 74579 moveto
70145 74336.9 lineto
stroke
newpath
70145 74579 moveto
69902.9 74336.9 lineto
stroke
newpath
71355.4 73772.1 moveto
71597.4 73530 lineto
stroke
newpath
71597.4 73772.1 moveto
71355.4 73530 lineto
stroke
newpath
76620 57473 moveto
76862.1 57230.9 lineto
stroke
newpath
76862.1 57473 moveto
76620 57230.9 lineto
stroke
newpath
77040 56847.2 moveto
77282.1 56605.1 lineto
stroke
newpath
77282.1 56847.2 moveto
77040 56605.1 lineto
stroke
newpath
79021 69798.1 moveto
79263.1 69556 lineto
stroke
newpath
79263.1 69798.1 moveto
79021 69556 lineto
stroke
newpath
79021 68789.4 moveto
79263.1 68547.4 lineto
stroke
newpath
79263.1 68789.4 moveto
79021 68547.4 lineto
stroke
28.2418 setlinewidth
57436.2 58904.8 141.209 cir0
57436.2 57876 141.209 cir0
57436.2 56847.2 141.209 cir0
58465 58904.8 141.209 cir0
58465 57876 141.209 cir0
58465 56847.2 141.209 cir0
59493.8 58904.8 141.209 cir0
59493.8 57876 141.209 cir0
59493.8 56847.2 141.209 cir0
32.2763 setlinewidth
newpath
44021.3 49363.1 moveto
44021.3 49040.4 lineto
stroke
newpath
43860 49201.7 moveto
44182.7 49201.7 lineto
stroke
newpath
44021.3 48556.2 moveto
44021.3 48233.4 lineto
stroke
newpath
43860 48394.8 moveto
44182.7 48394.8 lineto
stroke
newpath
48862.8 69495.5 moveto
48862.8 69172.7 lineto
stroke
newpath
48701.4 69334.1 moveto
49024.2 69334.1 lineto
stroke
newpath
49427.6 71633.8 moveto
49427.6 71311 lineto
stroke
newpath
49266.2 71472.4 moveto
49589 71472.4 lineto
stroke
newpath
52413.2 50492.8 moveto
52413.2 50170 lineto
stroke
newpath
52251.8 50331.4 moveto
52574.6 50331.4 lineto
stroke
newpath
52816.6 74700 moveto
52816.6 74377.3 lineto
stroke
newpath
52655.3 74538.7 moveto
52978 74538.7 lineto
stroke
newpath
54995.3 69374.4 moveto
54995.3 69051.7 lineto
stroke
newpath
54833.9 69213.1 moveto
55156.7 69213.1 lineto
stroke
newpath
55560.1 68830.2 moveto
55560.1 68507.4 lineto
stroke
newpath
55398.7 68668.8 moveto
55721.5 68668.8 lineto
stroke
newpath
56170.8 68305.7 moveto
56170.8 67982.9 lineto
stroke
newpath
56009.4 68144.3 moveto
56332.2 68144.3 lineto
stroke
newpath
56609.1 58844.3 moveto
56609.1 58521.5 lineto
stroke
newpath
56447.7 58682.9 moveto
56770.5 58682.9 lineto
stroke
newpath
56931.9 67781.2 moveto
56931.9 67458.4 lineto
stroke
newpath
56770.5 67619.8 moveto
57093.3 67619.8 lineto
stroke
newpath
57658.1 59933.6 moveto
57658.1 59610.9 lineto
stroke
newpath
57496.7 59772.2 moveto
57819.5 59772.2 lineto
stroke
newpath
58021.2 67115.1 moveto
58021.2 66792.3 lineto
stroke
newpath
57859.8 66953.7 moveto
58182.6 66953.7 lineto
stroke
newpath
60320.9 73045.9 moveto
60320.9 72723.1 lineto
stroke
newpath
60159.5 72884.5 moveto
60482.3 72884.5 lineto
stroke
newpath
60320.9 59893.3 moveto
60320.9 59570.5 lineto
stroke
newpath
60159.5 59731.9 moveto
60482.3 59731.9 lineto
stroke
newpath
63415.4 70254 moveto
63415.4 69931.2 lineto
stroke
newpath
63254 70092.6 moveto
63576.8 70092.6 lineto
stroke
newpath
63871.3 49363.1 moveto
63871.3 49040.4 lineto
stroke
newpath
63709.9 49201.7 moveto
64032.7 49201.7 lineto
stroke
newpath
63871.3 48556.2 moveto
63871.3 48233.4 lineto
stroke
newpath
63709.9 48394.8 moveto
64032.7 48394.8 lineto
stroke
newpath
72101.7 50492.8 moveto
72101.7 50170 lineto
stroke
newpath
71940.4 50331.4 moveto
72263.1 50331.4 lineto
stroke
newpath
72908.7 67115.1 moveto
72908.7 66792.3 lineto
stroke
newpath
72747.3 66953.7 moveto
73070 66953.7 lineto
stroke
newpath
73090.2 71202.1 moveto
73090.2 70879.3 lineto
stroke
newpath
72928.8 71040.7 moveto
73251.6 71040.7 lineto
stroke
newpath
73090.2 70177.3 moveto
73090.2 69854.5 lineto
stroke
newpath
72928.8 70015.9 moveto
73251.6 70015.9 lineto
stroke
newpath
75640.6 68394.6 moveto
75640.6 68071.8 lineto
stroke
newpath
75479.2 68233.2 moveto
75802 68233.2 lineto
stroke
newpath
76378.4 70605 moveto
76378.4 70282.2 lineto
stroke
newpath
76217 70443.6 moveto
76539.7 70443.6 lineto
stroke
newpath
77266 60175.7 moveto
77266 59852.9 lineto
stroke
newpath
77104.6 60014.3 moveto
77427.3 60014.3 lineto
stroke
newpath
77508 68971 moveto
77508 68648.2 lineto
stroke
newpath
77346.6 68809.6 moveto
77669.4 68809.6 lineto
stroke
newpath
77588.7 58884.6 moveto
77588.7 58561.9 lineto
stroke
newpath
77427.3 58723.3 moveto
77750.1 58723.3 lineto
stroke
newpath
78960.5 72844.1 moveto
78960.5 72521.4 lineto
stroke
newpath
78799.1 72682.8 moveto
79121.8 72682.8 lineto
stroke
newpath
79121.8 70867.2 moveto
79121.8 70544.5 lineto
stroke
newpath
78960.5 70705.8 moveto
79283.2 70705.8 lineto
stroke
newpath
80211.2 56463.9 moveto
80211.2 56141.1 lineto
stroke
newpath
80049.8 56302.5 moveto
80372.6 56302.5 lineto
stroke
newpath
80372.6 62959.5 moveto
80372.6 62636.8 lineto
stroke
newpath
80211.2 62798.1 moveto
80533.9 62798.1 lineto
stroke
newpath
82229.6 58401.1 moveto
82229.6 58078.3 lineto
stroke
newpath
82068.2 58239.7 moveto
82391 58239.7 lineto
stroke
40.3454 setlinewidth
newpath
83591.5 59488.4 moveto
83591.5 59773.7 lineto
83306.2 59773.7 lineto
83306.2 59488.4 lineto
83591.5 59488.4 lineto
poly0
161.382 setlinewidth
newpath
83166.5 59510 moveto
83731.3 59510 lineto
stroke
newpath
83166.5 59752.1 moveto
83731.3 59752.1 lineto
stroke
83731.3 59631 121.036 270 450 arc0
83166.5 59631 121.036 90 270 arc0
40.3454 setlinewidth
newpath
83591.5 54929.4 moveto
83591.5 55214.6 lineto
83306.2 55214.6 lineto
83306.2 54929.4 lineto
83591.5 54929.4 lineto
poly0
161.382 setlinewidth
newpath
83166.5 54951 moveto
83731.3 54951 lineto
stroke
newpath
83166.5 55193 moveto
83731.3 55193 lineto
stroke
83731.3 55072 121.036 270 450 arc0
83166.5 55072 121.036 90 270 arc0
80.6908 setlinewidth
newpath
34338.5 72682.8 moveto
34741.9 73086.2 lineto
34338.5 73489.7 lineto
33935 73086.2 lineto
34338.5 72682.8 lineto
poly0
newpath
34338.5 70633.2 moveto
34741.9 71036.7 lineto
34338.5 71440.1 lineto
33935 71036.7 lineto
34338.5 70633.2 lineto
poly0
newpath
34338.5 68583.7 moveto
34741.9 68987.1 lineto
34338.5 69390.6 lineto
33935 68987.1 lineto
34338.5 68583.7 lineto
poly0
newpath
34338.5 66534.1 moveto
34741.9 66937.6 lineto
34338.5 67341 lineto
33935 66937.6 lineto
34338.5 66534.1 lineto
poly0
newpath
36388 72682.8 moveto
36791.5 73086.2 lineto
36388 73489.7 lineto
35984.5 73086.2 lineto
36388 72682.8 lineto
poly0
newpath
36388 70633.2 moveto
36791.5 71036.7 lineto
36388 71440.1 lineto
35984.5 71036.7 lineto
36388 70633.2 lineto
poly0
newpath
36388 68583.7 moveto
36791.5 68987.1 lineto
36388 69390.6 lineto
35984.5 68987.1 lineto
36388 68583.7 lineto
poly0
newpath
36388 66534.1 moveto
36791.5 66937.6 lineto
36388 67341 lineto
35984.5 66937.6 lineto
36388 66534.1 lineto
poly0
newpath
38695.8 63120.9 moveto
39099.2 63524.4 lineto
38695.8 63927.8 lineto
38292.3 63524.4 lineto
38695.8 63120.9 lineto
poly0
newpath
38998.3 78476.4 moveto
39401.8 78879.8 lineto
38998.3 79283.3 lineto
38594.9 78879.8 lineto
38998.3 78476.4 lineto
poly0
newpath
38998.3 76426.8 moveto
39401.8 76830.3 lineto
38998.3 77233.7 lineto
38594.9 76830.3 lineto
38998.3 76426.8 lineto
poly0
newpath
40745.3 63120.9 moveto
41148.8 63524.4 lineto
40745.3 63927.8 lineto
40341.8 63524.4 lineto
40745.3 63120.9 lineto
poly0
newpath
41047.9 78476.4 moveto
41451.3 78879.8 lineto
41047.9 79283.3 lineto
40644.4 78879.8 lineto
41047.9 78476.4 lineto
poly0
newpath
41047.9 76426.8 moveto
41451.3 76830.3 lineto
41047.9 77233.7 lineto
40644.4 76830.3 lineto
41047.9 76426.8 lineto
poly0
newpath
42794.8 63120.9 moveto
43198.3 63524.4 lineto
42794.8 63927.8 lineto
42391.4 63524.4 lineto
42794.8 63120.9 lineto
poly0
newpath
43097.4 78476.4 moveto
43500.9 78879.8 lineto
43097.4 79283.3 lineto
42694 78879.8 lineto
43097.4 78476.4 lineto
poly0
newpath
43097.4 76426.8 moveto
43500.9 76830.3 lineto
43097.4 77233.7 lineto
42694 76830.3 lineto
43097.4 76426.8 lineto
poly0
newpath
44844.4 63120.9 moveto
45247.8 63524.4 lineto
44844.4 63927.8 lineto
44440.9 63524.4 lineto
44844.4 63120.9 lineto
poly0
newpath
45147 78476.4 moveto
45550.4 78879.8 lineto
45147 79283.3 lineto
44743.5 78879.8 lineto
45147 78476.4 lineto
poly0
newpath
45147 76426.8 moveto
45550.4 76830.3 lineto
45147 77233.7 lineto
44743.5 76830.3 lineto
45147 76426.8 lineto
poly0
newpath
46179.8 73409 moveto
46583.3 73812.4 lineto
46179.8 74215.9 lineto
45776.4 73812.4 lineto
46179.8 73409 lineto
poly0
newpath
46893.9 63120.9 moveto
47297.4 63524.4 lineto
46893.9 63927.8 lineto
46490.5 63524.4 lineto
46893.9 63120.9 lineto
poly0
newpath
47196.5 78476.4 moveto
47600 78879.8 lineto
47196.5 79283.3 lineto
46793.1 78879.8 lineto
47196.5 78476.4 lineto
poly0
newpath
47196.5 76426.8 moveto
47600 76830.3 lineto
47196.5 77233.7 lineto
46793.1 76830.3 lineto
47196.5 76426.8 lineto
poly0
newpath
48229.4 73409 moveto
48632.8 73812.4 lineto
48229.4 74215.9 lineto
47825.9 73812.4 lineto
48229.4 73409 lineto
poly0
newpath
49246.1 78476.4 moveto
49649.5 78879.8 lineto
49246.1 79283.3 lineto
48842.6 78879.8 lineto
49246.1 78476.4 lineto
poly0
newpath
49246.1 76426.8 moveto
49649.5 76830.3 lineto
49246.1 77233.7 lineto
48842.6 76830.3 lineto
49246.1 76426.8 lineto
poly0
newpath
51295.6 78476.4 moveto
51699.1 78879.8 lineto
51295.6 79283.3 lineto
50892.2 78879.8 lineto
51295.6 78476.4 lineto
poly0
newpath
51295.6 76426.8 moveto
51699.1 76830.3 lineto
51295.6 77233.7 lineto
50892.2 76830.3 lineto
51295.6 76426.8 lineto
poly0
newpath
53345.2 78476.4 moveto
53748.6 78879.8 lineto
53345.2 79283.3 lineto
52941.7 78879.8 lineto
53345.2 78476.4 lineto
poly0
newpath
53345.2 76426.8 moveto
53748.6 76830.3 lineto
53345.2 77233.7 lineto
52941.7 76830.3 lineto
53345.2 76426.8 lineto
poly0
newpath
55394.7 78476.4 moveto
55798.2 78879.8 lineto
55394.7 79283.3 lineto
54991.3 78879.8 lineto
55394.7 78476.4 lineto
poly0
newpath
55394.7 76426.8 moveto
55798.2 76830.3 lineto
55394.7 77233.7 lineto
54991.3 76830.3 lineto
55394.7 76426.8 lineto
poly0
newpath
57444.3 78476.4 moveto
57847.7 78879.8 lineto
57444.3 79283.3 lineto
57040.8 78879.8 lineto
57444.3 78476.4 lineto
poly0
newpath
57444.3 76426.8 moveto
57847.7 76830.3 lineto
57444.3 77233.7 lineto
57040.8 76830.3 lineto
57444.3 76426.8 lineto
poly0
newpath
59493.8 78476.4 moveto
59897.3 78879.8 lineto
59493.8 79283.3 lineto
59090.4 78879.8 lineto
59493.8 78476.4 lineto
poly0
newpath
59493.8 76426.8 moveto
59897.3 76830.3 lineto
59493.8 77233.7 lineto
59090.4 76830.3 lineto
59493.8 76426.8 lineto
poly0
newpath
61543.4 78476.4 moveto
61946.8 78879.8 lineto
61543.4 79283.3 lineto
61139.9 78879.8 lineto
61543.4 78476.4 lineto
poly0
newpath
61543.4 76426.8 moveto
61946.8 76830.3 lineto
61543.4 77233.7 lineto
61139.9 76830.3 lineto
61543.4 76426.8 lineto
poly0
newpath
63592.9 78476.4 moveto
63996.4 78879.8 lineto
63592.9 79283.3 lineto
63189.4 78879.8 lineto
63592.9 78476.4 lineto
poly0
newpath
63592.9 76426.8 moveto
63996.4 76830.3 lineto
63592.9 77233.7 lineto
63189.4 76830.3 lineto
63592.9 76426.8 lineto
poly0
newpath
65642.4 78476.4 moveto
66045.9 78879.8 lineto
65642.4 79283.3 lineto
65239 78879.8 lineto
65642.4 78476.4 lineto
poly0
newpath
65642.4 76426.8 moveto
66045.9 76830.3 lineto
65642.4 77233.7 lineto
65239 76830.3 lineto
65642.4 76426.8 lineto
poly0
newpath
67692 78476.4 moveto
68095.4 78879.8 lineto
67692 79283.3 lineto
67288.5 78879.8 lineto
67692 78476.4 lineto
poly0
newpath
67692 76426.8 moveto
68095.4 76830.3 lineto
67692 77233.7 lineto
67288.5 76830.3 lineto
67692 76426.8 lineto
poly0
newpath
69741.5 78476.4 moveto
70145 78879.8 lineto
69741.5 79283.3 lineto
69338.1 78879.8 lineto
69741.5 78476.4 lineto
poly0
newpath
69741.5 76426.8 moveto
70145 76830.3 lineto
69741.5 77233.7 lineto
69338.1 76830.3 lineto
69741.5 76426.8 lineto
poly0
newpath
71791.1 78476.4 moveto
72194.5 78879.8 lineto
71791.1 79283.3 lineto
71387.6 78879.8 lineto
71791.1 78476.4 lineto
poly0
newpath
71791.1 76426.8 moveto
72194.5 76830.3 lineto
71791.1 77233.7 lineto
71387.6 76830.3 lineto
71791.1 76426.8 lineto
poly0
newpath
73840.6 78476.4 moveto
74244.1 78879.8 lineto
73840.6 79283.3 lineto
73437.2 78879.8 lineto
73840.6 78476.4 lineto
poly0
newpath
73840.6 76426.8 moveto
74244.1 76830.3 lineto
73840.6 77233.7 lineto
73437.2 76830.3 lineto
73840.6 76426.8 lineto
poly0
newpath
75890.2 78476.4 moveto
76293.6 78879.8 lineto
75890.2 79283.3 lineto
75486.7 78879.8 lineto
75890.2 78476.4 lineto
poly0
newpath
75890.2 76426.8 moveto
76293.6 76830.3 lineto
75890.2 77233.7 lineto
75486.7 76830.3 lineto
75890.2 76426.8 lineto
poly0
newpath
77939.7 78476.4 moveto
78343.2 78879.8 lineto
77939.7 79283.3 lineto
77536.3 78879.8 lineto
77939.7 78476.4 lineto
poly0
newpath
77939.7 76426.8 moveto
78343.2 76830.3 lineto
77939.7 77233.7 lineto
77536.3 76830.3 lineto
77939.7 76426.8 lineto
poly0
96.829 setlinewidth
newpath
40995.4 40003 moveto
41963.7 39034.7 lineto
stroke
newpath
41963.7 40003 moveto
40995.4 39034.7 lineto
stroke
41479.6 39518.8 484.145 cir0
newpath
43819.6 40003 moveto
44787.9 39034.7 lineto
stroke
newpath
44787.9 40003 moveto
43819.6 39034.7 lineto
stroke
44303.8 39518.8 484.145 cir0
newpath
46643.8 40003 moveto
47612.1 39034.7 lineto
stroke
newpath
47612.1 40003 moveto
46643.8 39034.7 lineto
stroke
47127.9 39518.8 484.145 cir0
newpath
49468 40003 moveto
50436.3 39034.7 lineto
stroke
newpath
50436.3 40003 moveto
49468 39034.7 lineto
stroke
49952.1 39518.8 484.145 cir0
newpath
52292.2 40003 moveto
53260.4 39034.7 lineto
stroke
newpath
53260.4 40003 moveto
52292.2 39034.7 lineto
stroke
52776.3 39518.8 484.145 cir0
newpath
55116.3 40003 moveto
56084.6 39034.7 lineto
stroke
newpath
56084.6 40003 moveto
55116.3 39034.7 lineto
stroke
55600.5 39518.8 484.145 cir0
newpath
60805 40003 moveto
61773.3 39034.7 lineto
stroke
newpath
61773.3 40003 moveto
60805 39034.7 lineto
stroke
61289.2 39518.8 484.145 cir0
newpath
63629.2 40003 moveto
64597.5 39034.7 lineto
stroke
newpath
64597.5 40003 moveto
63629.2 39034.7 lineto
stroke
64113.4 39518.8 484.145 cir0
newpath
66453.4 40003 moveto
67421.7 39034.7 lineto
stroke
newpath
67421.7 40003 moveto
66453.4 39034.7 lineto
stroke
66937.5 39518.8 484.145 cir0
newpath
69277.6 40003 moveto
70245.9 39034.7 lineto
stroke
newpath
70245.9 40003 moveto
69277.6 39034.7 lineto
stroke
69761.7 39518.8 484.145 cir0
newpath
72101.7 40003 moveto
73070 39034.7 lineto
stroke
newpath
73070 40003 moveto
72101.7 39034.7 lineto
stroke
72585.9 39518.8 484.145 cir0
newpath
74925.9 40003 moveto
75894.2 39034.7 lineto
stroke
newpath
75894.2 40003 moveto
74925.9 39034.7 lineto
stroke
75410.1 39518.8 484.145 cir0
161.382 setlinewidth
78.7405 setlinewidth
0 0 0 setrgbcolor
0 0 0 setrgbcolor
newpath
33214.4 33818.2 moveto
33214.4 34605.6 lineto
33401.9 34605.6 lineto
33514.4 34568.1 lineto
33589.3 34493.1 lineto
33626.8 34418.1 lineto
33664.3 34268.1 lineto
33664.3 34155.6 lineto
33626.8 34005.6 lineto
33589.3 33930.6 lineto
33514.4 33855.7 lineto
33401.9 33818.2 lineto
33214.4 33818.2 lineto
stroke
newpath
34001.8 33818.2 moveto
34001.8 34343.1 lineto
stroke
newpath
34001.8 34193.1 moveto
34039.3 34268.1 lineto
34076.8 34305.6 lineto
34151.8 34343.1 lineto
34226.8 34343.1 lineto
stroke
newpath
34489.2 33818.2 moveto
34489.2 34343.1 lineto
stroke
newpath
34489.2 34605.6 moveto
34451.7 34568.1 lineto
34489.2 34530.6 lineto
34526.7 34568.1 lineto
34489.2 34605.6 lineto
34489.2 34530.6 lineto
stroke
newpath
34976.7 33818.2 moveto
34901.7 33855.7 lineto
34864.2 33930.6 lineto
34864.2 34605.6 lineto
stroke
newpath
35389.1 33818.2 moveto
35314.1 33855.7 lineto
35276.6 33930.6 lineto
35276.6 34605.6 lineto
stroke
newpath
36289 33818.2 moveto
36289 34605.6 lineto
36551.5 34043.1 lineto
36813.9 34605.6 lineto
36813.9 33818.2 lineto
stroke
newpath
37526.4 33818.2 moveto
37526.4 34230.6 lineto
37488.9 34305.6 lineto
37413.9 34343.1 lineto
37263.9 34343.1 lineto
37188.9 34305.6 lineto
stroke
newpath
37526.4 33855.7 moveto
37451.4 33818.2 lineto
37263.9 33818.2 lineto
37188.9 33855.7 lineto
37151.4 33930.6 lineto
37151.4 34005.6 lineto
37188.9 34080.6 lineto
37263.9 34118.1 lineto
37451.4 34118.1 lineto
37526.4 34155.6 lineto
stroke
newpath
37901.3 34343.1 moveto
37901.3 33555.7 lineto
stroke
newpath
37901.3 34305.6 moveto
37976.3 34343.1 lineto
38126.3 34343.1 lineto
38201.3 34305.6 lineto
38238.8 34268.1 lineto
38276.3 34193.1 lineto
38276.3 33968.1 lineto
38238.8 33893.1 lineto
38201.3 33855.7 lineto
38126.3 33818.2 lineto
37976.3 33818.2 lineto
37901.3 33855.7 lineto
stroke
newpath
38613.7 33893.1 moveto
38651.2 33855.7 lineto
38613.7 33818.2 lineto
38576.2 33855.7 lineto
38613.7 33893.1 lineto
38613.7 33818.2 lineto
stroke
newpath
38613.7 34305.6 moveto
38651.2 34268.1 lineto
38613.7 34230.6 lineto
38576.2 34268.1 lineto
38613.7 34305.6 lineto
38613.7 34230.6 lineto
stroke
24.2072 setlinewidth
newpath
31958.1 32641.9 moveto
32200.1 32399.8 lineto
stroke
newpath
32200.1 32641.9 moveto
31958.1 32399.8 lineto
stroke
161.382 setlinewidth
78.7405 setlinewidth
0 0 0 setrgbcolor
0 0 0 setrgbcolor
newpath
33364.4 32952 moveto
33439.4 32952 lineto
33514.4 32914.5 lineto
33551.9 32877 lineto
33589.3 32802 lineto
33626.8 32652.1 lineto
33626.8 32464.6 lineto
33589.3 32314.6 lineto
33551.9 32239.6 lineto
33514.4 32202.1 lineto
33439.4 32164.6 lineto
33364.4 32164.6 lineto
33289.4 32202.1 lineto
33251.9 32239.6 lineto
33214.4 32314.6 lineto
33176.9 32464.6 lineto
33176.9 32652.1 lineto
33214.4 32802 lineto
33251.9 32877 lineto
33289.4 32914.5 lineto
33364.4 32952 lineto
stroke
newpath
33964.3 32239.6 moveto
34001.8 32202.1 lineto
33964.3 32164.6 lineto
33926.8 32202.1 lineto
33964.3 32239.6 lineto
33964.3 32164.6 lineto
stroke
newpath
34264.3 32952 moveto
34751.7 32952 lineto
34489.2 32652.1 lineto
34601.7 32652.1 lineto
34676.7 32614.6 lineto
34714.2 32577.1 lineto
34751.7 32502.1 lineto
34751.7 32314.6 lineto
34714.2 32239.6 lineto
34676.7 32202.1 lineto
34601.7 32164.6 lineto
34376.7 32164.6 lineto
34301.8 32202.1 lineto
34264.3 32239.6 lineto
stroke
newpath
35239.1 32952 moveto
35314.1 32952 lineto
35389.1 32914.5 lineto
35426.6 32877 lineto
35464.1 32802 lineto
35501.6 32652.1 lineto
35501.6 32464.6 lineto
35464.1 32314.6 lineto
35426.6 32239.6 lineto
35389.1 32202.1 lineto
35314.1 32164.6 lineto
35239.1 32164.6 lineto
35164.2 32202.1 lineto
35126.7 32239.6 lineto
35089.2 32314.6 lineto
35051.7 32464.6 lineto
35051.7 32652.1 lineto
35089.2 32802 lineto
35126.7 32877 lineto
35164.2 32914.5 lineto
35239.1 32952 lineto
stroke
newpath
35989 32952 moveto
36064 32952 lineto
36139 32914.5 lineto
36176.5 32877 lineto
36214 32802 lineto
36251.5 32652.1 lineto
36251.5 32464.6 lineto
36214 32314.6 lineto
36176.5 32239.6 lineto
36139 32202.1 lineto
36064 32164.6 lineto
35989 32164.6 lineto
35914.1 32202.1 lineto
35876.6 32239.6 lineto
35839.1 32314.6 lineto
35801.6 32464.6 lineto
35801.6 32652.1 lineto
35839.1 32802 lineto
35876.6 32877 lineto
35914.1 32914.5 lineto
35989 32952 lineto
stroke
newpath
36589 32164.6 moveto
36589 32689.5 lineto
stroke
newpath
36589 32614.6 moveto
36626.5 32652.1 lineto
36701.5 32689.5 lineto
36813.9 32689.5 lineto
36888.9 32652.1 lineto
36926.4 32577.1 lineto
36926.4 32164.6 lineto
stroke
newpath
36926.4 32577.1 moveto
36963.9 32652.1 lineto
37038.9 32689.5 lineto
37151.4 32689.5 lineto
37226.4 32652.1 lineto
37263.9 32577.1 lineto
37263.9 32164.6 lineto
stroke
newpath
37638.8 32164.6 moveto
37638.8 32689.5 lineto
stroke
newpath
37638.8 32614.6 moveto
37676.3 32652.1 lineto
37751.3 32689.5 lineto
37863.8 32689.5 lineto
37938.8 32652.1 lineto
37976.3 32577.1 lineto
37976.3 32164.6 lineto
stroke
newpath
37976.3 32577.1 moveto
38013.8 32652.1 lineto
38088.8 32689.5 lineto
38201.3 32689.5 lineto
38276.3 32652.1 lineto
38313.8 32577.1 lineto
38313.8 32164.6 lineto
stroke
newpath
39851.1 32989.5 moveto
39176.1 31977.1 lineto
stroke
newpath
40863.4 32952 moveto
40938.4 32952 lineto
41013.4 32914.5 lineto
41050.9 32877 lineto
41088.4 32802 lineto
41125.9 32652.1 lineto
41125.9 32464.6 lineto
41088.4 32314.6 lineto
41050.9 32239.6 lineto
41013.4 32202.1 lineto
40938.4 32164.6 lineto
40863.4 32164.6 lineto
40788.4 32202.1 lineto
40751 32239.6 lineto
40713.5 32314.6 lineto
40676 32464.6 lineto
40676 32652.1 lineto
40713.5 32802 lineto
40751 32877 lineto
40788.4 32914.5 lineto
40863.4 32952 lineto
stroke
newpath
41463.4 32239.6 moveto
41500.9 32202.1 lineto
41463.4 32164.6 lineto
41425.9 32202.1 lineto
41463.4 32239.6 lineto
41463.4 32164.6 lineto
stroke
newpath
41988.3 32952 moveto
42063.3 32952 lineto
42138.3 32914.5 lineto
42175.8 32877 lineto
42213.3 32802 lineto
42250.8 32652.1 lineto
42250.8 32464.6 lineto
42213.3 32314.6 lineto
42175.8 32239.6 lineto
42138.3 32202.1 lineto
42063.3 32164.6 lineto
41988.3 32164.6 lineto
41913.3 32202.1 lineto
41875.8 32239.6 lineto
41838.3 32314.6 lineto
41800.8 32464.6 lineto
41800.8 32652.1 lineto
41838.3 32802 lineto
41875.8 32877 lineto
41913.3 32914.5 lineto
41988.3 32952 lineto
stroke
newpath
43000.7 32164.6 moveto
42550.7 32164.6 lineto
stroke
newpath
42775.7 32164.6 moveto
42775.7 32952 lineto
42700.7 32839.5 lineto
42625.7 32764.5 lineto
42550.7 32727 lineto
stroke
newpath
43750.6 32164.6 moveto
43300.6 32164.6 lineto
stroke
newpath
43525.6 32164.6 moveto
43525.6 32952 lineto
43450.6 32839.5 lineto
43375.6 32764.5 lineto
43300.6 32727 lineto
stroke
newpath
44200.5 32614.6 moveto
44125.5 32652.1 lineto
44088 32689.5 lineto
44050.5 32764.5 lineto
44050.5 32802 lineto
44088 32877 lineto
44125.5 32914.5 lineto
44200.5 32952 lineto
44350.5 32952 lineto
44425.5 32914.5 lineto
44463 32877 lineto
44500.5 32802 lineto
44500.5 32764.5 lineto
44463 32689.5 lineto
44425.5 32652.1 lineto
44350.5 32614.6 lineto
44200.5 32614.6 lineto
44125.5 32577.1 lineto
44088 32539.6 lineto
44050.5 32464.6 lineto
44050.5 32314.6 lineto
44088 32239.6 lineto
44125.5 32202.1 lineto
44200.5 32164.6 lineto
44350.5 32164.6 lineto
44425.5 32202.1 lineto
44463 32239.6 lineto
44500.5 32314.6 lineto
44500.5 32464.6 lineto
44463 32539.6 lineto
44425.5 32577.1 lineto
44350.5 32614.6 lineto
stroke
newpath
44800.4 32952 moveto
44800.4 32802 lineto
stroke
newpath
45100.4 32952 moveto
45100.4 32802 lineto
stroke
newpath
46262.8 31864.6 moveto
46225.3 31902.1 lineto
46150.3 32014.6 lineto
46112.8 32089.6 lineto
46075.3 32202.1 lineto
46037.8 32389.6 lineto
46037.8 32539.6 lineto
46075.3 32727 lineto
46112.8 32839.5 lineto
46150.3 32914.5 lineto
46225.3 33027 lineto
46262.8 33064.5 lineto
stroke
newpath
46900.2 32952 moveto
46750.2 32952 lineto
46675.2 32914.5 lineto
46637.7 32877 lineto
46562.7 32764.5 lineto
46525.2 32614.6 lineto
46525.2 32314.6 lineto
46562.7 32239.6 lineto
46600.2 32202.1 lineto
46675.2 32164.6 lineto
46825.2 32164.6 lineto
46900.2 32202.1 lineto
46937.7 32239.6 lineto
46975.2 32314.6 lineto
46975.2 32502.1 lineto
46937.7 32577.1 lineto
46900.2 32614.6 lineto
46825.2 32652.1 lineto
46675.2 32652.1 lineto
46600.2 32614.6 lineto
46562.7 32577.1 lineto
46525.2 32502.1 lineto
stroke
newpath
47650.1 32952 moveto
47500.1 32952 lineto
47425.1 32914.5 lineto
47387.6 32877 lineto
47312.6 32764.5 lineto
47275.1 32614.6 lineto
47275.1 32314.6 lineto
47312.6 32239.6 lineto
47350.1 32202.1 lineto
47425.1 32164.6 lineto
47575.1 32164.6 lineto
47650.1 32202.1 lineto
47687.6 32239.6 lineto
47725.1 32314.6 lineto
47725.1 32502.1 lineto
47687.6 32577.1 lineto
47650.1 32614.6 lineto
47575.1 32652.1 lineto
47425.1 32652.1 lineto
47350.1 32614.6 lineto
47312.6 32577.1 lineto
47275.1 32502.1 lineto
stroke
newpath
48662.5 32164.6 moveto
48662.5 32952 lineto
stroke
newpath
48999.9 32164.6 moveto
48999.9 32577.1 lineto
48962.4 32652.1 lineto
48887.4 32689.5 lineto
48775 32689.5 lineto
48700 32652.1 lineto
48662.5 32614.6 lineto
stroke
newpath
49487.4 32164.6 moveto
49412.4 32202.1 lineto
49374.9 32239.6 lineto
49337.4 32314.6 lineto
49337.4 32539.6 lineto
49374.9 32614.6 lineto
49412.4 32652.1 lineto
49487.4 32689.5 lineto
49599.8 32689.5 lineto
49674.8 32652.1 lineto
49712.3 32614.6 lineto
49749.8 32539.6 lineto
49749.8 32314.6 lineto
49712.3 32239.6 lineto
49674.8 32202.1 lineto
49599.8 32164.6 lineto
49487.4 32164.6 lineto
stroke
newpath
50199.8 32164.6 moveto
50124.8 32202.1 lineto
50087.3 32277.1 lineto
50087.3 32952 lineto
stroke
newpath
50799.7 32202.1 moveto
50724.7 32164.6 lineto
50574.7 32164.6 lineto
50499.7 32202.1 lineto
50462.2 32277.1 lineto
50462.2 32577.1 lineto
50499.7 32652.1 lineto
50574.7 32689.5 lineto
50724.7 32689.5 lineto
50799.7 32652.1 lineto
50837.2 32577.1 lineto
50837.2 32502.1 lineto
50462.2 32427.1 lineto
stroke
newpath
51137.2 32202.1 moveto
51212.1 32164.6 lineto
51362.1 32164.6 lineto
51437.1 32202.1 lineto
51474.6 32277.1 lineto
51474.6 32314.6 lineto
51437.1 32389.6 lineto
51362.1 32427.1 lineto
51249.6 32427.1 lineto
51174.7 32464.6 lineto
51137.2 32539.6 lineto
51137.2 32577.1 lineto
51174.7 32652.1 lineto
51249.6 32689.5 lineto
51362.1 32689.5 lineto
51437.1 32652.1 lineto
stroke
newpath
51737.1 31864.6 moveto
51774.6 31902.1 lineto
51849.6 32014.6 lineto
51887.1 32089.6 lineto
51924.6 32202.1 lineto
51962.1 32389.6 lineto
51962.1 32539.6 lineto
51924.6 32727 lineto
51887.1 32839.5 lineto
51849.6 32914.5 lineto
51774.6 33027 lineto
51737.1 33064.5 lineto
stroke
28.2418 setlinewidth
32058.9 31481.4 141.209 cir0
161.382 setlinewidth
78.7405 setlinewidth
0 0 0 setrgbcolor
0 0 0 setrgbcolor
newpath
33364.4 31912.6 moveto
33439.4 31912.6 lineto
33514.4 31875.1 lineto
33551.9 31837.7 lineto
33589.3 31762.7 lineto
33626.8 31612.7 lineto
33626.8 31425.2 lineto
33589.3 31275.2 lineto
33551.9 31200.2 lineto
33514.4 31162.7 lineto
33439.4 31125.2 lineto
33364.4 31125.2 lineto
33289.4 31162.7 lineto
33251.9 31200.2 lineto
33214.4 31275.2 lineto
33176.9 31425.2 lineto
33176.9 31612.7 lineto
33214.4 31762.7 lineto
33251.9 31837.7 lineto
33289.4 31875.1 lineto
33364.4 31912.6 lineto
stroke
newpath
33964.3 31200.2 moveto
34001.8 31162.7 lineto
33964.3 31125.2 lineto
33926.8 31162.7 lineto
33964.3 31200.2 lineto
33964.3 31125.2 lineto
stroke
newpath
34264.3 31912.6 moveto
34751.7 31912.6 lineto
34489.2 31612.7 lineto
34601.7 31612.7 lineto
34676.7 31575.2 lineto
34714.2 31537.7 lineto
34751.7 31462.7 lineto
34751.7 31275.2 lineto
34714.2 31200.2 lineto
34676.7 31162.7 lineto
34601.7 31125.2 lineto
34376.7 31125.2 lineto
34301.8 31162.7 lineto
34264.3 31200.2 lineto
stroke
newpath
35464.1 31912.6 moveto
35089.2 31912.6 lineto
35051.7 31537.7 lineto
35089.2 31575.2 lineto
35164.2 31612.7 lineto
35351.6 31612.7 lineto
35426.6 31575.2 lineto
35464.1 31537.7 lineto
35501.6 31462.7 lineto
35501.6 31275.2 lineto
35464.1 31200.2 lineto
35426.6 31162.7 lineto
35351.6 31125.2 lineto
35164.2 31125.2 lineto
35089.2 31162.7 lineto
35051.7 31200.2 lineto
stroke
newpath
35989 31912.6 moveto
36064 31912.6 lineto
36139 31875.1 lineto
36176.5 31837.7 lineto
36214 31762.7 lineto
36251.5 31612.7 lineto
36251.5 31425.2 lineto
36214 31275.2 lineto
36176.5 31200.2 lineto
36139 31162.7 lineto
36064 31125.2 lineto
35989 31125.2 lineto
35914.1 31162.7 lineto
35876.6 31200.2 lineto
35839.1 31275.2 lineto
35801.6 31425.2 lineto
35801.6 31612.7 lineto
35839.1 31762.7 lineto
35876.6 31837.7 lineto
35914.1 31875.1 lineto
35989 31912.6 lineto
stroke
newpath
36589 31125.2 moveto
36589 31650.2 lineto
stroke
newpath
36589 31575.2 moveto
36626.5 31612.7 lineto
36701.5 31650.2 lineto
36813.9 31650.2 lineto
36888.9 31612.7 lineto
36926.4 31537.7 lineto
36926.4 31125.2 lineto
stroke
newpath
36926.4 31537.7 moveto
36963.9 31612.7 lineto
37038.9 31650.2 lineto
37151.4 31650.2 lineto
37226.4 31612.7 lineto
37263.9 31537.7 lineto
37263.9 31125.2 lineto
stroke
newpath
37638.8 31125.2 moveto
37638.8 31650.2 lineto
stroke
newpath
37638.8 31575.2 moveto
37676.3 31612.7 lineto
37751.3 31650.2 lineto
37863.8 31650.2 lineto
37938.8 31612.7 lineto
37976.3 31537.7 lineto
37976.3 31125.2 lineto
stroke
newpath
37976.3 31537.7 moveto
38013.8 31612.7 lineto
38088.8 31650.2 lineto
38201.3 31650.2 lineto
38276.3 31612.7 lineto
38313.8 31537.7 lineto
38313.8 31125.2 lineto
stroke
newpath
39851.1 31950.1 moveto
39176.1 30937.8 lineto
stroke
newpath
40863.4 31912.6 moveto
40938.4 31912.6 lineto
41013.4 31875.1 lineto
41050.9 31837.7 lineto
41088.4 31762.7 lineto
41125.9 31612.7 lineto
41125.9 31425.2 lineto
41088.4 31275.2 lineto
41050.9 31200.2 lineto
41013.4 31162.7 lineto
40938.4 31125.2 lineto
40863.4 31125.2 lineto
40788.4 31162.7 lineto
40751 31200.2 lineto
40713.5 31275.2 lineto
40676 31425.2 lineto
40676 31612.7 lineto
40713.5 31762.7 lineto
40751 31837.7 lineto
40788.4 31875.1 lineto
40863.4 31912.6 lineto
stroke
newpath
41463.4 31200.2 moveto
41500.9 31162.7 lineto
41463.4 31125.2 lineto
41425.9 31162.7 lineto
41463.4 31200.2 lineto
41463.4 31125.2 lineto
stroke
newpath
41988.3 31912.6 moveto
42063.3 31912.6 lineto
42138.3 31875.1 lineto
42175.8 31837.7 lineto
42213.3 31762.7 lineto
42250.8 31612.7 lineto
42250.8 31425.2 lineto
42213.3 31275.2 lineto
42175.8 31200.2 lineto
42138.3 31162.7 lineto
42063.3 31125.2 lineto
41988.3 31125.2 lineto
41913.3 31162.7 lineto
41875.8 31200.2 lineto
41838.3 31275.2 lineto
41800.8 31425.2 lineto
41800.8 31612.7 lineto
41838.3 31762.7 lineto
41875.8 31837.7 lineto
41913.3 31875.1 lineto
41988.3 31912.6 lineto
stroke
newpath
43000.7 31125.2 moveto
42550.7 31125.2 lineto
stroke
newpath
42775.7 31125.2 moveto
42775.7 31912.6 lineto
42700.7 31800.2 lineto
42625.7 31725.2 lineto
42550.7 31687.7 lineto
stroke
newpath
43263.1 31912.6 moveto
43750.6 31912.6 lineto
43488.1 31612.7 lineto
43600.6 31612.7 lineto
43675.6 31575.2 lineto
43713.1 31537.7 lineto
43750.6 31462.7 lineto
43750.6 31275.2 lineto
43713.1 31200.2 lineto
43675.6 31162.7 lineto
43600.6 31125.2 lineto
43375.6 31125.2 lineto
43300.6 31162.7 lineto
43263.1 31200.2 lineto
stroke
newpath
44200.5 31575.2 moveto
44125.5 31612.7 lineto
44088 31650.2 lineto
44050.5 31725.2 lineto
44050.5 31762.7 lineto
44088 31837.7 lineto
44125.5 31875.1 lineto
44200.5 31912.6 lineto
44350.5 31912.6 lineto
44425.5 31875.1 lineto
44463 31837.7 lineto
44500.5 31762.7 lineto
44500.5 31725.2 lineto
44463 31650.2 lineto
44425.5 31612.7 lineto
44350.5 31575.2 lineto
44200.5 31575.2 lineto
44125.5 31537.7 lineto
44088 31500.2 lineto
44050.5 31425.2 lineto
44050.5 31275.2 lineto
44088 31200.2 lineto
44125.5 31162.7 lineto
44200.5 31125.2 lineto
44350.5 31125.2 lineto
44425.5 31162.7 lineto
44463 31200.2 lineto
44500.5 31275.2 lineto
44500.5 31425.2 lineto
44463 31500.2 lineto
44425.5 31537.7 lineto
44350.5 31575.2 lineto
stroke
newpath
44800.4 31912.6 moveto
44800.4 31762.7 lineto
stroke
newpath
45100.4 31912.6 moveto
45100.4 31762.7 lineto
stroke
newpath
46262.8 30825.3 moveto
46225.3 30862.8 lineto
46150.3 30975.3 lineto
46112.8 31050.3 lineto
46075.3 31162.7 lineto
46037.8 31350.2 lineto
46037.8 31500.2 lineto
46075.3 31687.7 lineto
46112.8 31800.2 lineto
46150.3 31875.1 lineto
46225.3 31987.6 lineto
46262.8 32025.1 lineto
stroke
newpath
46600.2 31125.2 moveto
46750.2 31125.2 lineto
46825.2 31162.7 lineto
46862.7 31200.2 lineto
46937.7 31312.7 lineto
46975.2 31462.7 lineto
46975.2 31762.7 lineto
46937.7 31837.7 lineto
46900.2 31875.1 lineto
46825.2 31912.6 lineto
46675.2 31912.6 lineto
46600.2 31875.1 lineto
46562.7 31837.7 lineto
46525.2 31762.7 lineto
46525.2 31575.2 lineto
46562.7 31500.2 lineto
46600.2 31462.7 lineto
46675.2 31425.2 lineto
46825.2 31425.2 lineto
46900.2 31462.7 lineto
46937.7 31500.2 lineto
46975.2 31575.2 lineto
stroke
newpath
47912.6 31125.2 moveto
47912.6 31912.6 lineto
stroke
newpath
48250 31125.2 moveto
48250 31537.7 lineto
48212.5 31612.7 lineto
48137.5 31650.2 lineto
48025 31650.2 lineto
47950.1 31612.7 lineto
47912.6 31575.2 lineto
stroke
newpath
48737.5 31125.2 moveto
48662.5 31162.7 lineto
48625 31200.2 lineto
48587.5 31275.2 lineto
48587.5 31500.2 lineto
48625 31575.2 lineto
48662.5 31612.7 lineto
48737.5 31650.2 lineto
48849.9 31650.2 lineto
48924.9 31612.7 lineto
48962.4 31575.2 lineto
48999.9 31500.2 lineto
48999.9 31275.2 lineto
48962.4 31200.2 lineto
48924.9 31162.7 lineto
48849.9 31125.2 lineto
48737.5 31125.2 lineto
stroke
newpath
49449.9 31125.2 moveto
49374.9 31162.7 lineto
49337.4 31237.7 lineto
49337.4 31912.6 lineto
stroke
newpath
50049.8 31162.7 moveto
49974.8 31125.2 lineto
49824.8 31125.2 lineto
49749.8 31162.7 lineto
49712.3 31237.7 lineto
49712.3 31537.7 lineto
49749.8 31612.7 lineto
49824.8 31650.2 lineto
49974.8 31650.2 lineto
50049.8 31612.7 lineto
50087.3 31537.7 lineto
50087.3 31462.7 lineto
49712.3 31387.7 lineto
stroke
newpath
50387.3 31162.7 moveto
50462.2 31125.2 lineto
50612.2 31125.2 lineto
50687.2 31162.7 lineto
50724.7 31237.7 lineto
50724.7 31275.2 lineto
50687.2 31350.2 lineto
50612.2 31387.7 lineto
50499.7 31387.7 lineto
50424.7 31425.2 lineto
50387.3 31500.2 lineto
50387.3 31537.7 lineto
50424.7 31612.7 lineto
50499.7 31650.2 lineto
50612.2 31650.2 lineto
50687.2 31612.7 lineto
stroke
newpath
50987.2 30825.3 moveto
51024.7 30862.8 lineto
51099.7 30975.3 lineto
51137.2 31050.3 lineto
51174.7 31162.7 lineto
51212.1 31350.2 lineto
51212.1 31500.2 lineto
51174.7 31687.7 lineto
51137.2 31800.2 lineto
51099.7 31875.1 lineto
51024.7 31987.6 lineto
50987.2 32025.1 lineto
stroke
32.2763 setlinewidth
newpath
32038.8 30603.5 moveto
32038.8 30280.7 lineto
stroke
newpath
31877.4 30442.1 moveto
32200.1 30442.1 lineto
stroke
161.382 setlinewidth
78.7405 setlinewidth
0 0 0 setrgbcolor
0 0 0 setrgbcolor
newpath
33364.4 30873.3 moveto
33439.4 30873.3 lineto
33514.4 30835.8 lineto
33551.9 30798.3 lineto
33589.3 30723.3 lineto
33626.8 30573.3 lineto
33626.8 30385.8 lineto
33589.3 30235.9 lineto
33551.9 30160.9 lineto
33514.4 30123.4 lineto
33439.4 30085.9 lineto
33364.4 30085.9 lineto
33289.4 30123.4 lineto
33251.9 30160.9 lineto
33214.4 30235.9 lineto
33176.9 30385.8 lineto
33176.9 30573.3 lineto
33214.4 30723.3 lineto
33251.9 30798.3 lineto
33289.4 30835.8 lineto
33364.4 30873.3 lineto
stroke
newpath
33964.3 30160.9 moveto
34001.8 30123.4 lineto
33964.3 30085.9 lineto
33926.8 30123.4 lineto
33964.3 30160.9 lineto
33964.3 30085.9 lineto
stroke
newpath
34676.7 30610.8 moveto
34676.7 30085.9 lineto
stroke
newpath
34489.2 30910.8 moveto
34301.8 30348.3 lineto
34789.2 30348.3 lineto
stroke
newpath
35239.1 30873.3 moveto
35314.1 30873.3 lineto
35389.1 30835.8 lineto
35426.6 30798.3 lineto
35464.1 30723.3 lineto
35501.6 30573.3 lineto
35501.6 30385.8 lineto
35464.1 30235.9 lineto
35426.6 30160.9 lineto
35389.1 30123.4 lineto
35314.1 30085.9 lineto
35239.1 30085.9 lineto
35164.2 30123.4 lineto
35126.7 30160.9 lineto
35089.2 30235.9 lineto
35051.7 30385.8 lineto
35051.7 30573.3 lineto
35089.2 30723.3 lineto
35126.7 30798.3 lineto
35164.2 30835.8 lineto
35239.1 30873.3 lineto
stroke
newpath
35989 30873.3 moveto
36064 30873.3 lineto
36139 30835.8 lineto
36176.5 30798.3 lineto
36214 30723.3 lineto
36251.5 30573.3 lineto
36251.5 30385.8 lineto
36214 30235.9 lineto
36176.5 30160.9 lineto
36139 30123.4 lineto
36064 30085.9 lineto
35989 30085.9 lineto
35914.1 30123.4 lineto
35876.6 30160.9 lineto
35839.1 30235.9 lineto
35801.6 30385.8 lineto
35801.6 30573.3 lineto
35839.1 30723.3 lineto
35876.6 30798.3 lineto
35914.1 30835.8 lineto
35989 30873.3 lineto
stroke
newpath
36589 30085.9 moveto
36589 30610.8 lineto
stroke
newpath
36589 30535.8 moveto
36626.5 30573.3 lineto
36701.5 30610.8 lineto
36813.9 30610.8 lineto
36888.9 30573.3 lineto
36926.4 30498.3 lineto
36926.4 30085.9 lineto
stroke
newpath
36926.4 30498.3 moveto
36963.9 30573.3 lineto
37038.9 30610.8 lineto
37151.4 30610.8 lineto
37226.4 30573.3 lineto
37263.9 30498.3 lineto
37263.9 30085.9 lineto
stroke
newpath
37638.8 30085.9 moveto
37638.8 30610.8 lineto
stroke
newpath
37638.8 30535.8 moveto
37676.3 30573.3 lineto
37751.3 30610.8 lineto
37863.8 30610.8 lineto
37938.8 30573.3 lineto
37976.3 30498.3 lineto
37976.3 30085.9 lineto
stroke
newpath
37976.3 30498.3 moveto
38013.8 30573.3 lineto
38088.8 30610.8 lineto
38201.3 30610.8 lineto
38276.3 30573.3 lineto
38313.8 30498.3 lineto
38313.8 30085.9 lineto
stroke
newpath
39851.1 30910.8 moveto
39176.1 29898.4 lineto
stroke
newpath
40863.4 30873.3 moveto
40938.4 30873.3 lineto
41013.4 30835.8 lineto
41050.9 30798.3 lineto
41088.4 30723.3 lineto
41125.9 30573.3 lineto
41125.9 30385.8 lineto
41088.4 30235.9 lineto
41050.9 30160.9 lineto
41013.4 30123.4 lineto
40938.4 30085.9 lineto
40863.4 30085.9 lineto
40788.4 30123.4 lineto
40751 30160.9 lineto
40713.5 30235.9 lineto
40676 30385.8 lineto
40676 30573.3 lineto
40713.5 30723.3 lineto
40751 30798.3 lineto
40788.4 30835.8 lineto
40863.4 30873.3 lineto
stroke
newpath
41463.4 30160.9 moveto
41500.9 30123.4 lineto
41463.4 30085.9 lineto
41425.9 30123.4 lineto
41463.4 30160.9 lineto
41463.4 30085.9 lineto
stroke
newpath
41988.3 30873.3 moveto
42063.3 30873.3 lineto
42138.3 30835.8 lineto
42175.8 30798.3 lineto
42213.3 30723.3 lineto
42250.8 30573.3 lineto
42250.8 30385.8 lineto
42213.3 30235.9 lineto
42175.8 30160.9 lineto
42138.3 30123.4 lineto
42063.3 30085.9 lineto
41988.3 30085.9 lineto
41913.3 30123.4 lineto
41875.8 30160.9 lineto
41838.3 30235.9 lineto
41800.8 30385.8 lineto
41800.8 30573.3 lineto
41838.3 30723.3 lineto
41875.8 30798.3 lineto
41913.3 30835.8 lineto
41988.3 30873.3 lineto
stroke
newpath
43000.7 30085.9 moveto
42550.7 30085.9 lineto
stroke
newpath
42775.7 30085.9 moveto
42775.7 30873.3 lineto
42700.7 30760.8 lineto
42625.7 30685.8 lineto
42550.7 30648.3 lineto
stroke
newpath
43713.1 30873.3 moveto
43338.1 30873.3 lineto
43300.6 30498.3 lineto
43338.1 30535.8 lineto
43413.1 30573.3 lineto
43600.6 30573.3 lineto
43675.6 30535.8 lineto
43713.1 30498.3 lineto
43750.6 30423.3 lineto
43750.6 30235.9 lineto
43713.1 30160.9 lineto
43675.6 30123.4 lineto
43600.6 30085.9 lineto
43413.1 30085.9 lineto
43338.1 30123.4 lineto
43300.6 30160.9 lineto
stroke
newpath
44013 30873.3 moveto
44538 30873.3 lineto
44200.5 30085.9 lineto
stroke
newpath
44800.4 30873.3 moveto
44800.4 30723.3 lineto
stroke
newpath
45100.4 30873.3 moveto
45100.4 30723.3 lineto
stroke
newpath
46262.8 29785.9 moveto
46225.3 29823.4 lineto
46150.3 29935.9 lineto
46112.8 30010.9 lineto
46075.3 30123.4 lineto
46037.8 30310.8 lineto
46037.8 30460.8 lineto
46075.3 30648.3 lineto
46112.8 30760.8 lineto
46150.3 30835.8 lineto
46225.3 30948.3 lineto
46262.8 30985.8 lineto
stroke
newpath
46487.7 30873.3 moveto
46975.2 30873.3 lineto
46712.7 30573.3 lineto
46825.2 30573.3 lineto
46900.2 30535.8 lineto
46937.7 30498.3 lineto
46975.2 30423.3 lineto
46975.2 30235.9 lineto
46937.7 30160.9 lineto
46900.2 30123.4 lineto
46825.2 30085.9 lineto
46600.2 30085.9 lineto
46525.2 30123.4 lineto
46487.7 30160.9 lineto
stroke
newpath
47275.1 30798.3 moveto
47312.6 30835.8 lineto
47387.6 30873.3 lineto
47575.1 30873.3 lineto
47650.1 30835.8 lineto
47687.6 30798.3 lineto
47725.1 30723.3 lineto
47725.1 30648.3 lineto
47687.6 30535.8 lineto
47237.6 30085.9 lineto
47725.1 30085.9 lineto
stroke
newpath
48662.5 30085.9 moveto
48662.5 30873.3 lineto
stroke
newpath
48999.9 30085.9 moveto
48999.9 30498.3 lineto
48962.4 30573.3 lineto
48887.4 30610.8 lineto
48775 30610.8 lineto
48700 30573.3 lineto
48662.5 30535.8 lineto
stroke
newpath
49487.4 30085.9 moveto
49412.4 30123.4 lineto
49374.9 30160.9 lineto
49337.4 30235.9 lineto
49337.4 30460.8 lineto
49374.9 30535.8 lineto
49412.4 30573.3 lineto
49487.4 30610.8 lineto
49599.8 30610.8 lineto
49674.8 30573.3 lineto
49712.3 30535.8 lineto
49749.8 30460.8 lineto
49749.8 30235.9 lineto
49712.3 30160.9 lineto
49674.8 30123.4 lineto
49599.8 30085.9 lineto
49487.4 30085.9 lineto
stroke
newpath
50199.8 30085.9 moveto
50124.8 30123.4 lineto
50087.3 30198.4 lineto
50087.3 30873.3 lineto
stroke
newpath
50799.7 30123.4 moveto
50724.7 30085.9 lineto
50574.7 30085.9 lineto
50499.7 30123.4 lineto
50462.2 30198.4 lineto
50462.2 30498.3 lineto
50499.7 30573.3 lineto
50574.7 30610.8 lineto
50724.7 30610.8 lineto
50799.7 30573.3 lineto
50837.2 30498.3 lineto
50837.2 30423.3 lineto
50462.2 30348.3 lineto
stroke
newpath
51137.2 30123.4 moveto
51212.1 30085.9 lineto
51362.1 30085.9 lineto
51437.1 30123.4 lineto
51474.6 30198.4 lineto
51474.6 30235.9 lineto
51437.1 30310.8 lineto
51362.1 30348.3 lineto
51249.6 30348.3 lineto
51174.7 30385.8 lineto
51137.2 30460.8 lineto
51137.2 30498.3 lineto
51174.7 30573.3 lineto
51249.6 30610.8 lineto
51362.1 30610.8 lineto
51437.1 30573.3 lineto
stroke
newpath
51737.1 29785.9 moveto
51774.6 29823.4 lineto
51849.6 29935.9 lineto
51887.1 30010.9 lineto
51924.6 30123.4 lineto
51962.1 30310.8 lineto
51962.1 30460.8 lineto
51924.6 30648.3 lineto
51887.1 30760.8 lineto
51849.6 30835.8 lineto
51774.6 30948.3 lineto
51737.1 30985.8 lineto
stroke
40.3454 setlinewidth
newpath
32141.1 29260.1 moveto
32141.1 29545.4 lineto
31855.8 29545.4 lineto
31855.8 29260.1 lineto
32141.1 29260.1 lineto
poly0
161.382 setlinewidth
78.7405 setlinewidth
0 0 0 setrgbcolor
0 0 0 setrgbcolor
newpath
33364.4 29833.9 moveto
33439.4 29833.9 lineto
33514.4 29796.4 lineto
33551.9 29758.9 lineto
33589.3 29683.9 lineto
33626.8 29533.9 lineto
33626.8 29346.5 lineto
33589.3 29196.5 lineto
33551.9 29121.5 lineto
33514.4 29084 lineto
33439.4 29046.5 lineto
33364.4 29046.5 lineto
33289.4 29084 lineto
33251.9 29121.5 lineto
33214.4 29196.5 lineto
33176.9 29346.5 lineto
33176.9 29533.9 lineto
33214.4 29683.9 lineto
33251.9 29758.9 lineto
33289.4 29796.4 lineto
33364.4 29833.9 lineto
stroke
newpath
33964.3 29121.5 moveto
34001.8 29084 lineto
33964.3 29046.5 lineto
33926.8 29084 lineto
33964.3 29121.5 lineto
33964.3 29046.5 lineto
stroke
newpath
34714.2 29833.9 moveto
34339.3 29833.9 lineto
34301.8 29459 lineto
34339.3 29496.4 lineto
34414.2 29533.9 lineto
34601.7 29533.9 lineto
34676.7 29496.4 lineto
34714.2 29459 lineto
34751.7 29384 lineto
34751.7 29196.5 lineto
34714.2 29121.5 lineto
34676.7 29084 lineto
34601.7 29046.5 lineto
34414.2 29046.5 lineto
34339.3 29084 lineto
34301.8 29121.5 lineto
stroke
newpath
35239.1 29833.9 moveto
35314.1 29833.9 lineto
35389.1 29796.4 lineto
35426.6 29758.9 lineto
35464.1 29683.9 lineto
35501.6 29533.9 lineto
35501.6 29346.5 lineto
35464.1 29196.5 lineto
35426.6 29121.5 lineto
35389.1 29084 lineto
35314.1 29046.5 lineto
35239.1 29046.5 lineto
35164.2 29084 lineto
35126.7 29121.5 lineto
35089.2 29196.5 lineto
35051.7 29346.5 lineto
35051.7 29533.9 lineto
35089.2 29683.9 lineto
35126.7 29758.9 lineto
35164.2 29796.4 lineto
35239.1 29833.9 lineto
stroke
newpath
35989 29833.9 moveto
36064 29833.9 lineto
36139 29796.4 lineto
36176.5 29758.9 lineto
36214 29683.9 lineto
36251.5 29533.9 lineto
36251.5 29346.5 lineto
36214 29196.5 lineto
36176.5 29121.5 lineto
36139 29084 lineto
36064 29046.5 lineto
35989 29046.5 lineto
35914.1 29084 lineto
35876.6 29121.5 lineto
35839.1 29196.5 lineto
35801.6 29346.5 lineto
35801.6 29533.9 lineto
35839.1 29683.9 lineto
35876.6 29758.9 lineto
35914.1 29796.4 lineto
35989 29833.9 lineto
stroke
newpath
36589 29046.5 moveto
36589 29571.4 lineto
stroke
newpath
36589 29496.4 moveto
36626.5 29533.9 lineto
36701.5 29571.4 lineto
36813.9 29571.4 lineto
36888.9 29533.9 lineto
36926.4 29459 lineto
36926.4 29046.5 lineto
stroke
newpath
36926.4 29459 moveto
36963.9 29533.9 lineto
37038.9 29571.4 lineto
37151.4 29571.4 lineto
37226.4 29533.9 lineto
37263.9 29459 lineto
37263.9 29046.5 lineto
stroke
newpath
37638.8 29046.5 moveto
37638.8 29571.4 lineto
stroke
newpath
37638.8 29496.4 moveto
37676.3 29533.9 lineto
37751.3 29571.4 lineto
37863.8 29571.4 lineto
37938.8 29533.9 lineto
37976.3 29459 lineto
37976.3 29046.5 lineto
stroke
newpath
37976.3 29459 moveto
38013.8 29533.9 lineto
38088.8 29571.4 lineto
38201.3 29571.4 lineto
38276.3 29533.9 lineto
38313.8 29459 lineto
38313.8 29046.5 lineto
stroke
newpath
39851.1 29871.4 moveto
39176.1 28859 lineto
stroke
newpath
40863.4 29833.9 moveto
40938.4 29833.9 lineto
41013.4 29796.4 lineto
41050.9 29758.9 lineto
41088.4 29683.9 lineto
41125.9 29533.9 lineto
41125.9 29346.5 lineto
41088.4 29196.5 lineto
41050.9 29121.5 lineto
41013.4 29084 lineto
40938.4 29046.5 lineto
40863.4 29046.5 lineto
40788.4 29084 lineto
40751 29121.5 lineto
40713.5 29196.5 lineto
40676 29346.5 lineto
40676 29533.9 lineto
40713.5 29683.9 lineto
40751 29758.9 lineto
40788.4 29796.4 lineto
40863.4 29833.9 lineto
stroke
newpath
41463.4 29121.5 moveto
41500.9 29084 lineto
41463.4 29046.5 lineto
41425.9 29084 lineto
41463.4 29121.5 lineto
41463.4 29046.5 lineto
stroke
newpath
41988.3 29833.9 moveto
42063.3 29833.9 lineto
42138.3 29796.4 lineto
42175.8 29758.9 lineto
42213.3 29683.9 lineto
42250.8 29533.9 lineto
42250.8 29346.5 lineto
42213.3 29196.5 lineto
42175.8 29121.5 lineto
42138.3 29084 lineto
42063.3 29046.5 lineto
41988.3 29046.5 lineto
41913.3 29084 lineto
41875.8 29121.5 lineto
41838.3 29196.5 lineto
41800.8 29346.5 lineto
41800.8 29533.9 lineto
41838.3 29683.9 lineto
41875.8 29758.9 lineto
41913.3 29796.4 lineto
41988.3 29833.9 lineto
stroke
newpath
43000.7 29046.5 moveto
42550.7 29046.5 lineto
stroke
newpath
42775.7 29046.5 moveto
42775.7 29833.9 lineto
42700.7 29721.4 lineto
42625.7 29646.4 lineto
42550.7 29608.9 lineto
stroke
newpath
43375.6 29046.5 moveto
43525.6 29046.5 lineto
43600.6 29084 lineto
43638.1 29121.5 lineto
43713.1 29234 lineto
43750.6 29384 lineto
43750.6 29683.9 lineto
43713.1 29758.9 lineto
43675.6 29796.4 lineto
43600.6 29833.9 lineto
43450.6 29833.9 lineto
43375.6 29796.4 lineto
43338.1 29758.9 lineto
43300.6 29683.9 lineto
43300.6 29496.4 lineto
43338.1 29421.5 lineto
43375.6 29384 lineto
43450.6 29346.5 lineto
43600.6 29346.5 lineto
43675.6 29384 lineto
43713.1 29421.5 lineto
43750.6 29496.4 lineto
stroke
newpath
44013 29833.9 moveto
44538 29833.9 lineto
44200.5 29046.5 lineto
stroke
newpath
44800.4 29833.9 moveto
44800.4 29683.9 lineto
stroke
newpath
45100.4 29833.9 moveto
45100.4 29683.9 lineto
stroke
newpath
46262.8 28746.5 moveto
46225.3 28784 lineto
46150.3 28896.5 lineto
46112.8 28971.5 lineto
46075.3 29084 lineto
46037.8 29271.5 lineto
46037.8 29421.5 lineto
46075.3 29608.9 lineto
46112.8 29721.4 lineto
46150.3 29796.4 lineto
46225.3 29908.9 lineto
46262.8 29946.4 lineto
stroke
newpath
46712.7 29833.9 moveto
46787.7 29833.9 lineto
46862.7 29796.4 lineto
46900.2 29758.9 lineto
46937.7 29683.9 lineto
46975.2 29533.9 lineto
46975.2 29346.5 lineto
46937.7 29196.5 lineto
46900.2 29121.5 lineto
46862.7 29084 lineto
46787.7 29046.5 lineto
46712.7 29046.5 lineto
46637.7 29084 lineto
46600.2 29121.5 lineto
46562.7 29196.5 lineto
46525.2 29346.5 lineto
46525.2 29533.9 lineto
46562.7 29683.9 lineto
46600.2 29758.9 lineto
46637.7 29796.4 lineto
46712.7 29833.9 lineto
stroke
newpath
47912.6 29046.5 moveto
47912.6 29833.9 lineto
stroke
newpath
48250 29046.5 moveto
48250 29459 lineto
48212.5 29533.9 lineto
48137.5 29571.4 lineto
48025 29571.4 lineto
47950.1 29533.9 lineto
47912.6 29496.4 lineto
stroke
newpath
48737.5 29046.5 moveto
48662.5 29084 lineto
48625 29121.5 lineto
48587.5 29196.5 lineto
48587.5 29421.5 lineto
48625 29496.4 lineto
48662.5 29533.9 lineto
48737.5 29571.4 lineto
48849.9 29571.4 lineto
48924.9 29533.9 lineto
48962.4 29496.4 lineto
48999.9 29421.5 lineto
48999.9 29196.5 lineto
48962.4 29121.5 lineto
48924.9 29084 lineto
48849.9 29046.5 lineto
48737.5 29046.5 lineto
stroke
newpath
49449.9 29046.5 moveto
49374.9 29084 lineto
49337.4 29159 lineto
49337.4 29833.9 lineto
stroke
newpath
50049.8 29084 moveto
49974.8 29046.5 lineto
49824.8 29046.5 lineto
49749.8 29084 lineto
49712.3 29159 lineto
49712.3 29459 lineto
49749.8 29533.9 lineto
49824.8 29571.4 lineto
49974.8 29571.4 lineto
50049.8 29533.9 lineto
50087.3 29459 lineto
50087.3 29384 lineto
49712.3 29309 lineto
stroke
newpath
50387.3 29084 moveto
50462.2 29046.5 lineto
50612.2 29046.5 lineto
50687.2 29084 lineto
50724.7 29159 lineto
50724.7 29196.5 lineto
50687.2 29271.5 lineto
50612.2 29309 lineto
50499.7 29309 lineto
50424.7 29346.5 lineto
50387.3 29421.5 lineto
50387.3 29459 lineto
50424.7 29533.9 lineto
50499.7 29571.4 lineto
50612.2 29571.4 lineto
50687.2 29533.9 lineto
stroke
newpath
51662.1 29346.5 moveto
52262 29346.5 lineto
stroke
newpath
51962.1 29046.5 moveto
51962.1 29646.4 lineto
stroke
newpath
53199.4 29758.9 moveto
53236.9 29796.4 lineto
53311.9 29833.9 lineto
53499.4 29833.9 lineto
53574.4 29796.4 lineto
53611.8 29758.9 lineto
53649.3 29683.9 lineto
53649.3 29608.9 lineto
53611.8 29496.4 lineto
53161.9 29046.5 lineto
53649.3 29046.5 lineto
stroke
newpath
54549.2 29084 moveto
54624.2 29046.5 lineto
54774.2 29046.5 lineto
54849.2 29084 lineto
54886.7 29159 lineto
54886.7 29196.5 lineto
54849.2 29271.5 lineto
54774.2 29309 lineto
54661.7 29309 lineto
54586.7 29346.5 lineto
54549.2 29421.5 lineto
54549.2 29459 lineto
54586.7 29533.9 lineto
54661.7 29571.4 lineto
54774.2 29571.4 lineto
54849.2 29533.9 lineto
stroke
newpath
55336.6 29046.5 moveto
55261.6 29084 lineto
55224.1 29159 lineto
55224.1 29833.9 lineto
stroke
newpath
55749.1 29046.5 moveto
55674.1 29084 lineto
55636.6 29121.5 lineto
55599.1 29196.5 lineto
55599.1 29421.5 lineto
55636.6 29496.4 lineto
55674.1 29533.9 lineto
55749.1 29571.4 lineto
55861.6 29571.4 lineto
55936.6 29533.9 lineto
55974.1 29496.4 lineto
56011.6 29421.5 lineto
56011.6 29196.5 lineto
55974.1 29121.5 lineto
55936.6 29084 lineto
55861.6 29046.5 lineto
55749.1 29046.5 lineto
stroke
newpath
56236.5 29571.4 moveto
56536.5 29571.4 lineto
stroke
newpath
56349 29833.9 moveto
56349 29159 lineto
56386.5 29084 lineto
56461.5 29046.5 lineto
56536.5 29046.5 lineto
stroke
newpath
56761.5 29084 moveto
56836.4 29046.5 lineto
56986.4 29046.5 lineto
57061.4 29084 lineto
57098.9 29159 lineto
57098.9 29196.5 lineto
57061.4 29271.5 lineto
56986.4 29309 lineto
56873.9 29309 lineto
56799 29346.5 lineto
56761.5 29421.5 lineto
56761.5 29459 lineto
56799 29533.9 lineto
56873.9 29571.4 lineto
56986.4 29571.4 lineto
57061.4 29533.9 lineto
stroke
newpath
57361.4 28746.5 moveto
57398.9 28784 lineto
57473.9 28896.5 lineto
57511.4 28971.5 lineto
57548.9 29084 lineto
57586.4 29271.5 lineto
57586.4 29421.5 lineto
57548.9 29608.9 lineto
57511.4 29721.4 lineto
57473.9 29796.4 lineto
57398.9 29908.9 lineto
57361.4 29946.4 lineto
stroke
78.7397 setlinewidth
newpath
31806.4 27969.6 moveto
32200.1 28363.3 lineto
31806.4 28757 lineto
31412.7 28363.3 lineto
31806.4 27969.6 lineto
poly0
161.382 setlinewidth
78.7405 setlinewidth
0 0 0 setrgbcolor
0 0 0 setrgbcolor
newpath
33626.8 28007.1 moveto
33176.9 28007.1 lineto
stroke
newpath
33401.9 28007.1 moveto
33401.9 28794.5 lineto
33326.9 28682 lineto
33251.9 28607.1 lineto
33176.9 28569.6 lineto
stroke
newpath
33964.3 28082.1 moveto
34001.8 28044.6 lineto
33964.3 28007.1 lineto
33926.8 28044.6 lineto
33964.3 28082.1 lineto
33964.3 28007.1 lineto
stroke
newpath
34489.2 28794.5 moveto
34564.2 28794.5 lineto
34639.2 28757 lineto
34676.7 28719.5 lineto
34714.2 28644.6 lineto
34751.7 28494.6 lineto
34751.7 28307.1 lineto
34714.2 28157.1 lineto
34676.7 28082.1 lineto
34639.2 28044.6 lineto
34564.2 28007.1 lineto
34489.2 28007.1 lineto
34414.2 28044.6 lineto
34376.7 28082.1 lineto
34339.3 28157.1 lineto
34301.8 28307.1 lineto
34301.8 28494.6 lineto
34339.3 28644.6 lineto
34376.7 28719.5 lineto
34414.2 28757 lineto
34489.2 28794.5 lineto
stroke
newpath
35239.1 28794.5 moveto
35314.1 28794.5 lineto
35389.1 28757 lineto
35426.6 28719.5 lineto
35464.1 28644.6 lineto
35501.6 28494.6 lineto
35501.6 28307.1 lineto
35464.1 28157.1 lineto
35426.6 28082.1 lineto
35389.1 28044.6 lineto
35314.1 28007.1 lineto
35239.1 28007.1 lineto
35164.2 28044.6 lineto
35126.7 28082.1 lineto
35089.2 28157.1 lineto
35051.7 28307.1 lineto
35051.7 28494.6 lineto
35089.2 28644.6 lineto
35126.7 28719.5 lineto
35164.2 28757 lineto
35239.1 28794.5 lineto
stroke
newpath
35989 28794.5 moveto
36064 28794.5 lineto
36139 28757 lineto
36176.5 28719.5 lineto
36214 28644.6 lineto
36251.5 28494.6 lineto
36251.5 28307.1 lineto
36214 28157.1 lineto
36176.5 28082.1 lineto
36139 28044.6 lineto
36064 28007.1 lineto
35989 28007.1 lineto
35914.1 28044.6 lineto
35876.6 28082.1 lineto
35839.1 28157.1 lineto
35801.6 28307.1 lineto
35801.6 28494.6 lineto
35839.1 28644.6 lineto
35876.6 28719.5 lineto
35914.1 28757 lineto
35989 28794.5 lineto
stroke
newpath
36589 28007.1 moveto
36589 28532.1 lineto
stroke
newpath
36589 28457.1 moveto
36626.5 28494.6 lineto
36701.5 28532.1 lineto
36813.9 28532.1 lineto
36888.9 28494.6 lineto
36926.4 28419.6 lineto
36926.4 28007.1 lineto
stroke
newpath
36926.4 28419.6 moveto
36963.9 28494.6 lineto
37038.9 28532.1 lineto
37151.4 28532.1 lineto
37226.4 28494.6 lineto
37263.9 28419.6 lineto
37263.9 28007.1 lineto
stroke
newpath
37638.8 28007.1 moveto
37638.8 28532.1 lineto
stroke
newpath
37638.8 28457.1 moveto
37676.3 28494.6 lineto
37751.3 28532.1 lineto
37863.8 28532.1 lineto
37938.8 28494.6 lineto
37976.3 28419.6 lineto
37976.3 28007.1 lineto
stroke
newpath
37976.3 28419.6 moveto
38013.8 28494.6 lineto
38088.8 28532.1 lineto
38201.3 28532.1 lineto
38276.3 28494.6 lineto
38313.8 28419.6 lineto
38313.8 28007.1 lineto
stroke
newpath
39851.1 28832 moveto
39176.1 27819.7 lineto
stroke
newpath
40863.4 28794.5 moveto
40938.4 28794.5 lineto
41013.4 28757 lineto
41050.9 28719.5 lineto
41088.4 28644.6 lineto
41125.9 28494.6 lineto
41125.9 28307.1 lineto
41088.4 28157.1 lineto
41050.9 28082.1 lineto
41013.4 28044.6 lineto
40938.4 28007.1 lineto
40863.4 28007.1 lineto
40788.4 28044.6 lineto
40751 28082.1 lineto
40713.5 28157.1 lineto
40676 28307.1 lineto
40676 28494.6 lineto
40713.5 28644.6 lineto
40751 28719.5 lineto
40788.4 28757 lineto
40863.4 28794.5 lineto
stroke
newpath
41463.4 28082.1 moveto
41500.9 28044.6 lineto
41463.4 28007.1 lineto
41425.9 28044.6 lineto
41463.4 28082.1 lineto
41463.4 28007.1 lineto
stroke
newpath
41988.3 28794.5 moveto
42063.3 28794.5 lineto
42138.3 28757 lineto
42175.8 28719.5 lineto
42213.3 28644.6 lineto
42250.8 28494.6 lineto
42250.8 28307.1 lineto
42213.3 28157.1 lineto
42175.8 28082.1 lineto
42138.3 28044.6 lineto
42063.3 28007.1 lineto
41988.3 28007.1 lineto
41913.3 28044.6 lineto
41875.8 28082.1 lineto
41838.3 28157.1 lineto
41800.8 28307.1 lineto
41800.8 28494.6 lineto
41838.3 28644.6 lineto
41875.8 28719.5 lineto
41913.3 28757 lineto
41988.3 28794.5 lineto
stroke
newpath
42513.2 28794.5 moveto
43000.7 28794.5 lineto
42738.2 28494.6 lineto
42850.7 28494.6 lineto
42925.7 28457.1 lineto
42963.2 28419.6 lineto
43000.7 28344.6 lineto
43000.7 28157.1 lineto
42963.2 28082.1 lineto
42925.7 28044.6 lineto
42850.7 28007.1 lineto
42625.7 28007.1 lineto
42550.7 28044.6 lineto
42513.2 28082.1 lineto
stroke
newpath
43375.6 28007.1 moveto
43525.6 28007.1 lineto
43600.6 28044.6 lineto
43638.1 28082.1 lineto
43713.1 28194.6 lineto
43750.6 28344.6 lineto
43750.6 28644.6 lineto
43713.1 28719.5 lineto
43675.6 28757 lineto
43600.6 28794.5 lineto
43450.6 28794.5 lineto
43375.6 28757 lineto
43338.1 28719.5 lineto
43300.6 28644.6 lineto
43300.6 28457.1 lineto
43338.1 28382.1 lineto
43375.6 28344.6 lineto
43450.6 28307.1 lineto
43600.6 28307.1 lineto
43675.6 28344.6 lineto
43713.1 28382.1 lineto
43750.6 28457.1 lineto
stroke
newpath
44425.5 28532.1 moveto
44425.5 28007.1 lineto
stroke
newpath
44238 28832 moveto
44050.5 28269.6 lineto
44538 28269.6 lineto
stroke
newpath
44800.4 28794.5 moveto
44800.4 28644.6 lineto
stroke
newpath
45100.4 28794.5 moveto
45100.4 28644.6 lineto
stroke
newpath
46262.8 27707.2 moveto
46225.3 27744.7 lineto
46150.3 27857.2 lineto
46112.8 27932.1 lineto
46075.3 28044.6 lineto
46037.8 28232.1 lineto
46037.8 28382.1 lineto
46075.3 28569.6 lineto
46112.8 28682 lineto
46150.3 28757 lineto
46225.3 28869.5 lineto
46262.8 28907 lineto
stroke
newpath
46937.7 28794.5 moveto
46562.7 28794.5 lineto
46525.2 28419.6 lineto
46562.7 28457.1 lineto
46637.7 28494.6 lineto
46825.2 28494.6 lineto
46900.2 28457.1 lineto
46937.7 28419.6 lineto
46975.2 28344.6 lineto
46975.2 28157.1 lineto
46937.7 28082.1 lineto
46900.2 28044.6 lineto
46825.2 28007.1 lineto
46637.7 28007.1 lineto
46562.7 28044.6 lineto
46525.2 28082.1 lineto
stroke
newpath
47687.6 28794.5 moveto
47312.6 28794.5 lineto
47275.1 28419.6 lineto
47312.6 28457.1 lineto
47387.6 28494.6 lineto
47575.1 28494.6 lineto
47650.1 28457.1 lineto
47687.6 28419.6 lineto
47725.1 28344.6 lineto
47725.1 28157.1 lineto
47687.6 28082.1 lineto
47650.1 28044.6 lineto
47575.1 28007.1 lineto
47387.6 28007.1 lineto
47312.6 28044.6 lineto
47275.1 28082.1 lineto
stroke
newpath
48662.5 28007.1 moveto
48662.5 28794.5 lineto
stroke
newpath
48999.9 28007.1 moveto
48999.9 28419.6 lineto
48962.4 28494.6 lineto
48887.4 28532.1 lineto
48775 28532.1 lineto
48700 28494.6 lineto
48662.5 28457.1 lineto
stroke
newpath
49487.4 28007.1 moveto
49412.4 28044.6 lineto
49374.9 28082.1 lineto
49337.4 28157.1 lineto
49337.4 28382.1 lineto
49374.9 28457.1 lineto
49412.4 28494.6 lineto
49487.4 28532.1 lineto
49599.8 28532.1 lineto
49674.8 28494.6 lineto
49712.3 28457.1 lineto
49749.8 28382.1 lineto
49749.8 28157.1 lineto
49712.3 28082.1 lineto
49674.8 28044.6 lineto
49599.8 28007.1 lineto
49487.4 28007.1 lineto
stroke
newpath
50199.8 28007.1 moveto
50124.8 28044.6 lineto
50087.3 28119.6 lineto
50087.3 28794.5 lineto
stroke
newpath
50799.7 28044.6 moveto
50724.7 28007.1 lineto
50574.7 28007.1 lineto
50499.7 28044.6 lineto
50462.2 28119.6 lineto
50462.2 28419.6 lineto
50499.7 28494.6 lineto
50574.7 28532.1 lineto
50724.7 28532.1 lineto
50799.7 28494.6 lineto
50837.2 28419.6 lineto
50837.2 28344.6 lineto
50462.2 28269.6 lineto
stroke
newpath
51137.2 28044.6 moveto
51212.1 28007.1 lineto
51362.1 28007.1 lineto
51437.1 28044.6 lineto
51474.6 28119.6 lineto
51474.6 28157.1 lineto
51437.1 28232.1 lineto
51362.1 28269.6 lineto
51249.6 28269.6 lineto
51174.7 28307.1 lineto
51137.2 28382.1 lineto
51137.2 28419.6 lineto
51174.7 28494.6 lineto
51249.6 28532.1 lineto
51362.1 28532.1 lineto
51437.1 28494.6 lineto
stroke
newpath
51737.1 27707.2 moveto
51774.6 27744.7 lineto
51849.6 27857.2 lineto
51887.1 27932.1 lineto
51924.6 28044.6 lineto
51962.1 28232.1 lineto
51962.1 28382.1 lineto
51924.6 28569.6 lineto
51887.1 28682 lineto
51849.6 28757 lineto
51774.6 28869.5 lineto
51737.1 28907 lineto
stroke
78.7397 setlinewidth
newpath
31412.7 27497.2 moveto
32200.1 26709.8 lineto
stroke
newpath
32200.1 27497.2 moveto
31412.7 26709.8 lineto
stroke
31806.4 27103.5 393.701 cir0
161.382 setlinewidth
78.7405 setlinewidth
0 0 0 setrgbcolor
0 0 0 setrgbcolor
newpath
33626.8 26747.3 moveto
33176.9 26747.3 lineto
stroke
newpath
33401.9 26747.3 moveto
33401.9 27534.7 lineto
33326.9 27422.2 lineto
33251.9 27347.2 lineto
33176.9 27309.7 lineto
stroke
newpath
33964.3 26822.3 moveto
34001.8 26784.8 lineto
33964.3 26747.3 lineto
33926.8 26784.8 lineto
33964.3 26822.3 lineto
33964.3 26747.3 lineto
stroke
newpath
34301.8 27459.7 moveto
34339.3 27497.2 lineto
34414.2 27534.7 lineto
34601.7 27534.7 lineto
34676.7 27497.2 lineto
34714.2 27459.7 lineto
34751.7 27384.7 lineto
34751.7 27309.7 lineto
34714.2 27197.2 lineto
34264.3 26747.3 lineto
34751.7 26747.3 lineto
stroke
newpath
35239.1 27534.7 moveto
35314.1 27534.7 lineto
35389.1 27497.2 lineto
35426.6 27459.7 lineto
35464.1 27384.7 lineto
35501.6 27234.7 lineto
35501.6 27047.3 lineto
35464.1 26897.3 lineto
35426.6 26822.3 lineto
35389.1 26784.8 lineto
35314.1 26747.3 lineto
35239.1 26747.3 lineto
35164.2 26784.8 lineto
35126.7 26822.3 lineto
35089.2 26897.3 lineto
35051.7 27047.3 lineto
35051.7 27234.7 lineto
35089.2 27384.7 lineto
35126.7 27459.7 lineto
35164.2 27497.2 lineto
35239.1 27534.7 lineto
stroke
newpath
35989 27534.7 moveto
36064 27534.7 lineto
36139 27497.2 lineto
36176.5 27459.7 lineto
36214 27384.7 lineto
36251.5 27234.7 lineto
36251.5 27047.3 lineto
36214 26897.3 lineto
36176.5 26822.3 lineto
36139 26784.8 lineto
36064 26747.3 lineto
35989 26747.3 lineto
35914.1 26784.8 lineto
35876.6 26822.3 lineto
35839.1 26897.3 lineto
35801.6 27047.3 lineto
35801.6 27234.7 lineto
35839.1 27384.7 lineto
35876.6 27459.7 lineto
35914.1 27497.2 lineto
35989 27534.7 lineto
stroke
newpath
36589 26747.3 moveto
36589 27272.2 lineto
stroke
newpath
36589 27197.2 moveto
36626.5 27234.7 lineto
36701.5 27272.2 lineto
36813.9 27272.2 lineto
36888.9 27234.7 lineto
36926.4 27159.7 lineto
36926.4 26747.3 lineto
stroke
newpath
36926.4 27159.7 moveto
36963.9 27234.7 lineto
37038.9 27272.2 lineto
37151.4 27272.2 lineto
37226.4 27234.7 lineto
37263.9 27159.7 lineto
37263.9 26747.3 lineto
stroke
newpath
37638.8 26747.3 moveto
37638.8 27272.2 lineto
stroke
newpath
37638.8 27197.2 moveto
37676.3 27234.7 lineto
37751.3 27272.2 lineto
37863.8 27272.2 lineto
37938.8 27234.7 lineto
37976.3 27159.7 lineto
37976.3 26747.3 lineto
stroke
newpath
37976.3 27159.7 moveto
38013.8 27234.7 lineto
38088.8 27272.2 lineto
38201.3 27272.2 lineto
38276.3 27234.7 lineto
38313.8 27159.7 lineto
38313.8 26747.3 lineto
stroke
newpath
39851.1 27572.2 moveto
39176.1 26559.8 lineto
stroke
newpath
40863.4 27534.7 moveto
40938.4 27534.7 lineto
41013.4 27497.2 lineto
41050.9 27459.7 lineto
41088.4 27384.7 lineto
41125.9 27234.7 lineto
41125.9 27047.3 lineto
41088.4 26897.3 lineto
41050.9 26822.3 lineto
41013.4 26784.8 lineto
40938.4 26747.3 lineto
40863.4 26747.3 lineto
40788.4 26784.8 lineto
40751 26822.3 lineto
40713.5 26897.3 lineto
40676 27047.3 lineto
40676 27234.7 lineto
40713.5 27384.7 lineto
40751 27459.7 lineto
40788.4 27497.2 lineto
40863.4 27534.7 lineto
stroke
newpath
41463.4 26822.3 moveto
41500.9 26784.8 lineto
41463.4 26747.3 lineto
41425.9 26784.8 lineto
41463.4 26822.3 lineto
41463.4 26747.3 lineto
stroke
newpath
41988.3 27534.7 moveto
42063.3 27534.7 lineto
42138.3 27497.2 lineto
42175.8 27459.7 lineto
42213.3 27384.7 lineto
42250.8 27234.7 lineto
42250.8 27047.3 lineto
42213.3 26897.3 lineto
42175.8 26822.3 lineto
42138.3 26784.8 lineto
42063.3 26747.3 lineto
41988.3 26747.3 lineto
41913.3 26784.8 lineto
41875.8 26822.3 lineto
41838.3 26897.3 lineto
41800.8 27047.3 lineto
41800.8 27234.7 lineto
41838.3 27384.7 lineto
41875.8 27459.7 lineto
41913.3 27497.2 lineto
41988.3 27534.7 lineto
stroke
newpath
42925.7 27272.2 moveto
42925.7 26747.3 lineto
stroke
newpath
42738.2 27572.2 moveto
42550.7 27009.8 lineto
43038.2 27009.8 lineto
stroke
newpath
43263.1 27534.7 moveto
43788.1 27534.7 lineto
43450.6 26747.3 lineto
stroke
newpath
44050.5 27459.7 moveto
44088 27497.2 lineto
44163 27534.7 lineto
44350.5 27534.7 lineto
44425.5 27497.2 lineto
44463 27459.7 lineto
44500.5 27384.7 lineto
44500.5 27309.7 lineto
44463 27197.2 lineto
44013 26747.3 lineto
44500.5 26747.3 lineto
stroke
newpath
44800.4 27534.7 moveto
44800.4 27384.7 lineto
stroke
newpath
45100.4 27534.7 moveto
45100.4 27384.7 lineto
stroke
newpath
46262.8 26447.3 moveto
46225.3 26484.8 lineto
46150.3 26597.3 lineto
46112.8 26672.3 lineto
46075.3 26784.8 lineto
46037.8 26972.3 lineto
46037.8 27122.2 lineto
46075.3 27309.7 lineto
46112.8 27422.2 lineto
46150.3 27497.2 lineto
46225.3 27609.7 lineto
46262.8 27647.2 lineto
stroke
newpath
46975.2 26747.3 moveto
46525.2 26747.3 lineto
stroke
newpath
46750.2 26747.3 moveto
46750.2 27534.7 lineto
46675.2 27422.2 lineto
46600.2 27347.2 lineto
46525.2 27309.7 lineto
stroke
newpath
47275.1 27459.7 moveto
47312.6 27497.2 lineto
47387.6 27534.7 lineto
47575.1 27534.7 lineto
47650.1 27497.2 lineto
47687.6 27459.7 lineto
47725.1 27384.7 lineto
47725.1 27309.7 lineto
47687.6 27197.2 lineto
47237.6 26747.3 lineto
47725.1 26747.3 lineto
stroke
newpath
48662.5 26747.3 moveto
48662.5 27534.7 lineto
stroke
newpath
48999.9 26747.3 moveto
48999.9 27159.7 lineto
48962.4 27234.7 lineto
48887.4 27272.2 lineto
48775 27272.2 lineto
48700 27234.7 lineto
48662.5 27197.2 lineto
stroke
newpath
49487.4 26747.3 moveto
49412.4 26784.8 lineto
49374.9 26822.3 lineto
49337.4 26897.3 lineto
49337.4 27122.2 lineto
49374.9 27197.2 lineto
49412.4 27234.7 lineto
49487.4 27272.2 lineto
49599.8 27272.2 lineto
49674.8 27234.7 lineto
49712.3 27197.2 lineto
49749.8 27122.2 lineto
49749.8 26897.3 lineto
49712.3 26822.3 lineto
49674.8 26784.8 lineto
49599.8 26747.3 lineto
49487.4 26747.3 lineto
stroke
newpath
50199.8 26747.3 moveto
50124.8 26784.8 lineto
50087.3 26859.8 lineto
50087.3 27534.7 lineto
stroke
newpath
50799.7 26784.8 moveto
50724.7 26747.3 lineto
50574.7 26747.3 lineto
50499.7 26784.8 lineto
50462.2 26859.8 lineto
50462.2 27159.7 lineto
50499.7 27234.7 lineto
50574.7 27272.2 lineto
50724.7 27272.2 lineto
50799.7 27234.7 lineto
50837.2 27159.7 lineto
50837.2 27084.7 lineto
50462.2 27009.8 lineto
stroke
newpath
51137.2 26784.8 moveto
51212.1 26747.3 lineto
51362.1 26747.3 lineto
51437.1 26784.8 lineto
51474.6 26859.8 lineto
51474.6 26897.3 lineto
51437.1 26972.3 lineto
51362.1 27009.8 lineto
51249.6 27009.8 lineto
51174.7 27047.3 lineto
51137.2 27122.2 lineto
51137.2 27159.7 lineto
51174.7 27234.7 lineto
51249.6 27272.2 lineto
51362.1 27272.2 lineto
51437.1 27234.7 lineto
stroke
newpath
51737.1 26447.3 moveto
51774.6 26484.8 lineto
51849.6 26597.3 lineto
51887.1 26672.3 lineto
51924.6 26784.8 lineto
51962.1 26972.3 lineto
51962.1 27122.2 lineto
51924.6 27309.7 lineto
51887.1 27422.2 lineto
51849.6 27497.2 lineto
51774.6 27609.7 lineto
51737.1 27647.2 lineto
stroke
showpage
grestore
%%EOF
