(kicad_sch (version 20211123) (generator eeschema)

  (uuid d90936c5-6aad-4e94-8ea1-195af1c745f3)

  (paper "A4")

  (lib_symbols
    (symbol "Connector_Generic:Conn_01x06" (pin_names (offset 1.016) hide) (in_bom yes) (on_board yes)
      (property "Reference" "J" (id 0) (at 0 7.62 0)
        (effects (font (size 1.27 1.27)))
      )
      (property "Value" "Conn_01x06" (id 1) (at 0 -10.16 0)
        (effects (font (size 1.27 1.27)))
      )
      (property "Footprint" "" (id 2) (at 0 0 0)
        (effects (font (size 1.27 1.27)) hide)
      )
      (property "Datasheet" "~" (id 3) (at 0 0 0)
        (effects (font (size 1.27 1.27)) hide)
      )
      (property "ki_keywords" "connector" (id 4) (at 0 0 0)
        (effects (font (size 1.27 1.27)) hide)
      )
      (property "ki_description" "Generic connector, single row, 01x06, script generated (kicad-library-utils/schlib/autogen/connector/)" (id 5) (at 0 0 0)
        (effects (font (size 1.27 1.27)) hide)
      )
      (property "ki_fp_filters" "Connector*:*_1x??_*" (id 6) (at 0 0 0)
        (effects (font (size 1.27 1.27)) hide)
      )
      (symbol "Conn_01x06_1_1"
        (rectangle (start -1.27 -7.493) (end 0 -7.747)
          (stroke (width 0.1524) (type default) (color 0 0 0 0))
          (fill (type none))
        )
        (rectangle (start -1.27 -4.953) (end 0 -5.207)
          (stroke (width 0.1524) (type default) (color 0 0 0 0))
          (fill (type none))
        )
        (rectangle (start -1.27 -2.413) (end 0 -2.667)
          (stroke (width 0.1524) (type default) (color 0 0 0 0))
          (fill (type none))
        )
        (rectangle (start -1.27 0.127) (end 0 -0.127)
          (stroke (width 0.1524) (type default) (color 0 0 0 0))
          (fill (type none))
        )
        (rectangle (start -1.27 2.667) (end 0 2.413)
          (stroke (width 0.1524) (type default) (color 0 0 0 0))
          (fill (type none))
        )
        (rectangle (start -1.27 5.207) (end 0 4.953)
          (stroke (width 0.1524) (type default) (color 0 0 0 0))
          (fill (type none))
        )
        (rectangle (start -1.27 6.35) (end 1.27 -8.89)
          (stroke (width 0.254) (type default) (color 0 0 0 0))
          (fill (type background))
        )
        (pin passive line (at -5.08 5.08 0) (length 3.81)
          (name "Pin_1" (effects (font (size 1.27 1.27))))
          (number "1" (effects (font (size 1.27 1.27))))
        )
        (pin passive line (at -5.08 2.54 0) (length 3.81)
          (name "Pin_2" (effects (font (size 1.27 1.27))))
          (number "2" (effects (font (size 1.27 1.27))))
        )
        (pin passive line (at -5.08 0 0) (length 3.81)
          (name "Pin_3" (effects (font (size 1.27 1.27))))
          (number "3" (effects (font (size 1.27 1.27))))
        )
        (pin passive line (at -5.08 -2.54 0) (length 3.81)
          (name "Pin_4" (effects (font (size 1.27 1.27))))
          (number "4" (effects (font (size 1.27 1.27))))
        )
        (pin passive line (at -5.08 -5.08 0) (length 3.81)
          (name "Pin_5" (effects (font (size 1.27 1.27))))
          (number "5" (effects (font (size 1.27 1.27))))
        )
        (pin passive line (at -5.08 -7.62 0) (length 3.81)
          (name "Pin_6" (effects (font (size 1.27 1.27))))
          (number "6" (effects (font (size 1.27 1.27))))
        )
      )
    )
    (symbol "Device:LED" (pin_numbers hide) (pin_names (offset 1.016) hide) (in_bom yes) (on_board yes)
      (property "Reference" "D" (id 0) (at 0 2.54 0)
        (effects (font (size 1.27 1.27)))
      )
      (property "Value" "LED" (id 1) (at 0 -2.54 0)
        (effects (font (size 1.27 1.27)))
      )
      (property "Footprint" "" (id 2) (at 0 0 0)
        (effects (font (size 1.27 1.27)) hide)
      )
      (property "Datasheet" "~" (id 3) (at 0 0 0)
        (effects (font (size 1.27 1.27)) hide)
      )
      (property "ki_keywords" "LED diode" (id 4) (at 0 0 0)
        (effects (font (size 1.27 1.27)) hide)
      )
      (property "ki_description" "Light emitting diode" (id 5) (at 0 0 0)
        (effects (font (size 1.27 1.27)) hide)
      )
      (property "ki_fp_filters" "LED* LED_SMD:* LED_THT:*" (id 6) (at 0 0 0)
        (effects (font (size 1.27 1.27)) hide)
      )
      (symbol "LED_0_1"
        (polyline
          (pts
            (xy -1.27 -1.27)
            (xy -1.27 1.27)
          )
          (stroke (width 0.254) (type default) (color 0 0 0 0))
          (fill (type none))
        )
        (polyline
          (pts
            (xy -1.27 0)
            (xy 1.27 0)
          )
          (stroke (width 0) (type default) (color 0 0 0 0))
          (fill (type none))
        )
        (polyline
          (pts
            (xy 1.27 -1.27)
            (xy 1.27 1.27)
            (xy -1.27 0)
            (xy 1.27 -1.27)
          )
          (stroke (width 0.254) (type default) (color 0 0 0 0))
          (fill (type none))
        )
        (polyline
          (pts
            (xy -3.048 -0.762)
            (xy -4.572 -2.286)
            (xy -3.81 -2.286)
            (xy -4.572 -2.286)
            (xy -4.572 -1.524)
          )
          (stroke (width 0) (type default) (color 0 0 0 0))
          (fill (type none))
        )
        (polyline
          (pts
            (xy -1.778 -0.762)
            (xy -3.302 -2.286)
            (xy -2.54 -2.286)
            (xy -3.302 -2.286)
            (xy -3.302 -1.524)
          )
          (stroke (width 0) (type default) (color 0 0 0 0))
          (fill (type none))
        )
      )
      (symbol "LED_1_1"
        (pin passive line (at -3.81 0 0) (length 2.54)
          (name "K" (effects (font (size 1.27 1.27))))
          (number "1" (effects (font (size 1.27 1.27))))
        )
        (pin passive line (at 3.81 0 180) (length 2.54)
          (name "A" (effects (font (size 1.27 1.27))))
          (number "2" (effects (font (size 1.27 1.27))))
        )
      )
    )
    (symbol "Device:R" (pin_numbers hide) (pin_names (offset 0)) (in_bom yes) (on_board yes)
      (property "Reference" "R" (id 0) (at 2.032 0 90)
        (effects (font (size 1.27 1.27)))
      )
      (property "Value" "R" (id 1) (at 0 0 90)
        (effects (font (size 1.27 1.27)))
      )
      (property "Footprint" "" (id 2) (at -1.778 0 90)
        (effects (font (size 1.27 1.27)) hide)
      )
      (property "Datasheet" "~" (id 3) (at 0 0 0)
        (effects (font (size 1.27 1.27)) hide)
      )
      (property "ki_keywords" "R res resistor" (id 4) (at 0 0 0)
        (effects (font (size 1.27 1.27)) hide)
      )
      (property "ki_description" "Resistor" (id 5) (at 0 0 0)
        (effects (font (size 1.27 1.27)) hide)
      )
      (property "ki_fp_filters" "R_*" (id 6) (at 0 0 0)
        (effects (font (size 1.27 1.27)) hide)
      )
      (symbol "R_0_1"
        (rectangle (start -1.016 -2.54) (end 1.016 2.54)
          (stroke (width 0.254) (type default) (color 0 0 0 0))
          (fill (type none))
        )
      )
      (symbol "R_1_1"
        (pin passive line (at 0 3.81 270) (length 1.27)
          (name "~" (effects (font (size 1.27 1.27))))
          (number "1" (effects (font (size 1.27 1.27))))
        )
        (pin passive line (at 0 -3.81 90) (length 1.27)
          (name "~" (effects (font (size 1.27 1.27))))
          (number "2" (effects (font (size 1.27 1.27))))
        )
      )
    )
    (symbol "power:GND" (power) (pin_names (offset 0)) (in_bom yes) (on_board yes)
      (property "Reference" "#PWR" (id 0) (at 0 -6.35 0)
        (effects (font (size 1.27 1.27)) hide)
      )
      (property "Value" "GND" (id 1) (at 0 -3.81 0)
        (effects (font (size 1.27 1.27)))
      )
      (property "Footprint" "" (id 2) (at 0 0 0)
        (effects (font (size 1.27 1.27)) hide)
      )
      (property "Datasheet" "" (id 3) (at 0 0 0)
        (effects (font (size 1.27 1.27)) hide)
      )
      (property "ki_keywords" "power-flag" (id 4) (at 0 0 0)
        (effects (font (size 1.27 1.27)) hide)
      )
      (property "ki_description" "Power symbol creates a global label with name \"GND\" , ground" (id 5) (at 0 0 0)
        (effects (font (size 1.27 1.27)) hide)
      )
      (symbol "GND_0_1"
        (polyline
          (pts
            (xy 0 0)
            (xy 0 -1.27)
            (xy 1.27 -1.27)
            (xy 0 -2.54)
            (xy -1.27 -1.27)
            (xy 0 -1.27)
          )
          (stroke (width 0) (type default) (color 0 0 0 0))
          (fill (type none))
        )
      )
      (symbol "GND_1_1"
        (pin power_in line (at 0 0 270) (length 0) hide
          (name "GND" (effects (font (size 1.27 1.27))))
          (number "1" (effects (font (size 1.27 1.27))))
        )
      )
    )
  )

  (junction (at 87.63 88.9) (diameter 0) (color 0 0 0 0)
    (uuid 163f78e2-9776-48c2-9684-a12acc46625d)
  )
  (junction (at 59.69 44.45) (diameter 0) (color 0 0 0 0)
    (uuid 38bb4d15-6633-42cb-a1f7-5428d09f7029)
  )
  (junction (at 62.23 97.79) (diameter 0) (color 0 0 0 0)
    (uuid 4c4ac6bc-c955-4d24-ae05-092733924302)
  )
  (junction (at 59.69 83.82) (diameter 0) (color 0 0 0 0)
    (uuid 735b9dbd-0878-4c76-80aa-0c8fddee2681)
  )
  (junction (at 87.63 49.53) (diameter 0) (color 0 0 0 0)
    (uuid 81f07250-1dec-40ae-9305-ad695e89a8fe)
  )
  (junction (at 87.63 83.82) (diameter 0) (color 0 0 0 0)
    (uuid 852291a1-4438-410b-9149-5e73451bc39b)
  )
  (junction (at 87.63 44.45) (diameter 0) (color 0 0 0 0)
    (uuid 9391e617-6ad8-4d13-9813-5666bd99aa97)
  )
  (junction (at 62.23 58.42) (diameter 0) (color 0 0 0 0)
    (uuid bb8687fe-1da4-4664-bbea-61cea2fcfe53)
  )
  (junction (at 64.77 81.28) (diameter 0) (color 0 0 0 0)
    (uuid c97bd7b2-7b00-4ceb-b97f-019c3bc4e585)
  )
  (junction (at 64.77 41.91) (diameter 0) (color 0 0 0 0)
    (uuid d0580d89-6f64-4e23-9a1c-0674a394c9fd)
  )

  (wire (pts (xy 59.69 57.15) (xy 59.69 58.42))
    (stroke (width 0) (type default) (color 0 0 0 0))
    (uuid 06210024-ed9b-4bc2-a6e2-a5399de32b5b)
  )
  (wire (pts (xy 64.77 96.52) (xy 64.77 97.79))
    (stroke (width 0) (type default) (color 0 0 0 0))
    (uuid 0ab0f85e-233f-4d93-be78-3c21a6a204a4)
  )
  (wire (pts (xy 90.17 88.9) (xy 87.63 88.9))
    (stroke (width 0) (type default) (color 0 0 0 0))
    (uuid 0aefd893-9679-4414-b67b-2132c8e05a70)
  )
  (wire (pts (xy 85.09 39.37) (xy 85.09 36.83))
    (stroke (width 0) (type default) (color 0 0 0 0))
    (uuid 1b6812c4-8e20-49b7-94f7-7bc6d3553592)
  )
  (wire (pts (xy 90.17 44.45) (xy 87.63 44.45))
    (stroke (width 0) (type default) (color 0 0 0 0))
    (uuid 1da73623-6478-47f4-a53e-ef990a4c1f4b)
  )
  (wire (pts (xy 85.09 78.74) (xy 85.09 76.2))
    (stroke (width 0) (type default) (color 0 0 0 0))
    (uuid 23109a48-ae33-4f80-a715-0708c15976ee)
  )
  (wire (pts (xy 54.61 44.45) (xy 59.69 44.45))
    (stroke (width 0) (type default) (color 0 0 0 0))
    (uuid 28a8c4cb-cc37-40b0-b33f-91afbab01017)
  )
  (wire (pts (xy 80.01 96.52) (xy 80.01 99.06))
    (stroke (width 0) (type default) (color 0 0 0 0))
    (uuid 2a445e21-2c5f-4b4c-87f6-8455744e39d5)
  )
  (wire (pts (xy 59.69 96.52) (xy 59.69 97.79))
    (stroke (width 0) (type default) (color 0 0 0 0))
    (uuid 2b515521-1d04-45b0-bbde-4a40640c730f)
  )
  (wire (pts (xy 62.23 58.42) (xy 62.23 59.69))
    (stroke (width 0) (type default) (color 0 0 0 0))
    (uuid 2c81cfc1-3314-46f5-93e9-cabb8217b13c)
  )
  (wire (pts (xy 80.01 57.15) (xy 80.01 59.69))
    (stroke (width 0) (type default) (color 0 0 0 0))
    (uuid 32b726ca-b5b8-4be3-833e-27713d9f5026)
  )
  (wire (pts (xy 64.77 81.28) (xy 68.58 81.28))
    (stroke (width 0) (type default) (color 0 0 0 0))
    (uuid 3bb78126-01e1-408b-8dd8-8ba09193782c)
  )
  (wire (pts (xy 85.09 36.83) (xy 90.17 36.83))
    (stroke (width 0) (type default) (color 0 0 0 0))
    (uuid 3e0d7666-b919-4770-9c6b-39fdf8b0c3fc)
  )
  (wire (pts (xy 54.61 81.28) (xy 64.77 81.28))
    (stroke (width 0) (type default) (color 0 0 0 0))
    (uuid 42b47218-4f3c-4042-9e12-8229928ca184)
  )
  (wire (pts (xy 87.63 83.82) (xy 87.63 88.9))
    (stroke (width 0) (type default) (color 0 0 0 0))
    (uuid 44b88ce7-c144-4d5b-b538-83afeec3408c)
  )
  (wire (pts (xy 64.77 41.91) (xy 64.77 49.53))
    (stroke (width 0) (type default) (color 0 0 0 0))
    (uuid 4775d41f-6bf5-4c8f-bbdf-94413c8b30ff)
  )
  (wire (pts (xy 64.77 81.28) (xy 64.77 88.9))
    (stroke (width 0) (type default) (color 0 0 0 0))
    (uuid 4c0af920-a0b5-4c3b-acef-ba18bbbe8669)
  )
  (wire (pts (xy 87.63 78.74) (xy 87.63 83.82))
    (stroke (width 0) (type default) (color 0 0 0 0))
    (uuid 4c505905-eba3-4edd-a23a-3a30d43226c8)
  )
  (wire (pts (xy 59.69 83.82) (xy 59.69 88.9))
    (stroke (width 0) (type default) (color 0 0 0 0))
    (uuid 4d9b9811-81e0-451d-bb85-3446f6e0f679)
  )
  (wire (pts (xy 87.63 44.45) (xy 87.63 49.53))
    (stroke (width 0) (type default) (color 0 0 0 0))
    (uuid 59a91dc3-bc5d-466c-b1ee-932f19154794)
  )
  (wire (pts (xy 87.63 88.9) (xy 87.63 100.33))
    (stroke (width 0) (type default) (color 0 0 0 0))
    (uuid 5aaad85f-370c-40a9-aeab-f1881e74c37f)
  )
  (wire (pts (xy 59.69 44.45) (xy 68.58 44.45))
    (stroke (width 0) (type default) (color 0 0 0 0))
    (uuid 6370a258-de01-457c-bd4f-5f2b15863b06)
  )
  (wire (pts (xy 76.2 83.82) (xy 85.09 83.82))
    (stroke (width 0) (type default) (color 0 0 0 0))
    (uuid 64e195ad-5530-4cf9-b018-3d13e3313798)
  )
  (wire (pts (xy 87.63 39.37) (xy 87.63 44.45))
    (stroke (width 0) (type default) (color 0 0 0 0))
    (uuid 665b2867-281e-40a5-b034-11aa350c0a5b)
  )
  (wire (pts (xy 54.61 41.91) (xy 64.77 41.91))
    (stroke (width 0) (type default) (color 0 0 0 0))
    (uuid 6ae15075-97f6-4ed8-9c99-c1defc139fed)
  )
  (wire (pts (xy 64.77 97.79) (xy 62.23 97.79))
    (stroke (width 0) (type default) (color 0 0 0 0))
    (uuid 713a4269-e0fb-4583-a4f5-a03945d21e20)
  )
  (wire (pts (xy 85.09 76.2) (xy 90.17 76.2))
    (stroke (width 0) (type default) (color 0 0 0 0))
    (uuid 71b166f4-2c2a-4d9a-b755-df35ad557a5e)
  )
  (wire (pts (xy 76.2 44.45) (xy 85.09 44.45))
    (stroke (width 0) (type default) (color 0 0 0 0))
    (uuid 72586450-f3fc-493a-952e-a8b70d974307)
  )
  (wire (pts (xy 90.17 78.74) (xy 87.63 78.74))
    (stroke (width 0) (type default) (color 0 0 0 0))
    (uuid 7d386354-079c-4da6-8173-e1a5072d89d9)
  )
  (wire (pts (xy 62.23 97.79) (xy 62.23 99.06))
    (stroke (width 0) (type default) (color 0 0 0 0))
    (uuid 8009f347-d94d-4489-a49b-5cbf7d6104e7)
  )
  (wire (pts (xy 90.17 83.82) (xy 87.63 83.82))
    (stroke (width 0) (type default) (color 0 0 0 0))
    (uuid 861cb9e6-9c4a-4369-befb-0425956cd90e)
  )
  (wire (pts (xy 76.2 81.28) (xy 90.17 81.28))
    (stroke (width 0) (type default) (color 0 0 0 0))
    (uuid 8a200f5b-67a6-42d3-b68f-1846b9e18abf)
  )
  (wire (pts (xy 64.77 58.42) (xy 62.23 58.42))
    (stroke (width 0) (type default) (color 0 0 0 0))
    (uuid 8c8c8183-1db0-4cf9-b209-7892b906c80a)
  )
  (wire (pts (xy 54.61 83.82) (xy 59.69 83.82))
    (stroke (width 0) (type default) (color 0 0 0 0))
    (uuid 8ed4931e-6ad5-421b-925f-76e36a608b73)
  )
  (wire (pts (xy 54.61 46.99) (xy 68.58 46.99))
    (stroke (width 0) (type default) (color 0 0 0 0))
    (uuid 8fe85769-3e0a-44c9-95ef-5d71e0ef5164)
  )
  (wire (pts (xy 54.61 86.36) (xy 68.58 86.36))
    (stroke (width 0) (type default) (color 0 0 0 0))
    (uuid 90c65586-f68f-4d77-b359-9a0c42ee89ea)
  )
  (wire (pts (xy 90.17 39.37) (xy 87.63 39.37))
    (stroke (width 0) (type default) (color 0 0 0 0))
    (uuid 9461556a-09d2-4a3b-82a3-1cfe511ec2fa)
  )
  (wire (pts (xy 76.2 41.91) (xy 90.17 41.91))
    (stroke (width 0) (type default) (color 0 0 0 0))
    (uuid 95db0de8-a0e3-4f1a-8e95-9b34409ce25c)
  )
  (wire (pts (xy 54.61 78.74) (xy 68.58 78.74))
    (stroke (width 0) (type default) (color 0 0 0 0))
    (uuid 9788f99c-2c42-4760-8beb-24c673b8ca02)
  )
  (wire (pts (xy 85.09 86.36) (xy 85.09 83.82))
    (stroke (width 0) (type default) (color 0 0 0 0))
    (uuid 97bac9ec-abf5-408c-a895-9969867028a8)
  )
  (wire (pts (xy 87.63 49.53) (xy 87.63 60.96))
    (stroke (width 0) (type default) (color 0 0 0 0))
    (uuid 986e4d3a-efab-4d90-99fe-d9cd7e7419f0)
  )
  (wire (pts (xy 90.17 86.36) (xy 85.09 86.36))
    (stroke (width 0) (type default) (color 0 0 0 0))
    (uuid 9ee5f41e-deb6-4f27-a830-e08c480759bd)
  )
  (wire (pts (xy 76.2 46.99) (xy 80.01 46.99))
    (stroke (width 0) (type default) (color 0 0 0 0))
    (uuid a2d1596d-0fba-44b9-9300-242516870a08)
  )
  (wire (pts (xy 90.17 46.99) (xy 85.09 46.99))
    (stroke (width 0) (type default) (color 0 0 0 0))
    (uuid a76487e1-f14c-401b-8191-63f61b0c7acf)
  )
  (wire (pts (xy 54.61 39.37) (xy 68.58 39.37))
    (stroke (width 0) (type default) (color 0 0 0 0))
    (uuid a7f72272-7fbb-4a42-a65b-1ac4eac0465b)
  )
  (wire (pts (xy 64.77 41.91) (xy 68.58 41.91))
    (stroke (width 0) (type default) (color 0 0 0 0))
    (uuid b3015cb3-268f-420b-acff-06e864611dbc)
  )
  (wire (pts (xy 76.2 78.74) (xy 85.09 78.74))
    (stroke (width 0) (type default) (color 0 0 0 0))
    (uuid b5b7b492-06a7-4ac0-ada8-180e03ffed3a)
  )
  (wire (pts (xy 80.01 46.99) (xy 80.01 49.53))
    (stroke (width 0) (type default) (color 0 0 0 0))
    (uuid baf6584f-e947-492b-99e1-019c855dc5b0)
  )
  (wire (pts (xy 59.69 44.45) (xy 59.69 49.53))
    (stroke (width 0) (type default) (color 0 0 0 0))
    (uuid cb1ef245-cecf-495c-ad05-36049a4a4ec6)
  )
  (wire (pts (xy 90.17 49.53) (xy 87.63 49.53))
    (stroke (width 0) (type default) (color 0 0 0 0))
    (uuid cc4dac2a-a5ec-45fa-9ddc-58b6c6673d4b)
  )
  (wire (pts (xy 59.69 83.82) (xy 68.58 83.82))
    (stroke (width 0) (type default) (color 0 0 0 0))
    (uuid cd70cabb-0533-4b4d-b7d5-f189550fe766)
  )
  (wire (pts (xy 76.2 86.36) (xy 80.01 86.36))
    (stroke (width 0) (type default) (color 0 0 0 0))
    (uuid e0fb6443-29d2-443b-b0a0-48e11189ebc5)
  )
  (wire (pts (xy 59.69 97.79) (xy 62.23 97.79))
    (stroke (width 0) (type default) (color 0 0 0 0))
    (uuid ea58e770-ac8e-45ff-9644-52c97ddd6eb4)
  )
  (wire (pts (xy 80.01 86.36) (xy 80.01 88.9))
    (stroke (width 0) (type default) (color 0 0 0 0))
    (uuid ebae93b6-9258-4ca8-b1c9-d05db8c83a28)
  )
  (wire (pts (xy 64.77 57.15) (xy 64.77 58.42))
    (stroke (width 0) (type default) (color 0 0 0 0))
    (uuid ec7f9e9d-bd12-4667-8cd9-d2ff262e1464)
  )
  (wire (pts (xy 59.69 58.42) (xy 62.23 58.42))
    (stroke (width 0) (type default) (color 0 0 0 0))
    (uuid ecd29234-d950-4119-92d2-ceecf7819a27)
  )
  (wire (pts (xy 76.2 39.37) (xy 85.09 39.37))
    (stroke (width 0) (type default) (color 0 0 0 0))
    (uuid f972c377-f768-49d7-abc9-a6ad80a7571f)
  )
  (wire (pts (xy 85.09 46.99) (xy 85.09 44.45))
    (stroke (width 0) (type default) (color 0 0 0 0))
    (uuid fa445704-acc5-467f-9eac-4c4e2d1bc951)
  )

  (hierarchical_label "ZEN_STATUS" (shape input) (at 54.61 86.36 180)
    (effects (font (size 1.27 1.27)) (justify right))
    (uuid 00284680-9923-4a57-8641-5d9255af5be1)
  )
  (hierarchical_label "AZM_PUL" (shape input) (at 54.61 44.45 180)
    (effects (font (size 1.27 1.27)) (justify right))
    (uuid 208a6abe-0e29-4f96-979a-e2538da8d0e9)
  )
  (hierarchical_label "ZEN_PUL" (shape input) (at 54.61 83.82 180)
    (effects (font (size 1.27 1.27)) (justify right))
    (uuid 3a57753a-9170-4801-8f72-52d284d46fcf)
  )
  (hierarchical_label "ZEN_DIR" (shape input) (at 54.61 81.28 180)
    (effects (font (size 1.27 1.27)) (justify right))
    (uuid 5a3adf4a-2215-4235-b871-7db24c934736)
  )
  (hierarchical_label "AZM_STATUS" (shape input) (at 54.61 46.99 180)
    (effects (font (size 1.27 1.27)) (justify right))
    (uuid 6a9091ca-dbba-47a6-8eeb-cc84cf1384c4)
  )
  (hierarchical_label "ZEN_EN" (shape input) (at 54.61 78.74 180)
    (effects (font (size 1.27 1.27)) (justify right))
    (uuid 8982423f-1fb2-4612-be81-b757756dc72f)
  )
  (hierarchical_label "AZM_EN" (shape input) (at 54.61 39.37 180)
    (effects (font (size 1.27 1.27)) (justify right))
    (uuid 8e80a0df-f015-4af3-9f5a-054ac872b9f6)
  )
  (hierarchical_label "AZM_DIR" (shape input) (at 54.61 41.91 180)
    (effects (font (size 1.27 1.27)) (justify right))
    (uuid ebaa27e9-6744-4751-add0-607f14203061)
  )

  (symbol (lib_id "power:GND") (at 62.23 99.06 0) (unit 1)
    (in_bom yes) (on_board yes) (fields_autoplaced)
    (uuid 1ba612c3-0396-4829-9816-95efba4d8005)
    (property "Reference" "#PWR038" (id 0) (at 62.23 105.41 0)
      (effects (font (size 1.27 1.27)) hide)
    )
    (property "Value" "GND" (id 1) (at 62.23 104.14 0))
    (property "Footprint" "" (id 2) (at 62.23 99.06 0)
      (effects (font (size 1.27 1.27)) hide)
    )
    (property "Datasheet" "" (id 3) (at 62.23 99.06 0)
      (effects (font (size 1.27 1.27)) hide)
    )
    (pin "1" (uuid 5b50435c-55ad-4210-a726-97178dda26b9))
  )

  (symbol (lib_id "Device:R") (at 72.39 86.36 90) (unit 1)
    (in_bom yes) (on_board yes)
    (uuid 226b3f8b-fe0e-4b9a-9ac1-f5403bcb40e3)
    (property "Reference" "R23" (id 0) (at 77.47 85.09 90))
    (property "Value" "" (id 1) (at 72.39 86.36 90))
    (property "Footprint" "" (id 2) (at 72.39 88.138 90)
      (effects (font (size 1.27 1.27)) hide)
    )
    (property "Datasheet" "~" (id 3) (at 72.39 86.36 0)
      (effects (font (size 1.27 1.27)) hide)
    )
    (pin "1" (uuid b37c3894-ae23-4e5c-997d-c0d115e0eb32))
    (pin "2" (uuid 6e06ef0b-271b-473f-b9ed-e1710c51e7db))
  )

  (symbol (lib_id "power:GND") (at 62.23 59.69 0) (unit 1)
    (in_bom yes) (on_board yes) (fields_autoplaced)
    (uuid 235503c7-62e5-4ff5-a275-717c175d3ec2)
    (property "Reference" "#PWR037" (id 0) (at 62.23 66.04 0)
      (effects (font (size 1.27 1.27)) hide)
    )
    (property "Value" "GND" (id 1) (at 62.23 64.77 0))
    (property "Footprint" "" (id 2) (at 62.23 59.69 0)
      (effects (font (size 1.27 1.27)) hide)
    )
    (property "Datasheet" "" (id 3) (at 62.23 59.69 0)
      (effects (font (size 1.27 1.27)) hide)
    )
    (pin "1" (uuid f3d3d193-47a5-46b5-bad0-7df64277e8f3))
  )

  (symbol (lib_id "Device:R") (at 72.39 44.45 90) (unit 1)
    (in_bom yes) (on_board yes)
    (uuid 2679956f-57d4-4c13-a3e1-fca7eea0a6a4)
    (property "Reference" "R18" (id 0) (at 77.47 43.18 90))
    (property "Value" "" (id 1) (at 72.39 44.45 90))
    (property "Footprint" "" (id 2) (at 72.39 46.228 90)
      (effects (font (size 1.27 1.27)) hide)
    )
    (property "Datasheet" "~" (id 3) (at 72.39 44.45 0)
      (effects (font (size 1.27 1.27)) hide)
    )
    (pin "1" (uuid db4fcce6-43b8-4e76-a8ec-09a2553c63fe))
    (pin "2" (uuid 85b4dc68-6c8c-4f22-8e36-badc4ff63640))
  )

  (symbol (lib_id "Connector_Generic:Conn_01x06") (at 95.25 41.91 0) (unit 1)
    (in_bom yes) (on_board yes) (fields_autoplaced)
    (uuid 37aa1d2c-d65e-407c-9e76-02fedf918dd0)
    (property "Reference" "J4" (id 0) (at 97.79 41.9099 0)
      (effects (font (size 1.27 1.27)) (justify left))
    )
    (property "Value" "Conn_01x06" (id 1) (at 97.79 44.4499 0)
      (effects (font (size 1.27 1.27)) (justify left))
    )
    (property "Footprint" "TerminalBlock_4Ucon:TerminalBlock_4Ucon_1x06_P3.50mm_Horizontal" (id 2) (at 95.25 41.91 0)
      (effects (font (size 1.27 1.27)) hide)
    )
    (property "Datasheet" "~" (id 3) (at 95.25 41.91 0)
      (effects (font (size 1.27 1.27)) hide)
    )
    (pin "1" (uuid 10a86675-1bbb-4505-9309-38c8b9f54ade))
    (pin "2" (uuid bdab3529-f1e0-49f4-b4e3-6a7321b8c7ec))
    (pin "3" (uuid 587294d2-902b-4ab7-912f-93f9abd972dc))
    (pin "4" (uuid 1a89d83e-bf93-4019-9636-c223c382d5c8))
    (pin "5" (uuid 8953655c-e67b-424a-8d55-eff90b6f32d1))
    (pin "6" (uuid ebcc5a20-d225-4e1d-877e-6a3ca6d80f63))
  )

  (symbol (lib_id "Device:R") (at 72.39 78.74 90) (unit 1)
    (in_bom yes) (on_board yes)
    (uuid 3d09a539-b097-43e9-80fe-576efd2816ec)
    (property "Reference" "R20" (id 0) (at 77.47 77.47 90))
    (property "Value" "" (id 1) (at 72.39 78.74 90))
    (property "Footprint" "" (id 2) (at 72.39 80.518 90)
      (effects (font (size 1.27 1.27)) hide)
    )
    (property "Datasheet" "~" (id 3) (at 72.39 78.74 0)
      (effects (font (size 1.27 1.27)) hide)
    )
    (pin "1" (uuid 6c0ae237-e54d-48de-bbaa-d6d610f0f1b5))
    (pin "2" (uuid 50ad0dfb-1bd0-4e65-bbce-c96aafc7deba))
  )

  (symbol (lib_id "power:GND") (at 80.01 59.69 0) (unit 1)
    (in_bom yes) (on_board yes) (fields_autoplaced)
    (uuid 46588455-d653-4c7d-aa82-9f020ca02fcc)
    (property "Reference" "#PWR039" (id 0) (at 80.01 66.04 0)
      (effects (font (size 1.27 1.27)) hide)
    )
    (property "Value" "GND" (id 1) (at 80.01 64.77 0))
    (property "Footprint" "" (id 2) (at 80.01 59.69 0)
      (effects (font (size 1.27 1.27)) hide)
    )
    (property "Datasheet" "" (id 3) (at 80.01 59.69 0)
      (effects (font (size 1.27 1.27)) hide)
    )
    (pin "1" (uuid 79b34b2f-132a-4efa-8253-d87e68ec117f))
  )

  (symbol (lib_id "Device:R") (at 59.69 53.34 0) (unit 1)
    (in_bom yes) (on_board yes)
    (uuid 53e2a288-45ee-476a-a590-a62a7dbca019)
    (property "Reference" "R10" (id 0) (at 53.34 52.07 0)
      (effects (font (size 1.27 1.27)) (justify left))
    )
    (property "Value" "10K" (id 1) (at 53.34 54.61 0)
      (effects (font (size 1.27 1.27)) (justify left))
    )
    (property "Footprint" "" (id 2) (at 57.912 53.34 90)
      (effects (font (size 1.27 1.27)) hide)
    )
    (property "Datasheet" "~" (id 3) (at 59.69 53.34 0)
      (effects (font (size 1.27 1.27)) hide)
    )
    (property "LCSC" "C25744" (id 4) (at 59.69 53.34 0)
      (effects (font (size 1.27 1.27)) hide)
    )
    (pin "1" (uuid c6468651-dd30-4e9f-8cfe-44958b9b778c))
    (pin "2" (uuid a793642d-975b-4b4c-a61b-7469ae623402))
  )

  (symbol (lib_id "Device:LED") (at 80.01 92.71 90) (unit 1)
    (in_bom yes) (on_board yes) (fields_autoplaced)
    (uuid 699457dc-cda6-47b4-a6c0-42603c2eab6d)
    (property "Reference" "D3" (id 0) (at 83.82 93.0274 90)
      (effects (font (size 1.27 1.27)) (justify right))
    )
    (property "Value" "LED" (id 1) (at 83.82 95.5674 90)
      (effects (font (size 1.27 1.27)) (justify right))
    )
    (property "Footprint" "LED_SMD:LED_0603_1608Metric" (id 2) (at 80.01 92.71 0)
      (effects (font (size 1.27 1.27)) hide)
    )
    (property "Datasheet" "~" (id 3) (at 80.01 92.71 0)
      (effects (font (size 1.27 1.27)) hide)
    )
    (property "LCSC" "C72043" (id 4) (at 80.01 92.71 0)
      (effects (font (size 1.27 1.27)) hide)
    )
    (pin "1" (uuid 63c4ac79-d8e1-42df-9116-7095b99bfdc4))
    (pin "2" (uuid 285a81c7-da1c-4b97-8531-862bbc5c5134))
  )

  (symbol (lib_id "Device:R") (at 72.39 39.37 90) (unit 1)
    (in_bom yes) (on_board yes)
    (uuid 6f1afdb9-b0a1-4bdd-9f44-732b6ab86422)
    (property "Reference" "R16" (id 0) (at 77.47 38.1 90))
    (property "Value" "" (id 1) (at 72.39 39.37 90))
    (property "Footprint" "" (id 2) (at 72.39 41.148 90)
      (effects (font (size 1.27 1.27)) hide)
    )
    (property "Datasheet" "~" (id 3) (at 72.39 39.37 0)
      (effects (font (size 1.27 1.27)) hide)
    )
    (pin "1" (uuid 9b38d40c-112f-4834-ae3a-2cc355433e93))
    (pin "2" (uuid 003bccf7-2b9e-4e54-90d4-fcecfcb061de))
  )

  (symbol (lib_id "Device:R") (at 72.39 83.82 90) (unit 1)
    (in_bom yes) (on_board yes)
    (uuid 86c15006-38b3-48c8-b2f4-a97c4bd0516a)
    (property "Reference" "R22" (id 0) (at 77.47 82.55 90))
    (property "Value" "" (id 1) (at 72.39 83.82 90))
    (property "Footprint" "" (id 2) (at 72.39 85.598 90)
      (effects (font (size 1.27 1.27)) hide)
    )
    (property "Datasheet" "~" (id 3) (at 72.39 83.82 0)
      (effects (font (size 1.27 1.27)) hide)
    )
    (pin "1" (uuid fcf74e85-17f5-45dd-8e51-a66b3c6fc892))
    (pin "2" (uuid a15f0753-8fed-4059-b6fd-b11006194ace))
  )

  (symbol (lib_id "Device:LED") (at 80.01 53.34 90) (unit 1)
    (in_bom yes) (on_board yes) (fields_autoplaced)
    (uuid 88cdcfe4-f642-4f46-a92c-2fc337766e9b)
    (property "Reference" "D2" (id 0) (at 83.82 53.6574 90)
      (effects (font (size 1.27 1.27)) (justify right))
    )
    (property "Value" "LED" (id 1) (at 83.82 56.1974 90)
      (effects (font (size 1.27 1.27)) (justify right))
    )
    (property "Footprint" "LED_SMD:LED_0603_1608Metric" (id 2) (at 80.01 53.34 0)
      (effects (font (size 1.27 1.27)) hide)
    )
    (property "Datasheet" "~" (id 3) (at 80.01 53.34 0)
      (effects (font (size 1.27 1.27)) hide)
    )
    (property "LCSC" "C72043" (id 4) (at 80.01 53.34 0)
      (effects (font (size 1.27 1.27)) hide)
    )
    (pin "1" (uuid d88faeb3-4806-4673-95f1-de8c820bb41f))
    (pin "2" (uuid 21f435f2-aced-4b51-8e28-ee77e25cc55a))
  )

  (symbol (lib_id "Device:R") (at 64.77 53.34 0) (unit 1)
    (in_bom yes) (on_board yes) (fields_autoplaced)
    (uuid 95a9ab7d-f422-4072-abac-bb8487f964cf)
    (property "Reference" "R12" (id 0) (at 67.31 52.0699 0)
      (effects (font (size 1.27 1.27)) (justify left))
    )
    (property "Value" "10K" (id 1) (at 67.31 54.6099 0)
      (effects (font (size 1.27 1.27)) (justify left))
    )
    (property "Footprint" "" (id 2) (at 62.992 53.34 90)
      (effects (font (size 1.27 1.27)) hide)
    )
    (property "Datasheet" "~" (id 3) (at 64.77 53.34 0)
      (effects (font (size 1.27 1.27)) hide)
    )
    (property "LCSC" "C25744" (id 4) (at 64.77 53.34 0)
      (effects (font (size 1.27 1.27)) hide)
    )
    (pin "1" (uuid 8d405dff-4f79-4522-bddf-cd94581a5a83))
    (pin "2" (uuid c70476ad-7527-47a9-89a5-db71e07c6fdf))
  )

  (symbol (lib_id "Device:R") (at 72.39 81.28 90) (unit 1)
    (in_bom yes) (on_board yes)
    (uuid a1cc3b99-4a5e-45e5-b1d2-fc96659d2520)
    (property "Reference" "R21" (id 0) (at 77.47 80.01 90))
    (property "Value" "" (id 1) (at 72.39 81.28 90))
    (property "Footprint" "" (id 2) (at 72.39 83.058 90)
      (effects (font (size 1.27 1.27)) hide)
    )
    (property "Datasheet" "~" (id 3) (at 72.39 81.28 0)
      (effects (font (size 1.27 1.27)) hide)
    )
    (pin "1" (uuid 6ed1c441-c165-4883-91de-cb2403fd2a33))
    (pin "2" (uuid 5a802bbc-37db-49cf-8da1-0a26f0441131))
  )

  (symbol (lib_id "power:GND") (at 87.63 60.96 0) (unit 1)
    (in_bom yes) (on_board yes) (fields_autoplaced)
    (uuid a857c8c9-c538-4271-a022-bd2f1612becb)
    (property "Reference" "#PWR041" (id 0) (at 87.63 67.31 0)
      (effects (font (size 1.27 1.27)) hide)
    )
    (property "Value" "GND" (id 1) (at 87.63 66.04 0))
    (property "Footprint" "" (id 2) (at 87.63 60.96 0)
      (effects (font (size 1.27 1.27)) hide)
    )
    (property "Datasheet" "" (id 3) (at 87.63 60.96 0)
      (effects (font (size 1.27 1.27)) hide)
    )
    (pin "1" (uuid deb009f1-3851-4dcd-9c74-65b9880a7ecb))
  )

  (symbol (lib_id "Connector_Generic:Conn_01x06") (at 95.25 81.28 0) (unit 1)
    (in_bom yes) (on_board yes) (fields_autoplaced)
    (uuid a86f8291-a300-49df-b31d-315d2634a3ee)
    (property "Reference" "J5" (id 0) (at 97.79 81.2799 0)
      (effects (font (size 1.27 1.27)) (justify left))
    )
    (property "Value" "Conn_01x06" (id 1) (at 97.79 83.8199 0)
      (effects (font (size 1.27 1.27)) (justify left))
    )
    (property "Footprint" "TerminalBlock_4Ucon:TerminalBlock_4Ucon_1x06_P3.50mm_Horizontal" (id 2) (at 95.25 81.28 0)
      (effects (font (size 1.27 1.27)) hide)
    )
    (property "Datasheet" "~" (id 3) (at 95.25 81.28 0)
      (effects (font (size 1.27 1.27)) hide)
    )
    (pin "1" (uuid c5d75884-71b0-4cf3-936e-e31062f6f1b4))
    (pin "2" (uuid 69b82988-39bb-4a6b-a08f-b619af6d93cb))
    (pin "3" (uuid 41030592-0db0-4d8f-bcb8-46e8eb979b02))
    (pin "4" (uuid eda3aa25-a5fd-4c96-b864-f4a72dd99a46))
    (pin "5" (uuid c6a465ff-8a63-41b6-afba-b58ba0a857b8))
    (pin "6" (uuid 74e85f4d-e934-42b3-b1eb-7a2d673208a2))
  )

  (symbol (lib_id "Device:R") (at 72.39 46.99 90) (unit 1)
    (in_bom yes) (on_board yes)
    (uuid a88a1662-3efa-471c-bf5c-88b0ec6acc9a)
    (property "Reference" "R19" (id 0) (at 77.47 45.72 90))
    (property "Value" "" (id 1) (at 72.39 46.99 90))
    (property "Footprint" "" (id 2) (at 72.39 48.768 90)
      (effects (font (size 1.27 1.27)) hide)
    )
    (property "Datasheet" "~" (id 3) (at 72.39 46.99 0)
      (effects (font (size 1.27 1.27)) hide)
    )
    (pin "1" (uuid 2e1da8b0-6c51-4f57-a972-cade6b4926a3))
    (pin "2" (uuid 30cf39fe-a961-4d5f-b09c-8c08e7f5c17f))
  )

  (symbol (lib_id "Device:R") (at 59.69 92.71 0) (unit 1)
    (in_bom yes) (on_board yes)
    (uuid b232cb80-9508-4459-abfd-0478c532bce8)
    (property "Reference" "R11" (id 0) (at 53.34 91.44 0)
      (effects (font (size 1.27 1.27)) (justify left))
    )
    (property "Value" "10K" (id 1) (at 53.34 93.98 0)
      (effects (font (size 1.27 1.27)) (justify left))
    )
    (property "Footprint" "" (id 2) (at 57.912 92.71 90)
      (effects (font (size 1.27 1.27)) hide)
    )
    (property "Datasheet" "~" (id 3) (at 59.69 92.71 0)
      (effects (font (size 1.27 1.27)) hide)
    )
    (property "LCSC" "C25744" (id 4) (at 59.69 92.71 0)
      (effects (font (size 1.27 1.27)) hide)
    )
    (pin "1" (uuid d263bdc9-1837-4a97-a7c3-ca5c09f32db6))
    (pin "2" (uuid f683ec2a-050b-4e61-bb34-0fd742a7085f))
  )

  (symbol (lib_id "power:GND") (at 87.63 100.33 0) (unit 1)
    (in_bom yes) (on_board yes) (fields_autoplaced)
    (uuid cbdb397a-6d25-41ad-aaa2-21f51574da0e)
    (property "Reference" "#PWR042" (id 0) (at 87.63 106.68 0)
      (effects (font (size 1.27 1.27)) hide)
    )
    (property "Value" "GND" (id 1) (at 87.63 105.41 0))
    (property "Footprint" "" (id 2) (at 87.63 100.33 0)
      (effects (font (size 1.27 1.27)) hide)
    )
    (property "Datasheet" "" (id 3) (at 87.63 100.33 0)
      (effects (font (size 1.27 1.27)) hide)
    )
    (pin "1" (uuid fb307300-5b10-4486-b5de-f017a4417c92))
  )

  (symbol (lib_id "Device:R") (at 64.77 92.71 0) (unit 1)
    (in_bom yes) (on_board yes) (fields_autoplaced)
    (uuid e52a4b9c-0921-4a2e-94bb-fde3931b5793)
    (property "Reference" "R13" (id 0) (at 67.31 91.4399 0)
      (effects (font (size 1.27 1.27)) (justify left))
    )
    (property "Value" "10K" (id 1) (at 67.31 93.9799 0)
      (effects (font (size 1.27 1.27)) (justify left))
    )
    (property "Footprint" "" (id 2) (at 62.992 92.71 90)
      (effects (font (size 1.27 1.27)) hide)
    )
    (property "Datasheet" "~" (id 3) (at 64.77 92.71 0)
      (effects (font (size 1.27 1.27)) hide)
    )
    (property "LCSC" "C25744" (id 4) (at 64.77 92.71 0)
      (effects (font (size 1.27 1.27)) hide)
    )
    (pin "1" (uuid ad71c114-8cf4-43e7-9c90-01dccf3666af))
    (pin "2" (uuid aa841020-f42a-4768-b102-2be4bce4d0dd))
  )

  (symbol (lib_id "Device:R") (at 72.39 41.91 90) (unit 1)
    (in_bom yes) (on_board yes)
    (uuid ed4bd1fc-d3ff-4d9a-a5e3-60178bbad478)
    (property "Reference" "R17" (id 0) (at 77.47 40.64 90))
    (property "Value" "" (id 1) (at 72.39 41.91 90))
    (property "Footprint" "" (id 2) (at 72.39 43.688 90)
      (effects (font (size 1.27 1.27)) hide)
    )
    (property "Datasheet" "~" (id 3) (at 72.39 41.91 0)
      (effects (font (size 1.27 1.27)) hide)
    )
    (pin "1" (uuid 5964299b-ed5f-4434-b0a0-c746e338622a))
    (pin "2" (uuid 9f47b3b7-f368-41cf-a20d-d1f6b403a7a8))
  )

  (symbol (lib_id "power:GND") (at 80.01 99.06 0) (unit 1)
    (in_bom yes) (on_board yes) (fields_autoplaced)
    (uuid f337ad28-400a-426b-ae34-e1fad870ec05)
    (property "Reference" "#PWR040" (id 0) (at 80.01 105.41 0)
      (effects (font (size 1.27 1.27)) hide)
    )
    (property "Value" "GND" (id 1) (at 80.01 104.14 0))
    (property "Footprint" "" (id 2) (at 80.01 99.06 0)
      (effects (font (size 1.27 1.27)) hide)
    )
    (property "Datasheet" "" (id 3) (at 80.01 99.06 0)
      (effects (font (size 1.27 1.27)) hide)
    )
    (pin "1" (uuid fb911a41-d495-45b3-bc87-b002cd6cf79f))
  )
)
