%!PS-Adobe-3.0
%%Creator: PCBNEW
%%CreationDate: Thu Mar 17 01:23:09 2022
%%Title: ()
%%Pages: 1
%%PageOrder: Ascend
%%BoundingBox: 0 0 596 842
%%DocumentMedia: A4 595 842 0 () ()
%%Orientation: Landscape
%%EndComments
%%BeginProlog
/line { newpath moveto lineto stroke } bind def
/cir0 { newpath 0 360 arc stroke } bind def
/cir1 { newpath 0 360 arc gsave fill grestore stroke } bind def
/cir2 { newpath 0 360 arc gsave fill grestore stroke } bind def
/arc0 { newpath arc stroke } bind def
/arc1 { newpath 4 index 4 index moveto arc closepath gsave fill
    grestore stroke } bind def
/arc2 { newpath 4 index 4 index moveto arc closepath gsave fill
    grestore stroke } bind def
/poly0 { stroke } bind def
/poly1 { closepath gsave fill grestore stroke } bind def
/poly2 { closepath gsave fill grestore stroke } bind def
/rect0 { rectstroke } bind def
/rect1 { rectfill } bind def
/rect2 { rectfill } bind def
/linemode0 { 0 setlinecap 0 setlinejoin 0 setlinewidth } bind def
/linemode1 { 1 setlinecap 1 setlinejoin } bind def
/dashedline { [200] 100 setdash } bind def
/solidline { [] 0 setdash } bind def
/phantomshow { moveto
    /KicadFont findfont 0.000001 scalefont setfont
    show } bind def
/textshow { gsave
    findfont exch scalefont setfont concat 1 scale 0 0 moveto show
    } bind def
/reencodefont {
  findfont dup length dict begin
  { 1 index /FID ne
    { def }
    { pop pop } ifelse
  } forall
  /Encoding ISOLatin1Encoding def
  currentdict
  end } bind def
/KicadFont /Helvetica reencodefont definefont pop
/KicadFont-Bold /Helvetica-Bold reencodefont definefont pop
/KicadFont-Oblique /Helvetica-Oblique reencodefont definefont pop
/KicadFont-BoldOblique /Helvetica-BoldOblique reencodefont definefont pop
%%EndProlog
%%Page: 1 1
%%BeginPageSetup
gsave
0.0072 0.0072 scale
linemode1
82680 0 translate 90 rotate
161.382 setlinewidth
%%EndPageSetup
0 0 0 setrgbcolor
80.6908 setlinewidth
newpath
33047.4 64936.4 moveto
35468.1 64936.4 lineto
stroke
0 0 0 setrgbcolor
35468.1 52025.9 806.907 -90.0001 5.72958e-05 arc0
0 0 0 setrgbcolor
34661.2 37501.6 2420.72 -180 -90 arc0
0 0 0 setrgbcolor
newpath
34661.2 80671.2 moveto
82268.8 80671.2 lineto
stroke
0 0 0 setrgbcolor
82268.8 37501.6 2420.72 -90 -1.90986e-05 arc0
0 0 0 setrgbcolor
35468.1 64129.5 806.907 -5.72958e-05 90.0001 arc0
0 0 0 setrgbcolor
34661.2 78250.4 2420.72 90 180 arc0
0 0 0 setrgbcolor
newpath
84689.5 78250.4 moveto
84689.5 37501.6 lineto
stroke
0 0 0 setrgbcolor
newpath
32240.5 65743.4 moveto
32240.5 78250.4 lineto
stroke
0 0 0 setrgbcolor
newpath
32240.5 37501.6 moveto
32240.5 50412.1 lineto
stroke
0 0 0 setrgbcolor
82268.8 78250.4 2420.72 1.90986e-05 90 arc0
0 0 0 setrgbcolor
newpath
36275 64129.5 moveto
36275 52025.9 lineto
stroke
0 0 0 setrgbcolor
newpath
82268.8 35080.8 moveto
34661.2 35080.8 lineto
stroke
0 0 0 setrgbcolor
33047.4 65743.4 806.907 -180 -89.9999 arc0
0 0 0 setrgbcolor
33047.4 50412.1 806.907 -270 -180 arc0
0 0 0 setrgbcolor
newpath
35468.1 51219 moveto
33047.4 51219 lineto
stroke
161.382 setlinewidth
48.4145 setlinewidth
newpath
81310.6 59207.4 moveto
81794.7 58723.3 lineto
stroke
newpath
81794.7 59207.4 moveto
81310.6 58723.3 lineto
stroke
newpath
81310.6 55979.8 moveto
81794.7 55495.6 lineto
stroke
newpath
81794.7 55979.8 moveto
81310.6 55495.6 lineto
stroke
217.865 setlinewidth
35064.7 77847 1089.33 cir0
35064.7 37905 1089.33 cir0
81865.3 77847 1089.33 cir0
81865.3 37905 1089.33 cir0
161.382 setlinewidth
78.7405 setlinewidth
0 0 0 setrgbcolor
0 0 0 setrgbcolor
newpath
33214.4 33818.2 moveto
33214.4 34605.6 lineto
33401.9 34605.6 lineto
33514.4 34568.1 lineto
33589.3 34493.1 lineto
33626.8 34418.1 lineto
33664.3 34268.1 lineto
33664.3 34155.6 lineto
33626.8 34005.6 lineto
33589.3 33930.6 lineto
33514.4 33855.7 lineto
33401.9 33818.2 lineto
33214.4 33818.2 lineto
stroke
newpath
34001.8 33818.2 moveto
34001.8 34343.1 lineto
stroke
newpath
34001.8 34193.1 moveto
34039.3 34268.1 lineto
34076.8 34305.6 lineto
34151.8 34343.1 lineto
34226.8 34343.1 lineto
stroke
newpath
34489.2 33818.2 moveto
34489.2 34343.1 lineto
stroke
newpath
34489.2 34605.6 moveto
34451.7 34568.1 lineto
34489.2 34530.6 lineto
34526.7 34568.1 lineto
34489.2 34605.6 lineto
34489.2 34530.6 lineto
stroke
newpath
34976.7 33818.2 moveto
34901.7 33855.7 lineto
34864.2 33930.6 lineto
34864.2 34605.6 lineto
stroke
newpath
35389.1 33818.2 moveto
35314.1 33855.7 lineto
35276.6 33930.6 lineto
35276.6 34605.6 lineto
stroke
newpath
36289 33818.2 moveto
36289 34605.6 lineto
36551.5 34043.1 lineto
36813.9 34605.6 lineto
36813.9 33818.2 lineto
stroke
newpath
37526.4 33818.2 moveto
37526.4 34230.6 lineto
37488.9 34305.6 lineto
37413.9 34343.1 lineto
37263.9 34343.1 lineto
37188.9 34305.6 lineto
stroke
newpath
37526.4 33855.7 moveto
37451.4 33818.2 lineto
37263.9 33818.2 lineto
37188.9 33855.7 lineto
37151.4 33930.6 lineto
37151.4 34005.6 lineto
37188.9 34080.6 lineto
37263.9 34118.1 lineto
37451.4 34118.1 lineto
37526.4 34155.6 lineto
stroke
newpath
37901.3 34343.1 moveto
37901.3 33555.7 lineto
stroke
newpath
37901.3 34305.6 moveto
37976.3 34343.1 lineto
38126.3 34343.1 lineto
38201.3 34305.6 lineto
38238.8 34268.1 lineto
38276.3 34193.1 lineto
38276.3 33968.1 lineto
38238.8 33893.1 lineto
38201.3 33855.7 lineto
38126.3 33818.2 lineto
37976.3 33818.2 lineto
37901.3 33855.7 lineto
stroke
newpath
38613.7 33893.1 moveto
38651.2 33855.7 lineto
38613.7 33818.2 lineto
38576.2 33855.7 lineto
38613.7 33893.1 lineto
38613.7 33818.2 lineto
stroke
newpath
38613.7 34305.6 moveto
38651.2 34268.1 lineto
38613.7 34230.6 lineto
38576.2 34268.1 lineto
38613.7 34305.6 lineto
38613.7 34230.6 lineto
stroke
48.4145 setlinewidth
newpath
31716 32762.9 moveto
32200.1 32278.7 lineto
stroke
newpath
32200.1 32762.9 moveto
31716 32278.7 lineto
stroke
161.382 setlinewidth
78.7405 setlinewidth
0 0 0 setrgbcolor
0 0 0 setrgbcolor
newpath
33364.4 32952 moveto
33439.4 32952 lineto
33514.4 32914.5 lineto
33551.9 32877 lineto
33589.3 32802 lineto
33626.8 32652.1 lineto
33626.8 32464.6 lineto
33589.3 32314.6 lineto
33551.9 32239.6 lineto
33514.4 32202.1 lineto
33439.4 32164.6 lineto
33364.4 32164.6 lineto
33289.4 32202.1 lineto
33251.9 32239.6 lineto
33214.4 32314.6 lineto
33176.9 32464.6 lineto
33176.9 32652.1 lineto
33214.4 32802 lineto
33251.9 32877 lineto
33289.4 32914.5 lineto
33364.4 32952 lineto
stroke
newpath
33964.3 32239.6 moveto
34001.8 32202.1 lineto
33964.3 32164.6 lineto
33926.8 32202.1 lineto
33964.3 32239.6 lineto
33964.3 32164.6 lineto
stroke
newpath
34676.7 32952 moveto
34526.7 32952 lineto
34451.7 32914.5 lineto
34414.2 32877 lineto
34339.3 32764.5 lineto
34301.8 32614.6 lineto
34301.8 32314.6 lineto
34339.3 32239.6 lineto
34376.7 32202.1 lineto
34451.7 32164.6 lineto
34601.7 32164.6 lineto
34676.7 32202.1 lineto
34714.2 32239.6 lineto
34751.7 32314.6 lineto
34751.7 32502.1 lineto
34714.2 32577.1 lineto
34676.7 32614.6 lineto
34601.7 32652.1 lineto
34451.7 32652.1 lineto
34376.7 32614.6 lineto
34339.3 32577.1 lineto
34301.8 32502.1 lineto
stroke
newpath
35239.1 32952 moveto
35314.1 32952 lineto
35389.1 32914.5 lineto
35426.6 32877 lineto
35464.1 32802 lineto
35501.6 32652.1 lineto
35501.6 32464.6 lineto
35464.1 32314.6 lineto
35426.6 32239.6 lineto
35389.1 32202.1 lineto
35314.1 32164.6 lineto
35239.1 32164.6 lineto
35164.2 32202.1 lineto
35126.7 32239.6 lineto
35089.2 32314.6 lineto
35051.7 32464.6 lineto
35051.7 32652.1 lineto
35089.2 32802 lineto
35126.7 32877 lineto
35164.2 32914.5 lineto
35239.1 32952 lineto
stroke
newpath
35989 32952 moveto
36064 32952 lineto
36139 32914.5 lineto
36176.5 32877 lineto
36214 32802 lineto
36251.5 32652.1 lineto
36251.5 32464.6 lineto
36214 32314.6 lineto
36176.5 32239.6 lineto
36139 32202.1 lineto
36064 32164.6 lineto
35989 32164.6 lineto
35914.1 32202.1 lineto
35876.6 32239.6 lineto
35839.1 32314.6 lineto
35801.6 32464.6 lineto
35801.6 32652.1 lineto
35839.1 32802 lineto
35876.6 32877 lineto
35914.1 32914.5 lineto
35989 32952 lineto
stroke
newpath
36589 32164.6 moveto
36589 32689.5 lineto
stroke
newpath
36589 32614.6 moveto
36626.5 32652.1 lineto
36701.5 32689.5 lineto
36813.9 32689.5 lineto
36888.9 32652.1 lineto
36926.4 32577.1 lineto
36926.4 32164.6 lineto
stroke
newpath
36926.4 32577.1 moveto
36963.9 32652.1 lineto
37038.9 32689.5 lineto
37151.4 32689.5 lineto
37226.4 32652.1 lineto
37263.9 32577.1 lineto
37263.9 32164.6 lineto
stroke
newpath
37638.8 32164.6 moveto
37638.8 32689.5 lineto
stroke
newpath
37638.8 32614.6 moveto
37676.3 32652.1 lineto
37751.3 32689.5 lineto
37863.8 32689.5 lineto
37938.8 32652.1 lineto
37976.3 32577.1 lineto
37976.3 32164.6 lineto
stroke
newpath
37976.3 32577.1 moveto
38013.8 32652.1 lineto
38088.8 32689.5 lineto
38201.3 32689.5 lineto
38276.3 32652.1 lineto
38313.8 32577.1 lineto
38313.8 32164.6 lineto
stroke
newpath
39851.1 32989.5 moveto
39176.1 31977.1 lineto
stroke
newpath
40863.4 32952 moveto
40938.4 32952 lineto
41013.4 32914.5 lineto
41050.9 32877 lineto
41088.4 32802 lineto
41125.9 32652.1 lineto
41125.9 32464.6 lineto
41088.4 32314.6 lineto
41050.9 32239.6 lineto
41013.4 32202.1 lineto
40938.4 32164.6 lineto
40863.4 32164.6 lineto
40788.4 32202.1 lineto
40751 32239.6 lineto
40713.5 32314.6 lineto
40676 32464.6 lineto
40676 32652.1 lineto
40713.5 32802 lineto
40751 32877 lineto
40788.4 32914.5 lineto
40863.4 32952 lineto
stroke
newpath
41463.4 32239.6 moveto
41500.9 32202.1 lineto
41463.4 32164.6 lineto
41425.9 32202.1 lineto
41463.4 32239.6 lineto
41463.4 32164.6 lineto
stroke
newpath
41988.3 32952 moveto
42063.3 32952 lineto
42138.3 32914.5 lineto
42175.8 32877 lineto
42213.3 32802 lineto
42250.8 32652.1 lineto
42250.8 32464.6 lineto
42213.3 32314.6 lineto
42175.8 32239.6 lineto
42138.3 32202.1 lineto
42063.3 32164.6 lineto
41988.3 32164.6 lineto
41913.3 32202.1 lineto
41875.8 32239.6 lineto
41838.3 32314.6 lineto
41800.8 32464.6 lineto
41800.8 32652.1 lineto
41838.3 32802 lineto
41875.8 32877 lineto
41913.3 32914.5 lineto
41988.3 32952 lineto
stroke
newpath
42550.7 32877 moveto
42588.2 32914.5 lineto
42663.2 32952 lineto
42850.7 32952 lineto
42925.7 32914.5 lineto
42963.2 32877 lineto
43000.7 32802 lineto
43000.7 32727 lineto
42963.2 32614.6 lineto
42513.2 32164.6 lineto
43000.7 32164.6 lineto
stroke
newpath
43263.1 32952 moveto
43750.6 32952 lineto
43488.1 32652.1 lineto
43600.6 32652.1 lineto
43675.6 32614.6 lineto
43713.1 32577.1 lineto
43750.6 32502.1 lineto
43750.6 32314.6 lineto
43713.1 32239.6 lineto
43675.6 32202.1 lineto
43600.6 32164.6 lineto
43375.6 32164.6 lineto
43300.6 32202.1 lineto
43263.1 32239.6 lineto
stroke
newpath
44425.5 32952 moveto
44275.5 32952 lineto
44200.5 32914.5 lineto
44163 32877 lineto
44088 32764.5 lineto
44050.5 32614.6 lineto
44050.5 32314.6 lineto
44088 32239.6 lineto
44125.5 32202.1 lineto
44200.5 32164.6 lineto
44350.5 32164.6 lineto
44425.5 32202.1 lineto
44463 32239.6 lineto
44500.5 32314.6 lineto
44500.5 32502.1 lineto
44463 32577.1 lineto
44425.5 32614.6 lineto
44350.5 32652.1 lineto
44200.5 32652.1 lineto
44125.5 32614.6 lineto
44088 32577.1 lineto
44050.5 32502.1 lineto
stroke
newpath
44800.4 32952 moveto
44800.4 32802 lineto
stroke
newpath
45100.4 32952 moveto
45100.4 32802 lineto
stroke
newpath
46262.8 31864.6 moveto
46225.3 31902.1 lineto
46150.3 32014.6 lineto
46112.8 32089.6 lineto
46075.3 32202.1 lineto
46037.8 32389.6 lineto
46037.8 32539.6 lineto
46075.3 32727 lineto
46112.8 32839.5 lineto
46150.3 32914.5 lineto
46225.3 33027 lineto
46262.8 33064.5 lineto
stroke
newpath
46525.2 32877 moveto
46562.7 32914.5 lineto
46637.7 32952 lineto
46825.2 32952 lineto
46900.2 32914.5 lineto
46937.7 32877 lineto
46975.2 32802 lineto
46975.2 32727 lineto
46937.7 32614.6 lineto
46487.7 32164.6 lineto
46975.2 32164.6 lineto
stroke
newpath
47912.6 32164.6 moveto
47912.6 32952 lineto
stroke
newpath
48250 32164.6 moveto
48250 32577.1 lineto
48212.5 32652.1 lineto
48137.5 32689.5 lineto
48025 32689.5 lineto
47950.1 32652.1 lineto
47912.6 32614.6 lineto
stroke
newpath
48737.5 32164.6 moveto
48662.5 32202.1 lineto
48625 32239.6 lineto
48587.5 32314.6 lineto
48587.5 32539.6 lineto
48625 32614.6 lineto
48662.5 32652.1 lineto
48737.5 32689.5 lineto
48849.9 32689.5 lineto
48924.9 32652.1 lineto
48962.4 32614.6 lineto
48999.9 32539.6 lineto
48999.9 32314.6 lineto
48962.4 32239.6 lineto
48924.9 32202.1 lineto
48849.9 32164.6 lineto
48737.5 32164.6 lineto
stroke
newpath
49449.9 32164.6 moveto
49374.9 32202.1 lineto
49337.4 32277.1 lineto
49337.4 32952 lineto
stroke
newpath
50049.8 32202.1 moveto
49974.8 32164.6 lineto
49824.8 32164.6 lineto
49749.8 32202.1 lineto
49712.3 32277.1 lineto
49712.3 32577.1 lineto
49749.8 32652.1 lineto
49824.8 32689.5 lineto
49974.8 32689.5 lineto
50049.8 32652.1 lineto
50087.3 32577.1 lineto
50087.3 32502.1 lineto
49712.3 32427.1 lineto
stroke
newpath
50387.3 32202.1 moveto
50462.2 32164.6 lineto
50612.2 32164.6 lineto
50687.2 32202.1 lineto
50724.7 32277.1 lineto
50724.7 32314.6 lineto
50687.2 32389.6 lineto
50612.2 32427.1 lineto
50499.7 32427.1 lineto
50424.7 32464.6 lineto
50387.3 32539.6 lineto
50387.3 32577.1 lineto
50424.7 32652.1 lineto
50499.7 32689.5 lineto
50612.2 32689.5 lineto
50687.2 32652.1 lineto
stroke
newpath
50987.2 31864.6 moveto
51024.7 31902.1 lineto
51099.7 32014.6 lineto
51137.2 32089.6 lineto
51174.7 32202.1 lineto
51212.1 32389.6 lineto
51212.1 32539.6 lineto
51174.7 32727 lineto
51137.2 32839.5 lineto
51099.7 32914.5 lineto
51024.7 33027 lineto
50987.2 33064.5 lineto
stroke
newpath
52412 31864.6 moveto
52374.5 31902.1 lineto
52299.5 32014.6 lineto
52262 32089.6 lineto
52224.5 32202.1 lineto
52187 32389.6 lineto
52187 32539.6 lineto
52224.5 32727 lineto
52262 32839.5 lineto
52299.5 32914.5 lineto
52374.5 33027 lineto
52412 33064.5 lineto
stroke
newpath
52712 32689.5 moveto
52712 32164.6 lineto
stroke
newpath
52712 32614.6 moveto
52749.5 32652.1 lineto
52824.4 32689.5 lineto
52936.9 32689.5 lineto
53011.9 32652.1 lineto
53049.4 32577.1 lineto
53049.4 32164.6 lineto
stroke
newpath
53536.9 32164.6 moveto
53461.9 32202.1 lineto
53424.4 32239.6 lineto
53386.9 32314.6 lineto
53386.9 32539.6 lineto
53424.4 32614.6 lineto
53461.9 32652.1 lineto
53536.9 32689.5 lineto
53649.3 32689.5 lineto
53724.3 32652.1 lineto
53761.8 32614.6 lineto
53799.3 32539.6 lineto
53799.3 32314.6 lineto
53761.8 32239.6 lineto
53724.3 32202.1 lineto
53649.3 32164.6 lineto
53536.9 32164.6 lineto
stroke
newpath
54024.3 32689.5 moveto
54324.3 32689.5 lineto
stroke
newpath
54136.8 32952 moveto
54136.8 32277.1 lineto
54174.3 32202.1 lineto
54249.3 32164.6 lineto
54324.3 32164.6 lineto
stroke
newpath
55186.7 32689.5 moveto
55186.7 31902.1 lineto
stroke
newpath
55186.7 32652.1 moveto
55261.6 32689.5 lineto
55411.6 32689.5 lineto
55486.6 32652.1 lineto
55524.1 32614.6 lineto
55561.6 32539.6 lineto
55561.6 32314.6 lineto
55524.1 32239.6 lineto
55486.6 32202.1 lineto
55411.6 32164.6 lineto
55261.6 32164.6 lineto
55186.7 32202.1 lineto
stroke
newpath
56011.6 32164.6 moveto
55936.6 32202.1 lineto
55899.1 32277.1 lineto
55899.1 32952 lineto
stroke
newpath
56649 32164.6 moveto
56649 32577.1 lineto
56611.5 32652.1 lineto
56536.5 32689.5 lineto
56386.5 32689.5 lineto
56311.5 32652.1 lineto
stroke
newpath
56649 32202.1 moveto
56574 32164.6 lineto
56386.5 32164.6 lineto
56311.5 32202.1 lineto
56274 32277.1 lineto
56274 32352.1 lineto
56311.5 32427.1 lineto
56386.5 32464.6 lineto
56574 32464.6 lineto
56649 32502.1 lineto
stroke
newpath
56911.4 32689.5 moveto
57211.4 32689.5 lineto
stroke
newpath
57023.9 32952 moveto
57023.9 32277.1 lineto
57061.4 32202.1 lineto
57136.4 32164.6 lineto
57211.4 32164.6 lineto
stroke
newpath
57773.8 32202.1 moveto
57698.8 32164.6 lineto
57548.9 32164.6 lineto
57473.9 32202.1 lineto
57436.4 32277.1 lineto
57436.4 32577.1 lineto
57473.9 32652.1 lineto
57548.9 32689.5 lineto
57698.8 32689.5 lineto
57773.8 32652.1 lineto
57811.3 32577.1 lineto
57811.3 32502.1 lineto
57436.4 32427.1 lineto
stroke
newpath
58486.2 32164.6 moveto
58486.2 32952 lineto
stroke
newpath
58486.2 32202.1 moveto
58411.3 32164.6 lineto
58261.3 32164.6 lineto
58186.3 32202.1 lineto
58148.8 32239.6 lineto
58111.3 32314.6 lineto
58111.3 32539.6 lineto
58148.8 32614.6 lineto
58186.3 32652.1 lineto
58261.3 32689.5 lineto
58411.3 32689.5 lineto
58486.2 32652.1 lineto
stroke
newpath
58786.2 31864.6 moveto
58823.7 31902.1 lineto
58898.7 32014.6 lineto
58936.2 32089.6 lineto
58973.7 32202.1 lineto
59011.2 32389.6 lineto
59011.2 32539.6 lineto
58973.7 32727 lineto
58936.2 32839.5 lineto
58898.7 32914.5 lineto
58823.7 33027 lineto
58786.2 33064.5 lineto
stroke
78.7397 setlinewidth
31806.4 31481.4 393.701 cir0
161.382 setlinewidth
78.7405 setlinewidth
0 0 0 setrgbcolor
0 0 0 setrgbcolor
newpath
33176.9 31837.7 moveto
33214.4 31875.1 lineto
33289.4 31912.6 lineto
33476.9 31912.6 lineto
33551.9 31875.1 lineto
33589.3 31837.7 lineto
33626.8 31762.7 lineto
33626.8 31687.7 lineto
33589.3 31575.2 lineto
33139.4 31125.2 lineto
33626.8 31125.2 lineto
stroke
newpath
33964.3 31200.2 moveto
34001.8 31162.7 lineto
33964.3 31125.2 lineto
33926.8 31162.7 lineto
33964.3 31200.2 lineto
33964.3 31125.2 lineto
stroke
newpath
34264.3 31912.6 moveto
34789.2 31912.6 lineto
34451.7 31125.2 lineto
stroke
newpath
35239.1 31912.6 moveto
35314.1 31912.6 lineto
35389.1 31875.1 lineto
35426.6 31837.7 lineto
35464.1 31762.7 lineto
35501.6 31612.7 lineto
35501.6 31425.2 lineto
35464.1 31275.2 lineto
35426.6 31200.2 lineto
35389.1 31162.7 lineto
35314.1 31125.2 lineto
35239.1 31125.2 lineto
35164.2 31162.7 lineto
35126.7 31200.2 lineto
35089.2 31275.2 lineto
35051.7 31425.2 lineto
35051.7 31612.7 lineto
35089.2 31762.7 lineto
35126.7 31837.7 lineto
35164.2 31875.1 lineto
35239.1 31912.6 lineto
stroke
newpath
35989 31912.6 moveto
36064 31912.6 lineto
36139 31875.1 lineto
36176.5 31837.7 lineto
36214 31762.7 lineto
36251.5 31612.7 lineto
36251.5 31425.2 lineto
36214 31275.2 lineto
36176.5 31200.2 lineto
36139 31162.7 lineto
36064 31125.2 lineto
35989 31125.2 lineto
35914.1 31162.7 lineto
35876.6 31200.2 lineto
35839.1 31275.2 lineto
35801.6 31425.2 lineto
35801.6 31612.7 lineto
35839.1 31762.7 lineto
35876.6 31837.7 lineto
35914.1 31875.1 lineto
35989 31912.6 lineto
stroke
newpath
36589 31125.2 moveto
36589 31650.2 lineto
stroke
newpath
36589 31575.2 moveto
36626.5 31612.7 lineto
36701.5 31650.2 lineto
36813.9 31650.2 lineto
36888.9 31612.7 lineto
36926.4 31537.7 lineto
36926.4 31125.2 lineto
stroke
newpath
36926.4 31537.7 moveto
36963.9 31612.7 lineto
37038.9 31650.2 lineto
37151.4 31650.2 lineto
37226.4 31612.7 lineto
37263.9 31537.7 lineto
37263.9 31125.2 lineto
stroke
newpath
37638.8 31125.2 moveto
37638.8 31650.2 lineto
stroke
newpath
37638.8 31575.2 moveto
37676.3 31612.7 lineto
37751.3 31650.2 lineto
37863.8 31650.2 lineto
37938.8 31612.7 lineto
37976.3 31537.7 lineto
37976.3 31125.2 lineto
stroke
newpath
37976.3 31537.7 moveto
38013.8 31612.7 lineto
38088.8 31650.2 lineto
38201.3 31650.2 lineto
38276.3 31612.7 lineto
38313.8 31537.7 lineto
38313.8 31125.2 lineto
stroke
newpath
39851.1 31950.1 moveto
39176.1 30937.8 lineto
stroke
newpath
40863.4 31912.6 moveto
40938.4 31912.6 lineto
41013.4 31875.1 lineto
41050.9 31837.7 lineto
41088.4 31762.7 lineto
41125.9 31612.7 lineto
41125.9 31425.2 lineto
41088.4 31275.2 lineto
41050.9 31200.2 lineto
41013.4 31162.7 lineto
40938.4 31125.2 lineto
40863.4 31125.2 lineto
40788.4 31162.7 lineto
40751 31200.2 lineto
40713.5 31275.2 lineto
40676 31425.2 lineto
40676 31612.7 lineto
40713.5 31762.7 lineto
40751 31837.7 lineto
40788.4 31875.1 lineto
40863.4 31912.6 lineto
stroke
newpath
41463.4 31200.2 moveto
41500.9 31162.7 lineto
41463.4 31125.2 lineto
41425.9 31162.7 lineto
41463.4 31200.2 lineto
41463.4 31125.2 lineto
stroke
newpath
42250.8 31125.2 moveto
41800.8 31125.2 lineto
stroke
newpath
42025.8 31125.2 moveto
42025.8 31912.6 lineto
41950.8 31800.2 lineto
41875.8 31725.2 lineto
41800.8 31687.7 lineto
stroke
newpath
42738.2 31912.6 moveto
42813.2 31912.6 lineto
42888.2 31875.1 lineto
42925.7 31837.7 lineto
42963.2 31762.7 lineto
43000.7 31612.7 lineto
43000.7 31425.2 lineto
42963.2 31275.2 lineto
42925.7 31200.2 lineto
42888.2 31162.7 lineto
42813.2 31125.2 lineto
42738.2 31125.2 lineto
42663.2 31162.7 lineto
42625.7 31200.2 lineto
42588.2 31275.2 lineto
42550.7 31425.2 lineto
42550.7 31612.7 lineto
42588.2 31762.7 lineto
42625.7 31837.7 lineto
42663.2 31875.1 lineto
42738.2 31912.6 lineto
stroke
newpath
43675.6 31912.6 moveto
43525.6 31912.6 lineto
43450.6 31875.1 lineto
43413.1 31837.7 lineto
43338.1 31725.2 lineto
43300.6 31575.2 lineto
43300.6 31275.2 lineto
43338.1 31200.2 lineto
43375.6 31162.7 lineto
43450.6 31125.2 lineto
43600.6 31125.2 lineto
43675.6 31162.7 lineto
43713.1 31200.2 lineto
43750.6 31275.2 lineto
43750.6 31462.7 lineto
43713.1 31537.7 lineto
43675.6 31575.2 lineto
43600.6 31612.7 lineto
43450.6 31612.7 lineto
43375.6 31575.2 lineto
43338.1 31537.7 lineto
43300.6 31462.7 lineto
stroke
newpath
44013 31912.6 moveto
44500.5 31912.6 lineto
44238 31612.7 lineto
44350.5 31612.7 lineto
44425.5 31575.2 lineto
44463 31537.7 lineto
44500.5 31462.7 lineto
44500.5 31275.2 lineto
44463 31200.2 lineto
44425.5 31162.7 lineto
44350.5 31125.2 lineto
44125.5 31125.2 lineto
44050.5 31162.7 lineto
44013 31200.2 lineto
stroke
newpath
44800.4 31912.6 moveto
44800.4 31762.7 lineto
stroke
newpath
45100.4 31912.6 moveto
45100.4 31762.7 lineto
stroke
newpath
46262.8 30825.3 moveto
46225.3 30862.8 lineto
46150.3 30975.3 lineto
46112.8 31050.3 lineto
46075.3 31162.7 lineto
46037.8 31350.2 lineto
46037.8 31500.2 lineto
46075.3 31687.7 lineto
46112.8 31800.2 lineto
46150.3 31875.1 lineto
46225.3 31987.6 lineto
46262.8 32025.1 lineto
stroke
newpath
46900.2 31650.2 moveto
46900.2 31125.2 lineto
stroke
newpath
46712.7 31950.1 moveto
46525.2 31387.7 lineto
47012.7 31387.7 lineto
stroke
newpath
47912.6 31125.2 moveto
47912.6 31912.6 lineto
stroke
newpath
48250 31125.2 moveto
48250 31537.7 lineto
48212.5 31612.7 lineto
48137.5 31650.2 lineto
48025 31650.2 lineto
47950.1 31612.7 lineto
47912.6 31575.2 lineto
stroke
newpath
48737.5 31125.2 moveto
48662.5 31162.7 lineto
48625 31200.2 lineto
48587.5 31275.2 lineto
48587.5 31500.2 lineto
48625 31575.2 lineto
48662.5 31612.7 lineto
48737.5 31650.2 lineto
48849.9 31650.2 lineto
48924.9 31612.7 lineto
48962.4 31575.2 lineto
48999.9 31500.2 lineto
48999.9 31275.2 lineto
48962.4 31200.2 lineto
48924.9 31162.7 lineto
48849.9 31125.2 lineto
48737.5 31125.2 lineto
stroke
newpath
49449.9 31125.2 moveto
49374.9 31162.7 lineto
49337.4 31237.7 lineto
49337.4 31912.6 lineto
stroke
newpath
50049.8 31162.7 moveto
49974.8 31125.2 lineto
49824.8 31125.2 lineto
49749.8 31162.7 lineto
49712.3 31237.7 lineto
49712.3 31537.7 lineto
49749.8 31612.7 lineto
49824.8 31650.2 lineto
49974.8 31650.2 lineto
50049.8 31612.7 lineto
50087.3 31537.7 lineto
50087.3 31462.7 lineto
49712.3 31387.7 lineto
stroke
newpath
50387.3 31162.7 moveto
50462.2 31125.2 lineto
50612.2 31125.2 lineto
50687.2 31162.7 lineto
50724.7 31237.7 lineto
50724.7 31275.2 lineto
50687.2 31350.2 lineto
50612.2 31387.7 lineto
50499.7 31387.7 lineto
50424.7 31425.2 lineto
50387.3 31500.2 lineto
50387.3 31537.7 lineto
50424.7 31612.7 lineto
50499.7 31650.2 lineto
50612.2 31650.2 lineto
50687.2 31612.7 lineto
stroke
newpath
50987.2 30825.3 moveto
51024.7 30862.8 lineto
51099.7 30975.3 lineto
51137.2 31050.3 lineto
51174.7 31162.7 lineto
51212.1 31350.2 lineto
51212.1 31500.2 lineto
51174.7 31687.7 lineto
51137.2 31800.2 lineto
51099.7 31875.1 lineto
51024.7 31987.6 lineto
50987.2 32025.1 lineto
stroke
newpath
52412 30825.3 moveto
52374.5 30862.8 lineto
52299.5 30975.3 lineto
52262 31050.3 lineto
52224.5 31162.7 lineto
52187 31350.2 lineto
52187 31500.2 lineto
52224.5 31687.7 lineto
52262 31800.2 lineto
52299.5 31875.1 lineto
52374.5 31987.6 lineto
52412 32025.1 lineto
stroke
newpath
52712 31650.2 moveto
52712 31125.2 lineto
stroke
newpath
52712 31575.2 moveto
52749.5 31612.7 lineto
52824.4 31650.2 lineto
52936.9 31650.2 lineto
53011.9 31612.7 lineto
53049.4 31537.7 lineto
53049.4 31125.2 lineto
stroke
newpath
53536.9 31125.2 moveto
53461.9 31162.7 lineto
53424.4 31200.2 lineto
53386.9 31275.2 lineto
53386.9 31500.2 lineto
53424.4 31575.2 lineto
53461.9 31612.7 lineto
53536.9 31650.2 lineto
53649.3 31650.2 lineto
53724.3 31612.7 lineto
53761.8 31575.2 lineto
53799.3 31500.2 lineto
53799.3 31275.2 lineto
53761.8 31200.2 lineto
53724.3 31162.7 lineto
53649.3 31125.2 lineto
53536.9 31125.2 lineto
stroke
newpath
54024.3 31650.2 moveto
54324.3 31650.2 lineto
stroke
newpath
54136.8 31912.6 moveto
54136.8 31237.7 lineto
54174.3 31162.7 lineto
54249.3 31125.2 lineto
54324.3 31125.2 lineto
stroke
newpath
55186.7 31650.2 moveto
55186.7 30862.8 lineto
stroke
newpath
55186.7 31612.7 moveto
55261.6 31650.2 lineto
55411.6 31650.2 lineto
55486.6 31612.7 lineto
55524.1 31575.2 lineto
55561.6 31500.2 lineto
55561.6 31275.2 lineto
55524.1 31200.2 lineto
55486.6 31162.7 lineto
55411.6 31125.2 lineto
55261.6 31125.2 lineto
55186.7 31162.7 lineto
stroke
newpath
56011.6 31125.2 moveto
55936.6 31162.7 lineto
55899.1 31237.7 lineto
55899.1 31912.6 lineto
stroke
newpath
56649 31125.2 moveto
56649 31537.7 lineto
56611.5 31612.7 lineto
56536.5 31650.2 lineto
56386.5 31650.2 lineto
56311.5 31612.7 lineto
stroke
newpath
56649 31162.7 moveto
56574 31125.2 lineto
56386.5 31125.2 lineto
56311.5 31162.7 lineto
56274 31237.7 lineto
56274 31312.7 lineto
56311.5 31387.7 lineto
56386.5 31425.2 lineto
56574 31425.2 lineto
56649 31462.7 lineto
stroke
newpath
56911.4 31650.2 moveto
57211.4 31650.2 lineto
stroke
newpath
57023.9 31912.6 moveto
57023.9 31237.7 lineto
57061.4 31162.7 lineto
57136.4 31125.2 lineto
57211.4 31125.2 lineto
stroke
newpath
57773.8 31162.7 moveto
57698.8 31125.2 lineto
57548.9 31125.2 lineto
57473.9 31162.7 lineto
57436.4 31237.7 lineto
57436.4 31537.7 lineto
57473.9 31612.7 lineto
57548.9 31650.2 lineto
57698.8 31650.2 lineto
57773.8 31612.7 lineto
57811.3 31537.7 lineto
57811.3 31462.7 lineto
57436.4 31387.7 lineto
stroke
newpath
58486.2 31125.2 moveto
58486.2 31912.6 lineto
stroke
newpath
58486.2 31162.7 moveto
58411.3 31125.2 lineto
58261.3 31125.2 lineto
58186.3 31162.7 lineto
58148.8 31200.2 lineto
58111.3 31275.2 lineto
58111.3 31500.2 lineto
58148.8 31575.2 lineto
58186.3 31612.7 lineto
58261.3 31650.2 lineto
58411.3 31650.2 lineto
58486.2 31612.7 lineto
stroke
newpath
58786.2 30825.3 moveto
58823.7 30862.8 lineto
58898.7 30975.3 lineto
58936.2 31050.3 lineto
58973.7 31162.7 lineto
59011.2 31350.2 lineto
59011.2 31500.2 lineto
58973.7 31687.7 lineto
58936.2 31800.2 lineto
58898.7 31875.1 lineto
58823.7 31987.6 lineto
58786.2 32025.1 lineto
stroke
showpage
grestore
%%EOF
