<?xml version="1.0" encoding="UTF-8"?>
<svg width="40px" height="48px" viewBox="0 0 40 48" version="1.1" xmlns="http://www.w3.org/2000/svg" xmlns:xlink="http://www.w3.org/1999/xlink">
    <!-- Generator: Sketch 58 (84663) - https://sketch.com -->
    <title>Shape</title>
    <desc>Created with Sketch.</desc>
    <g id="Page-1" stroke="none" stroke-width="1" fill="none" fill-rule="evenodd">
        <g id="Hifi)-The-Forms-page" transform="translate(-764.000000, -371.000000)" fill="#191b1e" fill-rule="nonzero">
            <g id="Group-6" transform="translate(647.000000, 333.000000)">
                <g id="Group-10" transform="translate(31.000000, 38.000000)">
                    <path d="M114.235301,18.2857143 C110.336715,18.2857143 107.176482,15.21568 107.176482,11.4285714 L107.176482,2.28573714 L97.7647225,2.28573714 C95.1657358,2.28573714 93.0588429,4.33243429 93.0588429,6.85716571 L93.0588429,36.5714286 C93.0588429,39.0962286 95.1657358,41.1428571 97.7647225,41.1428571 L118.941181,41.1428571 C121.540238,41.1428571 123.64706,39.0962286 123.64706,36.5714286 L123.64706,18.2857143 L114.235301,18.2857143 Z M109.529421,11.4285714 C109.529421,13.9533029 111.636244,16 114.235301,16 L122.672473,16 L109.529421,3.23248 L109.529421,11.4285714 Z M97.7647225,0 L109.529421,0 L126,16 L126,36.5714286 C126,40.3586286 122.839767,43.4285714 118.941181,43.4285714 L97.7647225,43.4285714 C93.8662307,43.4285714 90.7059031,40.3586286 90.7059031,36.5714286 L90.7059031,6.85714286 C90.7059031,3.07005714 93.8662307,0 97.7647225,0 Z M97.7647225,48 C91.2672675,48 86,42.8832 86,36.5714286 L86,9.14285714 L88.3529633,9.14285714 L88.3529869,36.5714286 C88.3529869,41.6208 92.5667726,45.7142857 97.764746,45.7142857 L116.588241,45.7142857 L116.588241,48 L97.7647225,48 Z" id="Shape"></path>
                </g>
            </g>
        </g>
    </g>
</svg>