<?xml version="1.0" encoding="UTF-8"?>
<svg width="54px" height="48px" viewBox="0 0 54 48" version="1.1" xmlns="http://www.w3.org/2000/svg" xmlns:xlink="http://www.w3.org/1999/xlink">
    <!-- Generator: Sketch 58 (84663) - https://sketch.com -->
    <title>Shape</title>
    <desc>Created with Sketch.</desc>
    <g id="Page-1" stroke="none" stroke-width="1" fill="none" fill-rule="evenodd">
        <g id="Hifi)-Home-Manage-Expanded-Hover-Dashboard" transform="translate(-1078.000000, -373.000000)" fill="#191b1e" fill-rule="nonzero">
            <g id="Group" transform="translate(968.000000, 323.000000)">
                <g id="Group-8" transform="translate(0.000000, 10.000000)">
                    <g id="Group-11" transform="translate(26.000000, 40.000000)">
                        <g id="note" transform="translate(84.000000, 0.000000)">
                            <path d="M39.5294583,22.5882054 C34.8511469,22.5882054 31.0588601,18.7959186 31.0588601,14.1176637 L31.0588601,2.82353273 L8.47056997,2.82353273 C5.35178041,2.82353273 2.8235045,5.35180865 2.8235045,8.4705982 L2.8235045,39.5294018 C2.8235045,42.6482761 5.35178041,45.1764673 8.47056997,45.1764673 L45.1765237,45.1764673 C48.2951156,45.1764673 50.8235892,42.6482761 50.8235892,39.5294018 L50.8235892,22.5882054 L39.5294583,22.5882054 Z M33.8823928,14.1176637 C33.8823928,17.2364815 36.410584,19.7646727 39.5294583,19.7646727 L49.6540819,19.7646727 L33.8823928,3.99303999 L33.8823928,14.1176637 Z M8.47056997,0 L33.8823928,0 L53.6471219,19.7646727 L53.6471219,39.5294018 C53.6471219,44.2077132 49.8545528,48 45.1765237,48 L8.47056997,48 C3.79239976,48 0,44.2077132 0,39.5294018 L0,8.4705982 C0,3.79239976 3.79239976,0 8.47056997,0 Z" id="Shape"></path>
                        </g>
                    </g>
                </g>
            </g>
        </g>
    </g>
</svg>
