<svg xmlns="http://www.w3.org/2000/svg" xmlns:xlink="http://www.w3.org/1999/xlink" width="48" height="46" viewBox="0 0 48 46">
    <defs>
        <filter id="prefix__a" width="110.2%" height="112.4%" x="-5.1%" y="-5.2%" filterUnits="objectBoundingBox">
            <feOffset dy="2" in="SourceAlpha" result="shadowOffsetOuter1"/>
            <feGaussianBlur in="shadowOffsetOuter1" result="shadowBlurOuter1" stdDeviation="4"/>
            <feColorMatrix in="shadowBlurOuter1" values="0 0 0 0 0.458823529 0 0 0 0 0.458823529 0 0 0 0 0.458823529 0 0 0 1 0"/>
        </filter>
        <path id="prefix__b" d="M570 0H825V210H570z"/>
    </defs>
    <g fill="none" fill-rule="evenodd">
        <path fill="#F7F7F7" d="M0 0H1440V2302H0z" transform="translate(-755 -484)"/>
        <path fill="#1E1E1E" d="M0 0H1440V766H0z" transform="translate(-755 -484)"/>
        <g transform="translate(-755 -484) translate(165 456)">
            <use fill="#000" filter="url(#prefix__a)" xlink:href="#prefix__b"/>
            <use fill="#FFF" xlink:href="#prefix__b"/>
            <g>
                <path d="M0 0H48V48H0z" transform="translate(590 27)"/>
                <path fill="#3A3A3A" fill-rule="nonzero" d="M38 10h-4V6H14v4h-4c-2.2 0-4 1.8-4 4v2c0 5.1 3.84 9.26 8.78 9.88 1.26 3 3.96 5.26 7.22 5.92V38h-8v4h20v-4h-8v-6.2c3.26-.66 5.96-2.92 7.22-5.92C38.16 25.26 42 21.1 42 16v-2c0-2.2-1.8-4-4-4zm-28 6v-2h4v7.64c-2.32-.84-4-3.04-4-5.64zm14 12c-3.3 0-6-2.7-6-6V10h12v12c0 3.3-2.7 6-6 6zm14-12c0 2.6-1.68 4.8-4 5.64V14h4v2z" transform="translate(590 27)"/>
            </g>
        </g>
    </g>
</svg>
