<svg xmlns="http://www.w3.org/2000/svg" width="20" height="20" fill="none" viewBox="0 0 20 20">
    <path fill="#00C585" fill-rule="evenodd" d="M10 1.666c-4.6 0-8.333 3.733-8.333 8.333S5.4 18.333 10 18.333s8.333-3.734 8.333-8.334S14.6 1.666 10 1.666zm0 15c-3.675 0-6.667-2.992-6.667-6.667S6.325 3.333 10 3.333s6.667 2.991 6.667 6.666c0 3.675-2.992 6.667-6.667 6.667zm-1.667-4.858l5.492-5.492L15 7.499l-6.667 6.667L5 10.833l1.175-1.175 2.158 2.15z" clip-rule="evenodd"/>
</svg>
