<?xml version="1.0" encoding="UTF-8"?>
<svg width="71px" height="50px" viewBox="0 0 71 50" version="1.1" xmlns="http://www.w3.org/2000/svg" xmlns:xlink="http://www.w3.org/1999/xlink">
    <!-- Generator: Sketch 58 (84663) - https://sketch.com -->
    <title>handshake</title>
    <desc>Created with Sketch.</desc>
    <g id="Page-1" stroke="none" stroke-width="1" fill="none" fill-rule="evenodd">
        <g id="Hifi)-Home-Manage-Expanded-Hover-Dashboard" transform="translate(-427.000000, -643.000000)" fill-rule="nonzero" stroke="#191b1e" stroke-width="2">
            <g id="Group-2-Copy" transform="translate(326.000000, 606.000000)">
                <path d="M168,44.8571429 L162.857143,44.8571429 C162.095679,44.8571429 161.411786,45.1883215 160.941,45.7142858 L158.420357,45.7142858 L155.085,41.825 L155.067857,41.8057143 C152.952222,39.387013 149.895199,38 146.681786,38 L141.694286,38 C139.7925,38 137.955,38.5292858 136.370357,39.5010715 C134.606786,38.5282143 132.6075,38 130.566429,38 L127.126071,38 C124.029321,38 120.95475,39.2020358 118.640357,41.5142858 L114.441429,45.7142858 L111.630429,45.7142858 C111.159643,45.1883215 110.47575,44.8571429 109.714286,44.8571429 L104.571429,44.8571429 C103.15125,44.8571429 102,46.0083929 102,47.4285715 L102,73.1428572 C102,74.5630357 103.15125,75.7142857 104.571429,75.7142857 L109.714286,75.7142857 C110.833821,75.7142857 111.785786,74.9985714 112.138821,74 L114.153214,74 L122.226429,81.2396429 C124.963071,84.0735714 128.646964,86 132.574286,86 C134.330357,86 136.032857,85.5875 137.513571,84.8289286 C140.185286,84.8820714 142.988679,83.7180714 144.913929,81.4635714 C147.022929,80.8658214 148.932107,79.5965 150.348214,77.7564286 C152.597036,77.2848929 154.711929,75.9894286 156.071786,74 L160.432607,74 C160.785643,74.9985714 161.737607,75.7142857 162.857143,75.7142857 L168,75.7142857 C169.420179,75.7142857 170.571428,74.5630357 170.571428,73.1428572 L170.571428,47.4285715 C170.571428,46.0083929 169.420179,44.8571429 168,44.8571429 Z M151.341429,71.6685714 C149.696786,73.2001786 147.389571,72.8822857 147.061071,72.5257143 C147.212571,73.9595 145.104964,76.9231786 141.8025,76.6914286 C141.208821,78.6760357 138.779143,80.3156429 136.285714,79.4503571 C135.333214,80.4028571 133.879286,80.8571429 132.574286,80.8571429 C129.901071,80.8571429 127.456071,79.2992857 125.809286,77.5453572 L117.098571,69.7335714 C116.469867,69.1692494 115.654824,68.8571215 114.81,68.8571429 L112.285714,68.8571429 L112.285714,50.8571429 L115.151786,50.8571429 C116.060357,50.8571429 116.9325,50.4960715 117.575357,49.8532143 L122.276786,45.1517858 C123.562827,43.8655364 125.307187,43.1428572 127.126071,43.1428572 L130.566429,43.1428572 C131.187857,43.1428572 131.799643,43.2275 132.387857,43.3892858 L127.751786,48.7989286 C125.2275,51.7432143 125.1975,56.0439286 127.681071,59.0246429 C131.151214,63.1888572 137.471571,63.2276429 141.018214,59.2367857 L143.801786,56.0139286 L151.563214,66.2857143 C153.003214,67.85 152.736429,70.3710714 151.341429,71.6685714 Z M160.285714,68.8571429 L157.665214,68.8571429 C157.676357,66.6863214 156.93675,64.6432143 155.547857,63.0285715 L147.182143,51.9585715 C147.665357,50.9396429 147.432857,49.6839286 146.538214,48.9103572 C145.45875,47.9791786 143.835,48.1068929 142.910357,49.1760715 L137.164286,55.8317857 C135.682714,57.4828572 133.068964,57.4544643 131.631429,55.7321429 C130.76051,54.6919858 130.77094,53.1741613 131.656071,52.1460715 L137.861786,44.9053572 C138.820602,43.7863725 140.2207,43.1424922 141.694286,43.142857 L146.681786,43.142857 C148.407857,43.142857 150.050357,43.8864286 151.189286,45.1828572 L156.055714,50.8571429 L160.285714,50.8571429 L160.285714,68.8571429 Z" id="handshake"></path>
            </g>
        </g>
    </g>
</svg>
