<svg xmlns="http://www.w3.org/2000/svg" width="20" height="20" fill="none" viewBox="0 0 20 20">
    <path fill="#C62828" fill-rule="evenodd" d="M10 1.666c-4.608 0-8.333 3.725-8.333 8.333 0 4.609 3.725 8.334 8.333 8.334 4.608 0 8.333-3.725 8.333-8.334 0-4.608-3.725-8.333-8.333-8.333zm0 15c-3.675 0-6.667-2.992-6.667-6.667S6.325 3.333 10 3.333s6.667 2.991 6.667 6.666c0 3.675-2.992 6.667-6.667 6.667zm0-7.842l2.992-2.991 1.175 1.175-2.992 2.991 2.992 2.992-1.175 1.175L10 11.174l-2.992 2.992-1.175-1.175 2.992-2.992-2.992-2.991 1.175-1.175L10 8.824z" clip-rule="evenodd"/>
</svg>
