<?xml version="1.0" encoding="UTF-8"?>
<svg width="32px" height="48px" viewBox="0 0 32 48" version="1.1" xmlns="http://www.w3.org/2000/svg" xmlns:xlink="http://www.w3.org/1999/xlink">
    <!-- Generator: Sketch 58 (84663) - https://sketch.com -->
    <title>Shape</title>
    <desc>Created with Sketch.</desc>
    <g id="Page-1" stroke="none" stroke-width="1" fill="none" fill-rule="evenodd">
        <g id="Hifi)-Home-Manage-Expanded-Hover-Promote" transform="translate(-447.000000, -371.000000)" fill="#191b1e" fill-rule="nonzero">
            <g id="Group-2" transform="translate(326.000000, 333.000000)">
                <g id="Group-9" transform="translate(30.000000, 38.000000)">
                    <g id="lightbulb" transform="translate(91.000000, 0.000000)">
                        <path d="M22.1538462,42.9473684 C22.1538462,45.7379368 19.9497846,48 17.2307692,48 L14.7692308,48 C12.0502892,48 9.84615385,45.7379368 9.84615385,42.9473684 L12.3076923,42.9473684 C12.3076923,44.3426526 13.4097231,45.4736842 14.7692308,45.4736842 L17.2307692,45.4736842 C18.5902769,45.4736842 19.6923077,44.3426526 19.6923077,42.9473684 L22.1538462,42.9473684 Z M24.6153846,35.3684211 C24.6153846,38.1589895 22.4113231,40.4210526 19.6923077,40.4210526 L12.3076923,40.4210526 C9.58875077,40.4210526 7.38461538,38.1589895 7.38461538,35.3684211 L7.38461538,30.2607158 C2.94360615,27.3425684 0,22.2346105 0,16.4210526 C0,7.35195789 7.16344615,0 16,0 C24.8364308,0 32,7.35195789 32,16.4210526 C32,22.2346105 29.0562462,27.3425684 24.6153846,30.2607158 L24.6153846,35.3684211 Z M9.84615385,35.3684211 C9.84615385,36.7637053 10.9482092,37.8947368 12.3076923,37.8947368 L19.6923077,37.8947368 C21.0518154,37.8947368 22.1538462,36.7637053 22.1538462,35.3684211 L22.1538462,28.8007579 C26.5373538,26.5008 29.5384615,21.8205474 29.5384615,16.4210526 C29.5384615,8.74721684 23.4771692,2.52631579 16,2.52631579 C8.52290462,2.52631579 2.46153846,8.74721684 2.46153846,16.4210526 C2.46153846,21.8205474 5.46254769,26.5008 9.84615385,28.8007579 L9.84615385,35.3684211 Z" id="Shape"></path>
                    </g>
                </g>
            </g>
        </g>
    </g>
</svg>
