<svg xmlns="http://www.w3.org/2000/svg" xmlns:xlink="http://www.w3.org/1999/xlink" width="48" height="48" viewBox="0 0 48 48">
    <defs>
        <filter id="prefix__a" width="110.2%" height="112.4%" x="-5.1%" y="-5.2%" filterUnits="objectBoundingBox">
            <feOffset dy="2" in="SourceAlpha" result="shadowOffsetOuter1"/>
            <feGaussianBlur in="shadowOffsetOuter1" result="shadowBlurOuter1" stdDeviation="4"/>
            <feColorMatrix in="shadowBlurOuter1" values="0 0 0 0 0.458823529 0 0 0 0 0.458823529 0 0 0 0 0.458823529 0 0 0 1 0"/>
        </filter>
        <path id="prefix__b" d="M735 206H990V416H735z"/>
    </defs>
    <g fill="none" fill-rule="evenodd" transform="translate(-755 -246)">
        <path fill="#F7F7F7" d="M0 0H1440V2302H0z"/>
        <path fill="#1E1E1E" d="M0 0H1440V766H0z"/>
        <use fill="#000" filter="url(#prefix__a)" xlink:href="#prefix__b"/>
        <use fill="#FFF" xlink:href="#prefix__b"/>
        <g>
            <path d="M0 0L48 0 48 48 0 48z" transform="translate(755 246)"/>
            <path fill="#3A3A3A" fill-rule="nonzero" d="M38 8h-2V4h-4v4H16V4h-4v4h-2c-2.22 0-3.98 1.8-3.98 4L6 40c0 2.2 1.78 4 4 4h28c2.2 0 4-1.8 4-4V12c0-2.2-1.8-4-4-4zm0 32H10V20h28v20zm0-24H10v-4h28v4zM24 26h10v10H24V26z" transform="translate(755 246)"/>
        </g>
    </g>
</svg>
