<?xml version="1.0" encoding="UTF-8"?>
<svg width="138px" height="26px" viewBox="0 0 138 26" version="1.1" xmlns="http://www.w3.org/2000/svg" xmlns:xlink="http://www.w3.org/1999/xlink">
    <!-- Generator: Sketch 58 (84663) - https://sketch.com -->
    <title>Group 9</title>
    <desc>Created with Sketch.</desc>
    <g id="Page-1" stroke="none" stroke-width="1" fill="none" fill-rule="evenodd">
        <g id="Hifi)-Pages" transform="translate(-393.000000, -366.000000)">
            <g id="Group-2" transform="translate(325.000000, 317.000000)">
                <g id="Group-7" transform="translate(30.000000, 50.000000)">
                    <g id="Group-9" transform="translate(39.000000, 0.000000)">
                        <rect id="Rectangle" fill="#191b1e" x="12" y="11" width="109" height="2"></rect>
                        <circle id="Oval-Copy-2" stroke="#191b1e" stroke-width="2" fill="#FFFFFF" cx="124" cy="12" r="12"></circle>
                        <circle id="Oval" stroke="#191b1e" stroke-width="2" fill="#FFFFFF" cx="12" cy="12" r="12"></circle>
                        <circle id="Oval-Copy" stroke="#191b1e" stroke-width="2" fill="#FFFFFF" cx="68" cy="12" r="12"></circle>
                        <circle id="Oval" fill="#191b1e" cx="12" cy="12" r="4"></circle>
                        <circle id="Oval-Copy-3" fill="#191b1e" cx="68" cy="12" r="4"></circle>
                        <circle id="Oval-Copy-4" fill="#191b1e" cx="124" cy="12" r="4"></circle>
                    </g>
                </g>
            </g>
        </g>
    </g>
</svg>