<?xml version="1.0" encoding="UTF-8"?>
<svg width="52px" height="53px" viewBox="0 0 52 53" version="1.1" xmlns="http://www.w3.org/2000/svg" xmlns:xlink="http://www.w3.org/1999/xlink">
    <!-- Generator: Sketch 58 (84663) - https://sketch.com -->
    <title>wrench</title>
    <desc>Created with Sketch.</desc>
    <g id="Page-1" stroke="none" stroke-width="1" fill="none" fill-rule="evenodd">
        <g id="Hifi)-Pages" transform="translate(-756.000000, -352.000000)" fill-rule="nonzero" stroke="#191b1e" stroke-width="2">
            <g id="Group-6" transform="translate(647.000000, 317.000000)">
                <g id="Group-10" transform="translate(31.000000, 36.000000)">
                    <path d="M127.828737,19.0705128 C128.73324,19.0705128 129.299284,20.0388181 128.83293,20.7986827 C126.383381,24.7909038 121.921556,27.4615385 116.82337,27.4615385 C109.118368,27.4615385 102.866698,21.3614535 102.818458,13.8185889 C102.770023,6.24263702 109.095999,0 116.823565,0 C121.916207,0 126.373947,2.66500881 128.825246,6.65017388 C129.295782,7.4151875 128.739756,8.39102564 127.828543,8.39102564 L117.601437,8.39102564 L113.711103,13.7307692 L117.601437,19.0705128 L127.828737,19.0705128 Z M109,30.0446479 L89.5898902,49.2063203 C87.1672613,51.5978454 83.2396248,51.5979411 80.816899,49.2063203 C78.394367,46.8146996 78.394367,42.9372387 80.816899,40.545618 L100.226427,21.3846154 C101.79279,25.3266655 105.005289,28.4975677 109,30.0446479 Z M89.3636364,43.1923077 C89.3636364,41.8540625 88.2647159,40.7692308 86.9090909,40.7692308 C85.5534659,40.7692308 84.4545455,41.8540625 84.4545455,43.1923077 C84.4545455,44.5305529 85.5534659,45.6153846 86.9090909,45.6153846 C88.2647159,45.6153846 89.3636364,44.5305529 89.3636364,43.1923077 Z" id="wrench" transform="translate(104.000000, 25.500000) scale(-1, 1) translate(-104.000000, -25.500000) "></path>
                </g>
            </g>
        </g>
    </g>
</svg>