<?xml version="1.0" encoding="utf-8"?>
<!-- Generator: Adobe Illustrator 22.0.1, SVG Export Plug-In . SVG Version: 6.00 Build 0)  -->
<svg version="1.1" id="Layer_1" xmlns="http://www.w3.org/2000/svg" xmlns:xlink="http://www.w3.org/1999/xlink" x="0px" y="0px"
	 viewBox="0 0 48 48" style="enable-background:new 0 0 48 48;" xml:space="preserve">
<style type="text/css">
	.st0{fill:#3A3A3A;}
</style>
<path class="st0" d="M18,27.5c-4.7,0-14,2.3-14,7V38h28v-3.5C32,29.8,22.7,27.5,18,27.5z M8.7,34c1.7-1.2,5.7-2.5,9.3-2.5
	s7.6,1.3,9.3,2.5H8.7z M18,24c3.9,0,7-3.1,7-7s-3.1-7-7-7s-7,3.1-7,7S14.1,24,18,24z M18,14c1.7,0,3,1.3,3,3s-1.3,3-3,3s-3-1.3-3-3
	S16.3,14,18,14z M32.1,27.6c2.3,1.7,3.9,3.9,3.9,6.9V38h8v-3.5C44,30.5,37,28.2,32.1,27.6z M30,24c3.9,0,7-3.1,7-7s-3.1-7-7-7
	c-1.1,0-2.1,0.3-3,0.7c1.3,1.8,2,4,2,6.3s-0.7,4.5-2,6.3C27.9,23.7,28.9,24,30,24z"/>
</svg>
