<svg xmlns="http://www.w3.org/2000/svg" xmlns:xlink="http://www.w3.org/1999/xlink" viewBox="0 0 48 48">
            <g transform="translate(-24 -42)">
                <g fill="#3A3A3A" fill-rule="nonzero">
                    <path d="M15 0c-.92 0-1.86.08-2.8.28C6.68 1.34 2.28 5.8 1.24 11.32c-.96 5.22.96 10.02 4.44 13.12A3.89 3.89 0 017 27.38V32c0 2.2 1.8 4 4 4h.56c.7 1.2 1.96 2 3.44 2s2.76-.8 3.44-2H19c2.2 0 4-1.8 4-4v-4.62c0-1.1.44-2.18 1.28-2.92C27.18 21.9 29 18.16 29 14c0-7.74-6.26-14-14-14zm4 28h-8v-2h8v2zm-8 4v-2h8v2h-8zm10.62-10.52c-.18.16-.32.36-.48.52H8.84c-.16-.18-.3-.38-.48-.54-2.64-2.36-3.82-5.88-3.18-9.4.72-3.88 3.92-7.1 7.78-7.86.68-.14 1.36-.2 2.04-.2 5.52 0 10 4.48 10 10 0 2.86-1.22 5.58-3.38 7.48z" transform="translate(20 40) translate(9 6)"/>
                    <g>
                        <path d="M4 5H6V11H4z" transform="translate(20 40) translate(9 6) translate(10 11)"/>
                        <path d="M2.173 0.576L4.173 0.576 4.173 6.576 2.173 6.576z" transform="translate(20 40) translate(9 6) translate(10 11) rotate(-45 3.173 3.576)"/>
                        <path d="M5.83 0.596L7.83 0.596 7.83 6.596 5.83 6.596z" transform="translate(20 40) translate(9 6) translate(10 11) rotate(-135 6.83 3.596)"/>
                    </g>
                </g>
            </g>
</svg>

