<svg xmlns="http://www.w3.org/2000/svg" xmlns:xlink="http://www.w3.org/1999/xlink" width="48" height="48" viewBox="0 0 48 48">
    <defs>
        <filter id="prefix__a" width="110.2%" height="112.4%" x="-5.1%" y="-5.2%" filterUnits="objectBoundingBox">
            <feOffset dy="2" in="SourceAlpha" result="shadowOffsetOuter1"/>
            <feGaussianBlur in="shadowOffsetOuter1" result="shadowBlurOuter1" stdDeviation="4"/>
            <feColorMatrix in="shadowBlurOuter1" values="0 0 0 0 0.458823529 0 0 0 0 0.458823529 0 0 0 0 0.458823529 0 0 0 1 0"/>
        </filter>
        <path id="prefix__b" d="M285 0H540V210H285z"/>
    </defs>
    <g fill="none" fill-rule="evenodd">
        <path fill="#F7F7F7" d="M0 0H1440V2302H0z" transform="translate(-470 -487)"/>
        <path fill="#1E1E1E" d="M0 0H1440V766H0z" transform="translate(-470 -487)"/>
        <g transform="translate(-470 -487) translate(165 456)">
            <use fill="#000" filter="url(#prefix__a)" xlink:href="#prefix__b"/>
            <use fill="#FFF" xlink:href="#prefix__b"/>
            <g>
                <path d="M0 0L48 0 48 48 0 48z" transform="translate(305 31)"/>
                <path fill="#3A3A3A" fill-rule="nonzero" d="M25 20c0-3.3-2.7-6-6-6s-6 2.7-6 6 2.7 6 6 6 6-2.7 6-6zm-6 2c-1.1 0-2-.9-2-2s.9-2 2-2 2 .9 2 2-.9 2-2 2zm13 4c2.22 0 4-1.78 4-4 0-2.22-1.78-4-4-4-2.22 0-4.02 1.78-4 4 0 2.22 1.78 4 4 4zM23.98 4.02c-11.04 0-20 8.96-20 20s8.96 20 20 20 20-8.96 20-20-8.96-20-20-20zm-12.3 30.22c1.36-1.08 4.54-2.22 7.32-2.22.14 0 .3.02.46.02.48-1.28 1.34-2.58 2.6-3.72-1.12-.2-2.18-.32-3.06-.32-2.6 0-6.78.9-9.46 2.86-1-2.08-1.56-4.4-1.56-6.86 0-8.82 7.18-16 16-16s16 7.18 16 16c0 2.4-.54 4.68-1.5 6.74-2-1.18-4.72-1.74-6.48-1.74-3.04 0-9 1.62-9 5.4v5.56a15.87 15.87 0 01-11.32-5.72z" transform="translate(305 31)"/>
            </g>
        </g>
    </g>
</svg>
