<?xml version="1.0" encoding="UTF-8"?>
<svg width="48px" height="48px" viewBox="0 0 48 48" version="1.1" xmlns="http://www.w3.org/2000/svg" xmlns:xlink="http://www.w3.org/1999/xlink">
    <!-- Generator: Sketch 58 (84663) - https://sketch.com -->
    <title>Shape</title>
    <desc>Created with Sketch.</desc>
    <g id="Page-1" stroke="none" stroke-width="1" fill="none" fill-rule="evenodd">
        <g id="Hifi)-The-Forms-page" transform="translate(-439.000000, -371.000000)" fill="#191b1e" fill-rule="nonzero">
            <g id="Group-2" transform="translate(326.000000, 333.000000)">
                <g id="Group-9" transform="translate(30.000000, 38.000000)">
                    <path d="M95.6315789,48 C95.6315789,42.4191158 100.155857,37.8947368 105.736842,37.8947368 L105.736842,35.3684211 C99.6258105,35.3684211 94.5283116,31.0287158 93.3579453,25.2631579 L90.5789474,25.2631579 C86.3932211,25.2631579 83,21.8698105 83,17.6842105 L83,5.05258105 L88.0526316,5.05260632 C89.9937516,5.05260632 91.7644211,5.78233263 93.1052884,6.98245895 L93.1052632,0 L120.894737,0 L120.894737,6.98245895 C122.235705,5.78235789 124.006147,5.05260632 125.947368,5.05260632 L131,5.05260632 L131,17.6842105 C131,21.8700632 127.606905,25.2631579 123.421053,25.2631579 L120.642105,25.2631579 C119.471663,31.0287158 114.374316,35.3684211 108.263158,35.3684211 L108.263158,37.8947368 C113.844042,37.8947368 118.368421,42.4191158 118.368421,48 L95.6315789,48 Z M108.263158,40.4210526 L105.736842,40.4210526 C102.436918,40.4210526 99.6295747,42.5300211 98.5891368,45.4736842 L115.410863,45.4736842 C114.370274,42.5300211 111.563032,40.4210526 108.263158,40.4210526 Z M118.368421,2.52634105 L95.6315789,2.52634105 L95.6315789,22.7368421 C95.6315789,28.3177263 100.155857,32.8421053 105.736842,32.8421053 L108.263158,32.8421053 C113.844042,32.8421053 118.368421,28.3177263 118.368421,22.7368421 L118.368421,2.52634105 Z M128.473684,17.6842105 L128.473684,7.57897263 L125.947368,7.57897263 C123.1568,7.57897263 120.894737,9.84108632 120.894737,12.6315789 L120.894737,22.7368421 L123.421053,22.7368421 C126.211621,22.7368421 128.473684,20.4747789 128.473684,17.6842105 Z M85.5263411,17.6842105 C85.5263411,20.4747789 87.78848,22.7368421 90.5789726,22.7368421 L93.1053137,22.7368421 L93.1053137,12.6315789 C93.1053137,9.84108632 90.8431747,7.57897263 88.0526821,7.57897263 L85.5263411,7.57897263 L85.5263411,17.6842105 Z" id="Shape"></path>
                </g>
            </g>
        </g>
    </g>
</svg>
