{	
"Carvão Vapor 3100 kcal / kg" : {
	"unit" : "Toneladas",
	"co2Factor" : 1168.4102760000,
	"ch4Factor" : 0.1235106000,
	"n2oFactor" : 0.0185265900
	},
"Carvão Vapor 3300 kcal / kg" : {
	"unit" : "Toneladas",
	"co2Factor" : 1227.8209680000,
	"ch4Factor" : 0.1297908000,
	"n2oFactor" : 0.0194686200
	},
"Carvão Vapor 3700 kcal / kg" : {
	"unit" : "Toneladas",
	"co2Factor" : 1386.2494800000,
	"ch4Factor" : 0.1465380000,
	"n2oFactor" : 0.0219807000
	},
"Carvão Vapor 4200 kcal / kg" : {
	"unit" : "Toneladas",
	"co2Factor" : 1584.2851200000,
	"ch4Factor" : 0.1674720000,
	"n2oFactor" : 0.0251208000
	},
"Carvão Vapor 4500 kcal / kg" : {
	"unit" : "Toneladas",
	"co2Factor" : 1683.3029400000,
	"ch4Factor" : 0.1779390000,
	"n2oFactor" : 0.0266908500
	},
"Carvão Vapor 4700 kcal / kg" : {
	"unit" : "Toneladas",
	"co2Factor" : 1762.5171960000,
	"ch4Factor" : 0.1863126000,
	"n2oFactor" : 0.0279468900
	},
"Carvão Vapor 5200 kcal / kg" : {
	"unit" : "Toneladas",
	"co2Factor" : 1940.7492720000,
	"ch4Factor" : 0.2051532000,
	"n2oFactor" : 0.0307729800
	},
"Carvão Vapor 5900 kcal / kg" : {
	"unit" : "Toneladas",
	"co2Factor" : 2217.9991680000,
	"ch4Factor" : 0.2344608000,
	"n2oFactor" : 0.0351691200
	},
"Carvão Vapor 6000 kcal / kg" : {
	"unit" : "Toneladas",
	"co2Factor" : 2257.6062960000,
	"ch4Factor" : 0.2386476000,
	"n2oFactor" : 0.0357971400
	},
"Carvão Vapor sem Especificação" : {
	"unit" : "Toneladas",
	"co2Factor" : 1128.8031480000,
	"ch4Factor" : 0.1193238000,
	"n2oFactor" : 0.0178985700
	},
"Coque de Carvão Mineral" : {
	"unit" : "Toneladas",
	"co2Factor" : 3091.1144400000,
	"ch4Factor" : 0.2888892000,
	"n2oFactor" : 0.0433333800
	}
}
