{
    "Algodão" : {
        "unit" : "kg GEE/kg produzido",
        "co2Factor" : 0,
        "ch4Factor" : 0.00513,
        "n2oFactor" : 0.000355509
    },
    "Arroz" : {
        "unit" : "kg GEE/kg produzido",
        "co2Factor" : 0,
        "ch4Factor" : 0.00232064,
        "n2oFactor" : 0.000053606784
    },
    "Cana-de-açúcar" : {
        "unit" : "kg GEE/kg produzido",
        "co2Factor" : 0,
        "ch4Factor" : 0.000377922306666667,
        "n2oFactor" : 0.0000186425657631827
    },
    "Feijão" : {
        "unit" : "kg GEE/kg produzido",
        "co2Factor" : 0,
        "ch4Factor" : 0.00349653333333333,
        "n2oFactor" : 0.000288464
    },
    "Milho" : {
        "unit" : "kg GEE/kg produzido",
        "co2Factor" : 0,
        "ch4Factor" : 0.00374208533333333,
        "n2oFactor" : 0.000123488816
    },
    "Soja" : {
        "unit" : "kg GEE/kg produzido",
        "co2Factor" : 0,
        "ch4Factor" : 0.0046464,
        "n2oFactor" : 0.000383328
    },
    "Trigo" : {
        "unit" : "kg GEE/kg produzido",
        "co2Factor" : 0,
        "ch4Factor" : 0,
        "n2oFactor" : 0.0000548856
    }
}