NOTA TÉCNICA Valores de referência para o potencial de aquecimento global (GWP) dos gases de efeito estufa – versão 2.0
https://bibliotecadigital.fgv.br/dspace/handle/10438/31764

Dióxido de carbono (CO2)	-	1,000000
Metano (CH4)	-	28,000000
Óxido nitroso (N2O)	-	265,000000
HFC-23	HFC	12400,000000
HFC-32		677,000000
HFC-41		116,000000
HFC-125		3170,000000
HFC-134		1120,000000
HFC-134a		1300,000000
HFC-143		328,000000
HFC-143a		4800,000000
HFC-152		16,000000
HFC-152a		138,000000
HFC-161		4,000000
HFC-227ea		3350,000000
HFC-236cb		1210,000000
HFC-236ea		1330,000000
HFC-236fa		8060,000000
HFC-245ca		716,000000
HFC-245fa		858,000000
HFC-365mfc		804,000000
HFC-43-10mee		1650,000000
Hexafluoreto de enxofre (SF6)	-	23500,000000
Trifluoreto de nitrogênio (NF3)	-	16100,000000
PFC-14	PFC	6630,000000
PFC-116		11100,000000
PFC-218		8900,000000
PFC-318		9540,000000
PFC-3-1-10		9200,000000
PFC-4-1-12		8550,000000
PFC-5-1-14		7910,000000
PFC-9-1-18		7190,000000
Trifluorometil pentafluoreto de enxofre (SF5CF3)		17400,000000
Perfluorociclopropano (c-C3F6)		9200,000000
R-400	Composto	0,000000
R-401A		17,940000
R-401B		15,180000
R-401C		20,700000
R-402A		1902,000000
R-402B		1204,600000
R-403A		1780,000000
R-403B		3471,000000
R-404A		3942,800000
R-405A		4064,160000
R-406A		0,000000
R-407A		1923,400000
R-407B		2546,700000
R-407C		1624,210000
R-407D		1487,050000
R-407E		1424,750000
R-407F		1674,100000
R-407G		1331,175000
R-407H		1378,025000
R-407I		1337,465000
R-408A		2429,900000
R-409A		0,000000
R-409B		0,000000
R-410A		1923,500000
R-410B		2048,150000
R-411A		15,180000
R-411B		4,140000
R-412A		445,000000
R-413A		1945,000000
R-414A		0,000000
R-414B		0,000000
R-415A		24,840000
R-415B		103,500000
R-416A		767,000000
R-417A		2127,220000
R-417B		2742,200000
R-417C		1642,550000
R-418A		3,450000
R-419A		2687,900000
R-419B		2161,450000
R-420A		1144,000000
R-421A		2384,600000
R-421B		2889,500000
R-422A		2847,170000
R-422B		2289,500000
R-422C		2794,400000
R-422D		2470,000000
R-422E		2349,500000
R-423A		2273,750000
R-424A		2211,850000
R-425A		1430,745000
R-426A		1370,670000
R-427A		2024,050000
R-428A		3416,750000
R-429A		13,800000
R-430A		104,880000
R-431A		40,020000
R-432A		0,000000
R-433A		0,000000
R-433B		0,000000
R-433C		0,000000
R-434A		3075,440000
R-435A		27,600000
R-436A		0,000000
R-436B		0,000000
R-436C		0,000000
R-437A		1638,650000
R-438A		2058,645000
R-439A		1828,400000
R-440A		155,764000
R-441A		0,000000
R-442A		1754,210000
R-443A		0,000000
R-444A		88,140000
R-444B		294,755000
R-445A		117,000000
R-446A		460,360000
R-447A		571,310000
R-447B		713,960000
R-448A		1273,220000
R-449A		1281,601000
R-449B		1295,814000
R-449C		1146,400000
R-450A		546,000000
R-451A		132,600000
R-451B		145,600000
R-452A		1944,770000
R-452B		675,490000
R-452C		2018,325000
R-453A		1636,300000
R-454A		236,950000
R-454B		466,453000
R-454C		145,555000
R-455A		145,555000
R-456A		625,620000
R-457A		138,420000
R-458A		1564,395000
R-459A		460,360000
R-459B		142,170000
R-460A		1911,640000
R-460B		1242,060000
R-460C		694,175000
R-461A		2567,000000
R-462A		2060,330000
R-463A		1376,720000
R-464A		1239,690000
R-465A		142,170000
R-500		36,156000
R-501		0,000000
R-502		0,000000
R-503		4972,400000
R-504		326,314000
R-505		0,000000
R-506		0,000000
R-507 ou R-507A		3985,000000
R-508A		11607,000000
R-508B		11698,000000
R-509 ou R-509A		4984,000000
R-510A		0,000000
R-511A		0,000000
R-512A		196,100000
R-513A		572,000000
R-513B		539,500000
R-514A		0,000000
R-515A		402,000000
R-516A		129,820000