{
    "Volatilização" : {
        "unit" : "%",
        "percentage" : 10
    },
    "Resíduo" : {
        "unit" : "%",
        "percentage" : 20
    },
    "Lixiviação/escoamento superficial" : {
        "unit" : "%",
        "percentage" : 30
    }
}