{	
    "Calcário Calcítico" : {
        "unit" : "kg CO2/kg aplicado",
        "co2Factor" : 0.44,
        "ch4Factor" : 0,
        "n2oFactor" : 0,
        "nitrogenPercentage": 0
    },
    "Calcário Dolomítico" : {
        "unit" : "kg CO2/kg aplicado",
        "co2Factor" : 0.476666666666667,
        "ch4Factor" : 0,
        "n2oFactor" : 0,
        "nitrogenPercentage": 0
    },
    "Ureia" : {
        "unit" : "kg GEE/kg de produto/nitrogênio aplicado",
        "co2Factor" : 0.733,
        "ch4Factor" : 0,
        "n2oFactor" : 0.0088,
        "nitrogenPercentage": 45
    },
    "Fertilizante sintético" : {
        "unit" : "kg N2O/kg de nitrogênio aplicado",
        "co2Factor" : 0,
        "ch4Factor" : 0,
        "n2oFactor" : 0.0113,
        "nitrogenPercentage": 100
    },
    "Composto orgânico" : {
        "unit" : "kg N2O/kg de nitrogênio aplicado",
        "co2Factor" : 0,
        "ch4Factor" : 0,
        "n2oFactor" : 0.000176,
        "nitrogenPercentage": 1.4
    },
    "Adubo orgânico geral" : {
        "unit" : "kg N2O/kg de nitrogênio aplicado",
        "co2Factor" : 0,
        "ch4Factor" : 0,
        "n2oFactor" : 0.000226285714285714,
        "nitrogenPercentage": 1.8
    },
    "Torta de filtro" : {
        "unit" : "kg N2O/hectare.ano",
        "co2Factor" : 0,
        "ch4Factor" : 0,
        "n2oFactor" : 2.357,
        "nitrogenPercentage": 1.4
    },
    "Vinhaça" : {
        "unit" : "kg N2O/litro aplicado",
        "co2Factor" : 0,
        "ch4Factor" : 0,
        "n2oFactor" : 0.0000108834,
        "nitrogenPercentage": 0.0313
    },
    "Esterco Bovino, equino, suino, ovino" : {
        "unit" : "kg N2O/kg de nitrogênio aplicado",
        "co2Factor" : 0,
        "ch4Factor" : 0,
        "n2oFactor" : 0.000201142857142857,
        "nitrogenPercentage": 1.6
    },
    "Esterco Avícola" : {
        "unit" : "kg N2O/kg de nitrogênio aplicado",
        "co2Factor" : 0,
        "ch4Factor" : 0,    
        "n2oFactor" : 0.000377142857142857,
        "nitrogenPercentage": 3
    }
}