Gasolina Automotiva (pura)	litros	 10.400 	0,742	BEN 2022	2,2120000000	0,0008077175	0,0002584696
Óleo Diesel (puro)	litros	 10.100 	0,840	BEN 2022	2,6030000000	0,0001385312	0,0001385312
Gás Natural Veicular (GNV)	m³	 8.800 	-	BEN 2022	1,9990000000	0,0033896333	0,0001105315
Gás Liquefeito de Petróleo (GLP)	kg	 11.100 	-	BEN 2022	2,9324765880	0,0028813558	0,0000092947
Querosene de Aviação	litros	 10.400 	0,799	BEN 2022	2,5168500000	0,0000176180	0,0000704718
Gasolina de Aviação	litros	 10.600 	0,726	BEN 2022	2,2506000000	0,0000160809	0,0000643236
Lubrificantes	litros	 10.120 	0,875	BEN 2022	2,7175325562	0,0001385312	0,0001385312
Óleo Combustível	litros	 9.590 	1,000	BEN 2022	3,1063809084	0,0004015141	0,0000240908