{	
"Acetileno" : {
	"unit" : "kg",
	"co2Factor" : 0,
	"ch4Factor" : {
		"Energia" : 0 ,
		"Manufatura ou Construção" : 0 ,
		"Comercial ou Institucional" : 0 ,
		"Residencial, Agricultura, Florestal ou Pesca" : 0 
	},
	"n2oFactor" : {
		"Energia" : 0 ,
		"Manufatura ou Construção" : 0 ,
		"Comercial ou Institucional" : 0 ,
		"Residencial, Agricultura, Florestal ou Pesca" : 0 
	}
	},
"Alcatrão" : {
	"unit" : "m3",
	"co2Factor" : 2887.635960,
	"ch4Factor" : {
		"Energia" : 0.035797 ,
		"Manufatura ou Construção" : 0.357971 ,
		"Comercial ou Institucional" : 0.357971 ,
		"Residencial, Agricultura, Florestal ou Pesca" : 10.739142 
	},
	"n2oFactor" : {
		"Energia" : 0.053696 ,
		"Manufatura ou Construção" : 0.053696 ,
		"Comercial ou Institucional" : 0.053696 ,
		"Residencial, Agricultura, Florestal ou Pesca" : 0.053696 
	}
	},
"Asfaltos" : {
	"unit" : "m3",
	"co2Factor" : 3389.088298,
	"ch4Factor" : {
		"Energia" : 0.126040 ,
		"Manufatura ou Construção" : 0.126040 ,
		"Comercial ou Institucional" : 0.420135 ,
		"Residencial, Agricultura, Florestal ou Pesca" : 0.420135 
	},
	"n2oFactor" : {
		"Energia" : 0.025208 ,
		"Manufatura ou Construção" : 0.025208 ,
		"Comercial ou Institucional" : 0.025208 ,
		"Residencial, Agricultura, Florestal ou Pesca" : 0.025208 
	}
	},
"Carvão Metalúrgico Importado" : {
	"unit" : "Toneladas",
	"co2Factor" : 2930.927472,
	"ch4Factor" : {
		"Energia" : 0.030982 ,
		"Manufatura ou Construção" : 0.309823 ,
		"Comercial ou Institucional" : 0.309823 ,
		"Residencial, Agricultura, Florestal ou Pesca" : 9.294696 
	},
	"n2oFactor" : {
		"Energia" : 0.046473 ,
		"Manufatura ou Construção" : 0.046473 ,
		"Comercial ou Institucional" : 0.046473 ,
		"Residencial, Agricultura, Florestal ou Pesca" : 0.046473 
	}
	},
"Carvão Metalúrgico Nacional" : {
	"unit" : "Toneladas",
	"co2Factor" : 2542.777618,
	"ch4Factor" : {
		"Energia" : 0.026879 ,
		"Manufatura ou Construção" : 0.268793 ,
		"Comercial ou Institucional" : 0.268793 ,
		"Residencial, Agricultura, Florestal ou Pesca" : 8.063777 
	},
	"n2oFactor" : {
		"Energia" : 0.040319 ,
		"Manufatura ou Construção" : 0.040319 ,
		"Comercial ou Institucional" : 0.040319 ,
		"Residencial, Agricultura, Florestal ou Pesca" : 0.040319 
	}
	},
"Carvão Vapor 3100 kcal / kg" : {
	"unit" : "Toneladas",
	"co2Factor" : 1249.927272,
	"ch4Factor" : {
		"Energia" : 0.012351 ,
		"Manufatura ou Construção" : 0.123511 ,
		"Comercial ou Institucional" : 0.123511 ,
		"Residencial, Agricultura, Florestal ou Pesca" : 3.705318 
	},
	"n2oFactor" : {
		"Energia" : 0.018527 ,
		"Manufatura ou Construção" : 0.018527 ,
		"Comercial ou Institucional" : 0.018527 ,
		"Residencial, Agricultura, Florestal ou Pesca" : 0.018527 
	}
	},
"Carvão Vapor 3300 kcal / kg" : {
	"unit" : "Toneladas",
	"co2Factor" : 1313.482896,
	"ch4Factor" : {
		"Energia" : 0.012979 ,
		"Manufatura ou Construção" : 0.129791 ,
		"Comercial ou Institucional" : 0.129791 ,
		"Residencial, Agricultura, Florestal ou Pesca" : 3.893724 
	},
	"n2oFactor" : {
		"Energia" : 0.019469 ,
		"Manufatura ou Construção" : 0.019469 ,
		"Comercial ou Institucional" : 0.019469 ,
		"Residencial, Agricultura, Florestal ou Pesca" : 0.019469 
	}
	},
"Carvão Vapor 3700 kcal / kg" : {
	"unit" : "Toneladas",
	"co2Factor" : 1482.964560,
	"ch4Factor" : {
		"Energia" : 0.014654 ,
		"Manufatura ou Construção" : 0.146538 ,
		"Comercial ou Institucional" : 0.146538 ,
		"Residencial, Agricultura, Florestal ou Pesca" : 4.396140 
	},
	"n2oFactor" : {
		"Energia" : 0.021981 ,
		"Manufatura ou Construção" : 0.021981 ,
		"Comercial ou Institucional" : 0.021981 ,
		"Residencial, Agricultura, Florestal ou Pesca" : 0.021981 
	}
	},
"Carvão Vapor 4200 kcal / kg" : {
	"unit" : "Toneladas",
	"co2Factor" : 1608.847680,
	"ch4Factor" : {
		"Energia" : 0.016747 ,
		"Manufatura ou Construção" : 0.167472 ,
		"Comercial ou Institucional" : 0.167472 ,
		"Residencial, Agricultura, Florestal ou Pesca" : 5.024160 
	},
	"n2oFactor" : {
		"Energia" : 0.025121 ,
		"Manufatura ou Construção" : 0.025121 ,
		"Comercial ou Institucional" : 0.025121 ,
		"Residencial, Agricultura, Florestal ou Pesca" : 0.025121 
	}
	},
"Carvão Vapor 4500 kcal / kg" : {
	"unit" : "Toneladas",
	"co2Factor" : 1709.400660,
	"ch4Factor" : {
		"Energia" : 0.017794 ,
		"Manufatura ou Construção" : 0.177939 ,
		"Comercial ou Institucional" : 0.177939 ,
		"Residencial, Agricultura, Florestal ou Pesca" : 5.338170 
	},
	"n2oFactor" : {
		"Energia" : 0.026691 ,
		"Manufatura ou Construção" : 0.026691 ,
		"Comercial ou Institucional" : 0.026691 ,
		"Residencial, Agricultura, Florestal ou Pesca" : 0.026691 
	}
	},
"Carvão Vapor 4700 kcal / kg" : {
	"unit" : "Toneladas",
	"co2Factor" : 1762.517196,
	"ch4Factor" : {
		"Energia" : 0.018631 ,
		"Manufatura ou Construção" : 0.186313 ,
		"Comercial ou Institucional" : 0.186313 ,
		"Residencial, Agricultura, Florestal ou Pesca" : 5.589378 
	},
	"n2oFactor" : {
		"Energia" : 0.027947 ,
		"Manufatura ou Construção" : 0.027947 ,
		"Comercial ou Institucional" : 0.027947 ,
		"Residencial, Agricultura, Florestal ou Pesca" : 0.027947 
	}
	},
"Carvão Vapor 5200 kcal / kg" : {
	"unit" : "Toneladas",
	"co2Factor" : 1970.838408,
	"ch4Factor" : {
		"Energia" : 0.020515 ,
		"Manufatura ou Construção" : 0.205153 ,
		"Comercial ou Institucional" : 0.205153 ,
		"Residencial, Agricultura, Florestal ou Pesca" : 6.154596 
	},
	"n2oFactor" : {
		"Energia" : 0.030773 ,
		"Manufatura ou Construção" : 0.030773 ,
		"Comercial ou Institucional" : 0.030773 ,
		"Residencial, Agricultura, Florestal ou Pesca" : 0.030773 
	}
	},
"Carvão Vapor 5900 kcal / kg" : {
	"unit" : "Toneladas",
	"co2Factor" : 2217.999168,
	"ch4Factor" : {
		"Energia" : 0.023446 ,
		"Manufatura ou Construção" : 0.234461 ,
		"Comercial ou Institucional" : 0.234461 ,
		"Residencial, Agricultura, Florestal ou Pesca" : 7.033824 
	},
	"n2oFactor" : {
		"Energia" : 0.035169 ,
		"Manufatura ou Construção" : 0.035169 ,
		"Comercial ou Institucional" : 0.035169 ,
		"Residencial, Agricultura, Florestal ou Pesca" : 0.035169 
	}
	},
"Carvão Vapor 6000 kcal / kg" : {
	"unit" : "Toneladas",
	"co2Factor" : 2257.606296,
	"ch4Factor" : {
		"Energia" : 0.023865 ,
		"Manufatura ou Construção" : 0.238648 ,
		"Comercial ou Institucional" : 0.238648 ,
		"Residencial, Agricultura, Florestal ou Pesca" : 7.159428 
	},
	"n2oFactor" : {
		"Energia" : 0.035797 ,
		"Manufatura ou Construção" : 0.035797 ,
		"Comercial ou Institucional" : 0.035797 ,
		"Residencial, Agricultura, Florestal ou Pesca" : 0.035797 
	}
	},
"Carvão Vapor sem Especificação" : {
	"unit" : "Toneladas",
	"co2Factor" : 1207.556856,
	"ch4Factor" : {
		"Energia" : 0.011932 ,
		"Manufatura ou Construção" : 0.119324 ,
		"Comercial ou Institucional" : 0.119324 ,
		"Residencial, Agricultura, Florestal ou Pesca" : 3.579714 
	},
	"n2oFactor" : {
		"Energia" : 0.017899 ,
		"Manufatura ou Construção" : 0.017899 ,
		"Comercial ou Institucional" : 0.017899 ,
		"Residencial, Agricultura, Florestal ou Pesca" : 0.017899 
	}
	},
"Coque de Carvão Mineral" : {
	"unit" : "Toneladas",
	"co2Factor" : 3093.040368,
	"ch4Factor" : {
		"Energia" : 0.028889 ,
		"Manufatura ou Construção" : 0.288889 ,
		"Comercial ou Institucional" : 0.288889 ,
		"Residencial, Agricultura, Florestal ou Pesca" : 8.666676 
	},
	"n2oFactor" : {
		"Energia" : 0.043333 ,
		"Manufatura ou Construção" : 0.043333 ,
		"Comercial ou Institucional" : 0.043333 ,
		"Residencial, Agricultura, Florestal ou Pesca" : 0.043333 
	}
	},
"Coque de Petróleo" : {
	"unit" : "m3",
	"co2Factor" : 3563.121098,
	"ch4Factor" : {
		"Energia" : 0.109597 ,
		"Manufatura ou Construção" : 0.109597 ,
		"Comercial ou Institucional" : 0.365323 ,
		"Residencial, Agricultura, Florestal ou Pesca" : 0.365323 
	},
	"n2oFactor" : {
		"Energia" : 0.021919 ,
		"Manufatura ou Construção" : 0.021919 ,
		"Comercial ou Institucional" : 0.021919 ,
		"Residencial, Agricultura, Florestal ou Pesca" : 0.021919 
	}
	},
"Etano" : {
	"unit" : "Toneladas",
	"co2Factor" : 2858.240000,
	"ch4Factor" : {
		"Energia" : 0.046400 ,
		"Manufatura ou Construção" : 0.046400 ,
		"Comercial ou Institucional" : 0.232000 ,
		"Residencial, Agricultura, Florestal ou Pesca" : 0.232000 
	},
	"n2oFactor" : {
		"Energia" : 0.004640 ,
		"Manufatura ou Construção" : 0.004640 ,
		"Comercial ou Institucional" : 0.004640 ,
		"Residencial, Agricultura, Florestal ou Pesca" : 0.004640 
	}
	},
"Gás de Coqueria" : {
	"unit" : "Toneladas",
	"co2Factor" : 1716.990000,
	"ch4Factor" : {
		"Energia" : 0.038700 ,
		"Manufatura ou Construção" : 0.038700 ,
		"Comercial ou Institucional" : 0.193500 ,
		"Residencial, Agricultura, Florestal ou Pesca" : 0.193500 
	},
	"n2oFactor" : {
		"Energia" : 0.003870 ,
		"Manufatura ou Construção" : 0.003870 ,
		"Comercial ou Institucional" : 0.003870 ,
		"Residencial, Agricultura, Florestal ou Pesca" : 0.003870 
	}
	},
"Gás de Refinaria" : {
	"unit" : "Toneladas",
	"co2Factor" : 2849.550000,
	"ch4Factor" : {
		"Energia" : 0.049500 ,
		"Manufatura ou Construção" : 0.049500 ,
		"Comercial ou Institucional" : 0.247500 ,
		"Residencial, Agricultura, Florestal ou Pesca" : 0.247500 
	},
	"n2oFactor" : {
		"Energia" : 0.004950 ,
		"Manufatura ou Construção" : 0.004950 ,
		"Comercial ou Institucional" : 0.004950 ,
		"Residencial, Agricultura, Florestal ou Pesca" : 0.004950 
	}
	},
"Gás Liquefeito de Petróleo (GLP)" : {
	"unit" : "Toneladas",
	"co2Factor" : 2930.927472,
	"ch4Factor" : {
		"Energia" : 0.046473 ,
		"Manufatura ou Construção" : 0.046473 ,
		"Comercial ou Institucional" : 0.232367 ,
		"Residencial, Agricultura, Florestal ou Pesca" : 0.232367 
	},
	"n2oFactor" : {
		"Energia" : 0.004647 ,
		"Manufatura ou Construção" : 0.004647 ,
		"Comercial ou Institucional" : 0.004647 ,
		"Residencial, Agricultura, Florestal ou Pesca" : 0.004647 
	}
	},
"Gás Natural Seco" : {
	"unit" : "m3",
	"co2Factor" : 2.066939,
	"ch4Factor" : {
		"Energia" : 0.000037 ,
		"Manufatura ou Construção" : 0.000037 ,
		"Comercial ou Institucional" : 0.000184 ,
		"Residencial, Agricultura, Florestal ou Pesca" : 0.000184 
	},
	"n2oFactor" : {
		"Energia" : 0.000004 ,
		"Manufatura ou Construção" : 0.000004 ,
		"Comercial ou Institucional" : 0.000004 ,
		"Residencial, Agricultura, Florestal ou Pesca" : 0.000004 
	}
	},
"Gás Natural Úmido" : {
	"unit" : "m3",
	"co2Factor" : 2.332353,
	"ch4Factor" : {
		"Energia" : 0.000042 ,
		"Manufatura ou Construção" : 0.000042 ,
		"Comercial ou Institucional" : 0.000208 ,
		"Residencial, Agricultura, Florestal ou Pesca" : 0.000208 
	},
	"n2oFactor" : {
		"Energia" : 0.000004 ,
		"Manufatura ou Construção" : 0.000004 ,
		"Comercial ou Institucional" : 0.000004 ,
		"Residencial, Agricultura, Florestal ou Pesca" : 0.000004 
	}
	},
"Gasolina Automotiva (pura)" : {
	"unit" : "Litros",
	"co2Factor" : 2.238993,
	"ch4Factor" : {
		"Energia" : 0.000097 ,
		"Manufatura ou Construção" : 0.000097 ,
		"Comercial ou Institucional" : 0.000323 ,
		"Residencial, Agricultura, Florestal ou Pesca" : 0.000323 
	},
	"n2oFactor" : {
		"Energia" : 0.000019 ,
		"Manufatura ou Construção" : 0.000019 ,
		"Comercial ou Institucional" : 0.000019 ,
		"Residencial, Agricultura, Florestal ou Pesca" : 0.000019 
	}
	},
"Gasolina de Aviação" : {
	"unit" : "Litros",
	"co2Factor" : 2.256470,
	"ch4Factor" : {
		"Energia" : 0.000097 ,
		"Manufatura ou Construção" : 0.000097 ,
		"Comercial ou Institucional" : 0.000322 ,
		"Residencial, Agricultura, Florestal ou Pesca" : 0.000322 
	},
	"n2oFactor" : {
		"Energia" : 0.000019 ,
		"Manufatura ou Construção" : 0.000019 ,
		"Comercial ou Institucional" : 0.000019 ,
		"Residencial, Agricultura, Florestal ou Pesca" : 0.000019 
	}
	},
"Líquidos de Gás Natural (LGN)" : {
	"unit" : "Toneladas",
	"co2Factor" : 2836.166667,
	"ch4Factor" : {
		"Energia" : 0.132600 ,
		"Manufatura ou Construção" : 0.132600 ,
		"Comercial ou Institucional" : 0.442000 ,
		"Residencial, Agricultura, Florestal ou Pesca" : 0.442000 
	},
	"n2oFactor" : {
		"Energia" : 0.026520 ,
		"Manufatura ou Construção" : 0.026520 ,
		"Comercial ou Institucional" : 0.026520 ,
		"Residencial, Agricultura, Florestal ou Pesca" : 0.026520 
	}
	},
"Lubrificantes" : {
	"unit" : "Litros",
	"co2Factor" : 2.718768,
	"ch4Factor" : {
		"Energia" : 0.000111 ,
		"Manufatura ou Construção" : 0.000111 ,
		"Comercial ou Institucional" : 0.000371 ,
		"Residencial, Agricultura, Florestal ou Pesca" : 0.000371 
	},
	"n2oFactor" : {
		"Energia" : 0.000022 ,
		"Manufatura ou Construção" : 0.000022 ,
		"Comercial ou Institucional" : 0.000022 ,
		"Residencial, Agricultura, Florestal ou Pesca" : 0.000022 
	}
	},
"Nafta" : {
	"unit" : "m3",
	"co2Factor" : 2291.152612,
	"ch4Factor" : {
		"Energia" : 0.093729 ,
		"Manufatura ou Construção" : 0.093729 ,
		"Comercial ou Institucional" : 0.312430 ,
		"Residencial, Agricultura, Florestal ou Pesca" : 0.312430 
	},
	"n2oFactor" : {
		"Energia" : 0.018746 ,
		"Manufatura ou Construção" : 0.018746 ,
		"Comercial ou Institucional" : 0.018746 ,
		"Residencial, Agricultura, Florestal ou Pesca" : 0.018746 
	}
	},
"Óleo Combustível" : {
	"unit" : "Litros",
	"co2Factor" : 3.106381,
	"ch4Factor" : {
		"Energia" : 0.000120 ,
		"Manufatura ou Construção" : 0.000120 ,
		"Comercial ou Institucional" : 0.000402 ,
		"Residencial, Agricultura, Florestal ou Pesca" : 0.000402 
	},
	"n2oFactor" : {
		"Energia" : 0.000024 ,
		"Manufatura ou Construção" : 0.000024 ,
		"Comercial ou Institucional" : 0.000024 ,
		"Residencial, Agricultura, Florestal ou Pesca" : 0.000024 
	}
	},
"Óleo de Xisto" : {
	"unit" : "Toneladas",
	"co2Factor" : 2792.730000,
	"ch4Factor" : {
		"Energia" : 0.114300 ,
		"Manufatura ou Construção" : 0.114300 ,
		"Comercial ou Institucional" : 0.381000 ,
		"Residencial, Agricultura, Florestal ou Pesca" : 0.381000 
	},
	"n2oFactor" : {
		"Energia" : 0.022860 ,
		"Manufatura ou Construção" : 0.022860 ,
		"Comercial ou Institucional" : 0.022860 ,
		"Residencial, Agricultura, Florestal ou Pesca" : 0.022860 
	}
	},
"Óleo Diesel (puro)" : {
	"unit" : "Litros",
	"co2Factor" : 2.630908,
	"ch4Factor" : {
		"Energia" : 0.000107 ,
		"Manufatura ou Construção" : 0.000107 ,
		"Comercial ou Institucional" : 0.000355 ,
		"Residencial, Agricultura, Florestal ou Pesca" : 0.000355 
	},
	"n2oFactor" : {
		"Energia" : 0.000021 ,
		"Manufatura ou Construção" : 0.000021 ,
		"Comercial ou Institucional" : 0.000021 ,
		"Residencial, Agricultura, Florestal ou Pesca" : 0.000021 
	}
	},
"Óleos Residuais" : {
	"unit" : "Toneladas",
	"co2Factor" : 2946.660000,
	"ch4Factor" : {
		"Energia" : 1.206000 ,
		"Manufatura ou Construção" : 1.206000 ,
		"Comercial ou Institucional" : 12.060000 ,
		"Residencial, Agricultura, Florestal ou Pesca" : 12.060000 
	},
	"n2oFactor" : {
		"Energia" : 0.160800 ,
		"Manufatura ou Construção" : 0.160800 ,
		"Comercial ou Institucional" : 0.160800 ,
		"Residencial, Agricultura, Florestal ou Pesca" : 0.160800 
	}
	},
"Outros Produtos de Petróleo" : {
	"unit" : "Toneladas",
	"co2Factor" : 3131.726400,
	"ch4Factor" : {
		"Energia" : 0.128116 ,
		"Manufatura ou Construção" : 0.128116 ,
		"Comercial ou Institucional" : 0.427054 ,
		"Residencial, Agricultura, Florestal ou Pesca" : 0.427054 
	},
	"n2oFactor" : {
		"Energia" : 0.025623 ,
		"Manufatura ou Construção" : 0.025623 ,
		"Comercial ou Institucional" : 0.025623 ,
		"Residencial, Agricultura, Florestal ou Pesca" : 0.025623 
	}
	},
"Parafina" : {
	"unit" : "Toneladas",
	"co2Factor" : 2946.660000,
	"ch4Factor" : {
		"Energia" : 0.120600 ,
		"Manufatura ou Construção" : 0.120600 ,
		"Comercial ou Institucional" : 0.402000 ,
		"Residencial, Agricultura, Florestal ou Pesca" : 0.402000 
	},
	"n2oFactor" : {
		"Energia" : 0.024120 ,
		"Manufatura ou Construção" : 0.024120 ,
		"Comercial ou Institucional" : 0.024120 ,
		"Residencial, Agricultura, Florestal ou Pesca" : 0.024120 
	}
	},
"Petróleo Bruto" : {
	"unit" : "m3",
	"co2Factor" : 2931.295910,
	"ch4Factor" : {
		"Energia" : 0.119917 ,
		"Manufatura ou Construção" : 0.119917 ,
		"Comercial ou Institucional" : 0.399722 ,
		"Residencial, Agricultura, Florestal ou Pesca" : 0.399722 
	},
	"n2oFactor" : {
		"Energia" : 0.023983 ,
		"Manufatura ou Construção" : 0.023983 ,
		"Comercial ou Institucional" : 0.023983 ,
		"Residencial, Agricultura, Florestal ou Pesca" : 0.023983 
	}
	},
"Querosene de Aviação" : {
	"unit" : "Toneladas",
	"co2Factor" : 3113.304480,
	"ch4Factor" : {
		"Energia" : 0.130628 ,
		"Manufatura ou Construção" : 0.130628 ,
		"Comercial ou Institucional" : 0.435427 ,
		"Residencial, Agricultura, Florestal ou Pesca" : 0.435427 
	},
	"n2oFactor" : {
		"Energia" : 0.026126 ,
		"Manufatura ou Construção" : 0.026126 ,
		"Comercial ou Institucional" : 0.026126 ,
		"Residencial, Agricultura, Florestal ou Pesca" : 0.026126 
	}
	},
"Querosene Iluminante" : {
	"unit" : "Toneladas",
	"co2Factor" : 3129.270144,
	"ch4Factor" : {
		"Energia" : 0.130628 ,
		"Manufatura ou Construção" : 0.130628 ,
		"Comercial ou Institucional" : 0.435427 ,
		"Residencial, Agricultura, Florestal ou Pesca" : 0.435427 
	},
	"n2oFactor" : {
		"Energia" : 0.026126 ,
		"Manufatura ou Construção" : 0.026126 ,
		"Comercial ou Institucional" : 0.026126 ,
		"Residencial, Agricultura, Florestal ou Pesca" : 0.026126 
	}
	},
"Resíduos Industriais" : {
	"unit" : "TJ",
	"co2Factor" : 143000.000000,
	"ch4Factor" : {
		"Energia" : 30.000000 ,
		"Manufatura ou Construção" : 30.000000 ,
		"Comercial ou Institucional" : 300.000000 ,
		"Residencial, Agricultura, Florestal ou Pesca" : 300.000000 
	},
	"n2oFactor" : {
		"Energia" : 4.000000 ,
		"Manufatura ou Construção" : 4.000000 ,
		"Comercial ou Institucional" : 4.000000 ,
		"Residencial, Agricultura, Florestal ou Pesca" : 4.000000 
	}
	},
"Resíduos Municipais (fração não-biomassa)" : {
	"unit" : "Toneladas",
	"co2Factor" : 917.000000,
	"ch4Factor" : {
		"Energia" : 0.300000 ,
		"Manufatura ou Construção" : 0.300000 ,
		"Comercial ou Institucional" : 3.000000 ,
		"Residencial, Agricultura, Florestal ou Pesca" : 3.000000 
	},
	"n2oFactor" : {
		"Energia" : 0.040000 ,
		"Manufatura ou Construção" : 0.040000 ,
		"Comercial ou Institucional" : 0.040000 ,
		"Residencial, Agricultura, Florestal ou Pesca" : 0.040000 
	}
	},
"Solventes" : {
	"unit" : "Litros",
	"co2Factor" : 2.400238,
	"ch4Factor" : {
		"Energia" : 0.000098 ,
		"Manufatura ou Construção" : 0.000098 ,
		"Comercial ou Institucional" : 0.000327 ,
		"Residencial, Agricultura, Florestal ou Pesca" : 0.000327 
	},
	"n2oFactor" : {
		"Energia" : 0.000020 ,
		"Manufatura ou Construção" : 0.000020 ,
		"Comercial ou Institucional" : 0.000020 ,
		"Residencial, Agricultura, Florestal ou Pesca" : 0.000020 
	}
	},
"Turfa" : {
	"unit" : "Toneladas",
	"co2Factor" : 1034.560000,
	"ch4Factor" : {
		"Energia" : 0.009760 ,
		"Manufatura ou Construção" : 0.019520 ,
		"Comercial ou Institucional" : 0.097600 ,
		"Residencial, Agricultura, Florestal ou Pesca" : 2.928000 
	},
	"n2oFactor" : {
		"Energia" : 0.014640 ,
		"Manufatura ou Construção" : 0.014640 ,
		"Comercial ou Institucional" : 0.013664 ,
		"Residencial, Agricultura, Florestal ou Pesca" : 0.013664 
	}
	},
"Xisto Betuminoso e Areias Betuminosas" : {
	"unit" : "Toneladas",
	"co2Factor" : 952.300000,
	"ch4Factor" : {
		"Energia" : 0.008900 ,
		"Manufatura ou Construção" : 0.089000 ,
		"Comercial ou Institucional" : 0.089000 ,
		"Residencial, Agricultura, Florestal ou Pesca" : 2.670000 
	},
	"n2oFactor" : {
		"Energia" : 0.013350 ,
		"Manufatura ou Construção" : 0.013350 ,
		"Comercial ou Institucional" : 0.013350 ,
		"Residencial, Agricultura, Florestal ou Pesca" : 0.013350 
	}
	}
}
