<svg xmlns="http://www.w3.org/2000/svg" viewBox="0 0 24 24">
  <path id="sample-icon" d="M14,2A12,12,0,1,0,26,14,12,12,0,0,0,14,2Zm1.2,18H12.8V12.8h2.4Zm0-9.6H12.8V8h2.4Z" transform="translate(-2 -2)"/>
</svg>
