{
  "project_info": {
    "project_number": "1081858186022",
    "project_id": "fir-ppb2021-cd2d1",
    "storage_bucket": "fir-ppb2021-cd2d1.appspot.com"
  },
  "client": [
    {
      "client_info": {
        "mobilesdk_app_id": "1:1081858186022:android:a16d4325575adfee9f3fe7",
        "android_client_info": {
          "package_name": "com.alzi_19102166.praktikum11"
        }
      },
      "oauth_client": [
        {
          "client_id": "1081858186022-lkfojjl77gallt4hvlnucsr4rnnnfut4.apps.googleusercontent.com",
          "client_type": 3
        }
      ],
      "api_key": [
        {
          "current_key": "AIzaSyDC5aB3IS6OQvIeRjkjbYNKxJG69PQ8JSQ"
        }
      ],
      "services": {
        "appinvite_service": {
          "other_platform_oauth_client": [
            {
              "client_id": "1081858186022-lkfojjl77gallt4hvlnucsr4rnnnfut4.apps.googleusercontent.com",
              "client_type": 3
            }
          ]
        }
      }
    }
  ],
  "configuration_version": "1"
}