[
  {
    "Universitetet i Tromsø - Norges arktiske universitet": {
      "id": "186.0.0.0"
    }
  },
  {
    "UiT - Aktivering - Avskrivning": {
      "id": "186.0.0.1"
    }
  },
  {
    "Universitetsledelsen": {
      "id": "186.10.0.0"
    }
  },
  {
    "Universitetsledelsen": {
      "id": "186.10.10.0"
    }
  },
  {
    "Seksjon for kommunikasjon": {
      "id": "186.26.22.28"
    }
  },
  {
    "Ledelse": {
      "id": "186.26.23.11"
    }
  },
  {
    "Fellestjenester": {
      "id": "186.26.23.21"
    }
  },
  {
    "Rekruttering og marked": {
      "id": "186.26.23.22"
    }
  },
  {
    "Seksjon for marked og kommunikasjon": {
      "id": "186.26.23.25"
    }
  },
  {
    "Avdeling for økonomi": {
      "id": "186.26.24.0"
    }
  },
  {
    "Ledelse": {
      "id": "186.26.24.11"
    }
  },
  {
    "Regnskapsseksjonen": {
      "id": "186.26.24.21"
    }
  },
  {
    "Økonomiseksjonen": {
      "id": "186.26.24.22"
    }
  },
  {
    "Avdeling for organisasjon og økonomi": {
      "id": "186.26.25.0"
    }
  },
  {
    "Ledelse og stab ORGØK": {
      "id": "186.26.25.11"
    }
  },
  {
    "Seksjon for arkiv": {
      "id": "186.26.25.21"
    }
  },
  {
    "Seksjon for lønn": {
      "id": "186.26.25.22"
    }
  },
  {
    "Seksjon for personal og organisasjon": {
      "id": "186.26.25.23"
    }
  },
  {
    "Seksjon for personal og organisasjon": {
      "id": "186.26.25.24"
    }
  },
  {
    "Seksjon for økonomi og innkjøp": {
      "id": "186.26.25.25"
    }
  },
  {
    "Seksjon for regnskap": {
      "id": "186.26.25.26"
    }
  },
  {
    "Seksjon for rekruttering": {
      "id": "186.26.25.27"
    }
  },
  {
    "Avdeling for IT": {
      "id": "186.26.26.0"
    }
  },
  {
    "Ledelse ITA": {
      "id": "186.26.26.11"
    }
  },
  {
    "Administrasjon og fellestjenester": {
      "id": "186.26.26.21"
    }
  },
  {
    "Fakultetsledelsen": {
      "id": "186.31.1.0"
    }
  },
  {
    "Seksjon for organisasjon og økonomi Helsefak": {
      "id": "186.31.2.11"
    }
  },
  {
    "Seksjon for forskning, utdanning og formidling Helsefak": {
      "id": "186.31.2.12"
    }
  },
  {
    "Seksjon for forskningstjenester": {
      "id": "186.31.2.13"
    }
  },
  {
    "Seksjon for formidlingstjenester": {
      "id": "186.31.2.14"
    }
  },
  {
    "Faglige fellesressurser": {
      "id": "186.31.2.15"
    }
  },
  {
    "Enhet for legeutdanning": {
      "id": "186.31.2.16"
    }
  },
  {
    "Senter for helsefaglig pedagogisk utvikling": {
      "id": "186.31.2.17"
    }
  },
  {
    "Regional etisk komité": {
      "id": "186.31.2.81"
    }
  },
  {
    "Institutt for medisinsk biologi": {
      "id": "186.31.11.0"
    }
  },
  {
    "Felles IMB": {
      "id": "186.31.11.1"
    }
  },
  {
    "Instituttledelsen": {
      "id": "186.31.11.3"
    }
  },
  {
    "Administrasjon": {
      "id": "186.31.11.2"
    }
  },
  {
    "Undervisning IMB": {
      "id": "186.31.11.10"
    }
  },
  {
    "Bioingeniørutdanningen": {
      "id": "186.31.11.11"
    }
  },
  {
    "Anatomisk avdeling": {
      "id": "186.31.11.12"
    }
  },
  {
    "Ernæringsstudiet": {
      "id": "186.31.11.13"
    }
  },
  {
    "Forskning IMB": {
      "id": "186.31.11.20"
    }
  },
  {
    "Kjernefasiliteter for avansert mikroskopi": {
      "id": "186.31.11.21"
    }
  },
  {
    "Proteomics and Metabolomics Core Facility": {
      "id": "186.31.11.23"
    }
  },
  {
    "Molekylær patologisk forskningsgruppe": {
      "id": "186.31.11.31"
    }
  },
  {
    "Autophagy Research Group": {
      "id": "186.31.11.32"
    }
  },
  {
    "Lysosomal forskningsgruppe": {
      "id": "186.31.11.45"
    }
  },
  {
    "Rettsgenetisk senter": {
      "id": "186.31.11.91"
    }
  },
  {
    "Centre for New Antibacterial Strategies": {
      "id": "186.31.11.92"
    }
  },
  {
    "Institutt for samfunnsmedisin": {
      "id": "186.31.12.0"
    }
  },
  {
    "Felles ISM": {
      "id": "186.31.12.1"
    }
  },
  {
    "Administrasjon": {
      "id": "186.31.12.2"
    }
  },
  {
    "Kroniske sykdommers epidemiologi, forskningsgruppe": {
      "id": "186.31.12.21"
    }
  },
  {
    "Systems epidemiology, forskningsgruppe": {
      "id": "186.31.12.22"
    }
  },
  {
    "Arktisk helseforskning, forskningsgruppe": {
      "id": "186.31.12.23"
    }
  },
  {
    "Allmennmedisin, forskningsgruppe": {
      "id": "186.31.12.24"
    }
  },
  {
    "Helsetjenesteforskning, forskningsgruppe": {
      "id": "186.31.12.25"
    }
  },
  {
    "Undervisning ISM": {
      "id": "186.31.12.26"
    }
  },
  {
    "Medical Humanities, forskningsgruppe": {
      "id": "186.31.12.27"
    }
  },
  {
    "Tromsøundersøkelsen": {
      "id": "186.31.12.28"
    }
  },
  {
    "Arbeidshelse, forskningsgruppe": {
      "id": "186.31.12.29"
    }
  },
  {
    "NAFKAM": {
      "id": "186.31.12.91"
    }
  },
  {
    "Nasjonalt senter for distriktsmedisin NSDM": {
      "id": "186.31.12.92"
    }
  },
  {
    "Allmennmedisinsk forskningsenhet  AFE": {
      "id": "186.31.12.93"
    }
  },
  {
    "Senter for samisk helseforskning SSHF": {
      "id": "186.31.12.94"
    }
  },
  {
    "Senter for arktisk og global helse": {
      "id": "186.31.12.95"
    }
  },
  {
    "Institutt for klinisk medisin": {
      "id": "186.31.13.0"
    }
  },
  {
    "Instituttledelsen": {
      "id": "186.31.13.1"
    }
  },
  {
    "Administrasjon": {
      "id": "186.31.13.2"
    }
  },
  {
    "Felles IKM": {
      "id": "186.31.13.3"
    }
  },
  {
    "Forskning IKM": {
      "id": "186.31.13.10"
    }
  },
  {
    "Kvinnehelse og perinatologi": {
      "id": "186.31.13.21"
    }
  },
  {
    "Tromsø endokrinologiske og geriatriske forskningsgruppe": {
      "id": "186.31.13.22"
    }
  },
  {
    "Pediatri": {
      "id": "186.31.13.23"
    }
  },
  {
    "Kardiovaskulær": {
      "id": "186.31.13.24"
    }
  },
  {
    "Translasjonell kreftforskning": {
      "id": "186.31.13.25"
    }
  },
  {
    "Psykiatri": {
      "id": "186.31.13.27"
    }
  },
  {
    "Nevromuskulære sykdommer": {
      "id": "186.31.13.28"
    }
  },
  {
    "Hjerne og sirkulasjon": {
      "id": "186.31.13.29"
    }
  },
  {
    "Gastrokirurgi": {
      "id": "186.31.13.30"
    }
  },
  {
    "Molekylær inflammasjon": {
      "id": "186.31.13.31"
    }
  },
  {
    "Inflammasjon og human sykdom": {
      "id": "186.31.13.32"
    }
  },
  {
    "Metabolisme og nyremedisin": {
      "id": "186.31.13.33"
    }
  },
  {
    "Akuttmedisin og anestesi": {
      "id": "186.31.13.35"
    }
  },
  {
    "Gastroenterologi og ernæring": {
      "id": "186.31.13.36"
    }
  },
  {
    "Forskningsgruppe for medisinsk avbilding": {
      "id": "186.31.13.37"
    }
  },
  {
    "Forskningsgruppe i nevrobiologi": {
      "id": "186.31.13.38"
    }
  },
  {
    "Ortopedi": {
      "id": "186.31.13.39"
    }
  },
  {
    "Forskningsgruppe for nukleærmedisin og strålebiologi": {
      "id": "186.31.13.40"
    }
  },
  {
    "Klinisk bioinformatikk": {
      "id": "186.31.13.41"
    }
  },
  {
    "Medisinsk biokjemi": {
      "id": "186.31.13.42"
    }
  },
  {
    "Tverrfaglig distriktsmedisinsk forskningsgruppe": {
      "id": "186.31.13.43"
    }
  },
  {
    "Translational Vascular Research Group": {
      "id": "186.31.13.44"
    }
  },
  {
    "Undervisning IKM": {
      "id": "186.31.13.51"
    }
  },
  {
    "Institutt for farmasi": {
      "id": "186.31.14.0"
    }
  },
  {
    "Instituttledelsen": {
      "id": "186.31.14.1"
    }
  },
  {
    "Felles IFA": {
      "id": "186.31.14.2"
    }
  },
  {
    "Utdanning IFA": {
      "id": "186.31.14.21"
    }
  },
  {
    "Cellesignalering og målrettet terapi, forskningsgruppe": {
      "id": "186.31.14.22"
    }
  },
  {
    "Drug transport and drug delivery, forskningsgruppe": {
      "id": "186.31.14.23"
    }
  },
  {
    "Naturstoff- og legemiddelkjemi, forskningsgruppe": {
      "id": "186.31.14.24"
    }
  },
  {
    "Forskningsgruppe i mikrobiologi": {
      "id": "186.31.14.25"
    }
  },
  {
    "Klinisk farmasi og farmakoepidemiologi, forskningsgruppe": {
      "id": "186.31.14.26"
    }
  },
  {
    "Infection Biologi, Research Group": {
      "id": "186.31.14.27"
    }
  },
  {
    "Computational Pharmacology, Research Group": {
      "id": "186.31.14.28"
    }
  },
  {
    "Institutt for klinisk odontologi": {
      "id": "186.31.15.0"
    }
  },
  {
    "Instituttledelsen": {
      "id": "186.31.15.1"
    }
  },
  {
    "Administrasjonen": {
      "id": "186.31.15.2"
    }
  },
  {
    "Felles IKO": {
      "id": "186.31.15.3"
    }
  },
  {
    "Forskning IKO": {
      "id": "186.31.15.10"
    }
  },
  {
    "Tannlegeutdanningen - klinisk del": {
      "id": "186.31.15.20"
    }
  },
  {
    "Tannpleierutdanningen": {
      "id": "186.31.15.21"
    }
  },
  {
    "Dental Public Health and Behavior": {
      "id": "186.31.15.22"
    }
  },
  {
    "Oral Ecology": {
      "id": "186.31.15.23"
    }
  },
  {
    "Oro-Maxillofacial Health and Epidemiology": {
      "id": "186.31.15.25"
    }
  },
  {
    "Biomaterialer i odontologi og medisin": {
      "id": "186.31.15.24"
    }
  },
  {
    "Klinisk og eksperimentell odontologi": {
      "id": "186.31.15.26"
    }
  },
  {
    "Institutt for psykologi": {
      "id": "186.31.16.0"
    }
  },
  {
    "Utdanning": {
      "id": "186.31.16.2"
    }
  },
  {
    "Forskningsgruppe for kognitiv psykologi": {
      "id": "186.31.16.23"
    }
  },
  {
    "Aldring, atferd og demens": {
      "id": "186.31.16.24"
    }
  },
  {
    "Forskningsgruppe for sosialpsykologi": {
      "id": "186.31.16.25"
    }
  },
  {
    "Forskningsgruppe for helsepsykologi": {
      "id": "186.31.16.26"
    }
  },
  {
    "Atferdsmekanismer og psykopatologi": {
      "id": "186.31.16.27"
    }
  },
  {
    "Forskningsgruppe for klinisk psykologi": {
      "id": "186.31.16.28"
    }
  },
  {
    "Forskningsgruppe for kognitiv nevrovitenskap": {
      "id": "186.31.16.29"
    }
  },
  {
    "Human Factor in High Risk Environments": {
      "id": "186.31.16.30"
    }
  },
  {
    "Translasjonell nevrovitenskap og atferd": {
      "id": "186.31.16.31"
    }
  },
  {
    "Barns utvikling": {
      "id": "186.31.16.32"
    }
  },
  {
    "Institutt for helse- og omsorgsfag": {
      "id": "186.31.17.0"
    }
  },
  {
    "Instituttledelsen": {
      "id": "186.31.17.1"
    }
  },
  {
    "Administrasjonen": {
      "id": "186.31.17.2"
    }
  },
  {
    "Felles IHO": {
      "id": "186.31.17.3"
    }
  },
  {
    "Sykepleie Bsc i Tromsø": {
      "id": "186.31.17.21"
    }
  },
  {
    "Fysioterapi Bsc": {
      "id": "186.31.17.22"
    }
  },
  {
    "Ergoterapi Bsc": {
      "id": "186.31.17.23"
    }
  },
  {
    "Radiografi Bsc": {
      "id": "186.31.17.24"
    }
  },
  {
    "Msc i sykepleie og videreutd. ABIKO": {
      "id": "186.31.17.25"
    }
  },
  {
    "Senter for omsorgsforskning Nord": {
      "id": "186.31.17.91"
    }
  },
  {
    "Institutt for vernepleie": {
      "id": "186.31.19.0"
    }
  },
  {
    "Regionalt kunnskapssenter for barn og unge - Nord": {
      "id": "186.31.91.0"
    }
  },
  {
    "RKBU Nord": {
      "id": "186.31.91.0"
    }
  },
  {
    "Administrasjonen": {
      "id": "186.31.91.1"
    }
  },
  {
    "Forebyggingsenheten": {
      "id": "186.31.91.21"
    }
  },
  {
    "Forskningsgruppe for barne- og familievern": {
      "id": "186.31.91.22"
    }
  },
  {
    "Team for undervisning og formidling": {
      "id": "186.31.91.31"
    }
  },
  {
    "Team for fagutvikling og implementering": {
      "id": "186.31.91.32"
    }
  },
  {
    "Fakultet for naturvitenskap og teknologi": {
      "id": "186.32.0.0"
    }
  },
  {
    "Fakultetsledelse": {
      "id": "186.32.1.0"
    }
  },
  {
    "Skibotn feltstasjon": {
      "id": "186.32.1.30"
    }
  },
  {
    "Tromsø Geofys Observator": {
      "id": "186.32.1.40"
    }
  },
  {
    "Centre for Arctic Gas Hydrate, Environment and Climate": {
      "id": "186.32.13.90"
    }
  },
  {
    "Fakultet for humaniora, samfunnsvitenskap og lærerutdanning": {
      "id": "186.33.0.0"
    }
  },
  {
    "Fakultetsadministrasjon": {
      "id": "186.34.2.0"
    }
  },
  {
    "Studieseksjonen": {
      "id": "186.34.2.15"
    }
  },
  {
    "Teknisk seksjon": {
      "id": "186.34.2.13"
    }
  },
  {
    "Seksjon for organisasjon og økonomi BFE-fak": {
      "id": "186.34.2.17"
    }
  },
  {
    "Handelshøgskolen ved UiT": {
      "id": "186.34.13.0"
    }
  },
  {
    "Personalseksjonen": {
      "id": "186.34.2.18"
    }
  },
  {
    "Handelshøgskolen ved UiT i Narvik": {
      "id": "186.34.13.21"
    }
  },
  {
    "Sikkerhet, beredskap og miljø campus Harstad": {
      "id": "186.34.13.23"
    }
  },
  {
    "Sannhets- og forsoningskommisjonen": {
      "id": "186.34.13.91"
    }
  },
  {
    "Senter for hav og Arktis": {
      "id": "186.34.91.0"
    }
  },
  {
    "Det kunstfaglige fakultet": {
      "id": "186.35.0.0"
    }
  },
  {
    "Fakultetsledelse og -administrasjon": {
      "id": "186.35.1.0"
    }
  },
  {
    "Musikkonservatoriet": {
      "id": "186.35.11.0"
    }
  },
  {
    "Det juridiske fakultet": {
      "id": "186.36.0.0"
    }
  },
  {
    "Kunstakademiet": {
      "id": "186.35.12.0"
    }
  },
  {
    "Fakultetsledelse Jurfak": {
      "id": "186.36.1.0"
    }
  },
  {
    "Fakultetsadministrasjonen": {
      "id": "186.36.2.0"
    }
  },
  {
    "Stab Jurfak": {
      "id": "186.36.2.1"
    }
  },
  {
    "Felles Jur. fak.": {
      "id": "186.36.3.0"
    }
  },
  {
    "Seksjon for forskning, utdanning og formidling Jurfak": {
      "id": "186.36.2.2"
    }
  },
  {
    "Jusshjelpa": {
      "id": "186.36.3.90"
    }
  },
  {
    "Norsk senter for havrett": {
      "id": "186.36.3.91"
    }
  },
  {
    "Utdanning Jur. fak.": {
      "id": "186.36.10.0"
    }
  },
  {
    "Forskning Jur. fak.": {
      "id": "186.36.11.0"
    }
  },
  {
    "Fakultet for idrett, reiseliv og sosialfag": {
      "id": "186.37.0.0"
    }
  },
  {
    "Fakultetsledelsen": {
      "id": "186.37.1.0"
    }
  },
  {
    "Fakultetsadministrasjonen": {
      "id": "186.37.2.0"
    }
  },
  {
    "Studie- og forskningsseksjonen": {
      "id": "186.37.2.11"
    }
  },
  {
    "Økonomiseksjonen": {
      "id": "186.37.2.12"
    }
  },
  {
    "Personalseksjonen": {
      "id": "186.37.2.13"
    }
  },
  {
    "Personal- og økonomiseksjonen": {
      "id": "186.37.2.14"
    }
  },
  {
    "Institutt for barnevern og sosialt arbeid": {
      "id": "186.37.11.0"
    }
  },
  {
    "Barnevern campus Harstad": {
      "id": "186.37.11.21"
    }
  },
  {
    "Idrettshøgskolen": {
      "id": "186.37.12.0"
    }
  },
  {
    "Institutt for reiseliv og nordlige studier": {
      "id": "186.37.13.0"
    }
  },
  {
    "Fakultet for ingeniørvitenskap og teknologi": {
      "id": "186.38.0.0"
    }
  },
  {
    "Fakultetsledelse IVT-fak": {
      "id": "186.38.1.0"
    }
  },
  {
    "Fakultetsadministrasjon": {
      "id": "186.38.2.0"
    }
  },
  {
    "Stab IVT-fak": {
      "id": "186.38.2.1"
    }
  },
  {
    "Seksjon for forskning, utdanning og formidling IVT-fak": {
      "id": "186.38.2.11"
    }
  },
  {
    "Seksjon for økonomi og forskningsstøtte": {
      "id": "186.38.2.12"
    }
  },
  {
    "Seksjon for personal og organisasjon": {
      "id": "186.38.2.13"
    }
  },
  {
    "Institutt for industriell teknologi": {
      "id": "186.38.11.0"
    }
  },
  {
    "Institutt for elektroteknologi": {
      "id": "186.38.13.0"
    }
  },
  {
    "Seksjon for kulturvitenskap": {
      "id": "186.41.11.0"
    }
  },
  {
    "Kunstakademiet": {
      "id": "186.41.13.0"
    }
  },
  {
    "Seksjon for naturvitenskap": {
      "id": "186.41.12.0"
    }
  },
  {
    "Musikkonservatoriet": {
      "id": "186.41.14.0"
    }
  },
  {
    "Norges arktiske universitetsmuseum og akademi for kunstfag": {
      "id": "186.41.0.0"
    }
  },
  {
    "Natur- og helsebiblioteket": {
      "id": "186.45.11.0"
    }
  },
  {
    "Altabiblioteket": {
      "id": "186.45.12.24"
    }
  },
  {
    "Kultur- og samfunnsfagbiblioteket": {
      "id": "186.45.12.0"
    }
  },
  {
    "Avdeling for publikumstjenester": {
      "id": "186.45.14.0"
    }
  },
  {
    "Ledelse": {
      "id": "186.45.14.11"
    }
  },
  {
    "Lærerutdanningsbiblioteket": {
      "id": "186.45.14.21"
    }
  },
  {
    "Altabiblioteket": {
      "id": "186.45.14.24"
    }
  },
  {
    "Polarmuseet": {
      "id": "186.41.11.2"
    }
  },
  {
    "Forvaltningsvirksomheten": {
      "id": "186.41.11.1"
    }
  },
  {
    "Polarmuseet": {
      "id": "186.41.15.5"
    }
  },
  {
    "Botanisk hage": {
      "id": "186.41.12.2"
    }
  },
  {
    "Norges arktiske universitetsmuseum": {
      "id": "186.41.15.0"
    }
  },
  {
    "Botanisk hage": {
      "id": "186.41.15.6"
    }
  },
  {
    "Universitetets videre- og etterutdanning": {
      "id": "186.44.0.0"
    }
  },
  {
    "Universitetsbiblioteket": {
      "id": "186.45.0.0"
    }
  },
  {
    "Ledelse og stab": {
      "id": "186.45.1.0"
    }
  },
  {
    "Avdeling for IT, formidling og utvikling": {
      "id": "186.45.5.0"
    }
  },
  {
    "Ressurssenter for undervisning, læring og teknologi": {
      "id": "186.45.6.0"
    }
  },
  {
    "Musikkbiblioteket": {
      "id": "186.45.14.23"
    }
  },
  {
    "Forskningsinstitusjoner": {
      "id": "186.99.95.0"
    }
  },
  {
    "Forskningsinstitusjoner - Andre": {
      "id": "186.99.95.1"
    }
  },
  {
    "Studentsamskipnaden i Tromsø": {
      "id": "186.99.96.0"
    }
  },
  {
    "Studentsamskipnaden i Tromsø - Andre": {
      "id": "186.99.96.1"
    }
  },
  {
    "Studentsamskipnaden i Tromsø - Administrasjon": {
      "id": "186.99.96.10"
    }
  },
  {
    "Akademisk Kvarter": {
      "id": "186.99.96.20"
    }
  },
  {
    "Høgskolen i Tromsø": {
      "id": "186.99.97.0"
    }
  },
  {
    "Avdeling for helsefag": {
      "id": "186.99.97.20"
    }
  },
  {
    "Avdeling for ingeniør - og økonomifag": {
      "id": "186.99.97.30"
    }
  },
  {
    "Avdeling for kunstfag": {
      "id": "186.99.97.50"
    }
  },
  {
    "Temporær stedkode for Fusjon Narvik,harstad": {
      "id": "186.99.99.0"
    }
  },
  {
    "Høgskolen i Narvik-fusjon": {
      "id": "186.99.99.97"
    }
  },
  {
    "Høgskolen i Harstad-fusjon": {
      "id": "186.99.99.98"
    }
  },
  {
    "Fellesadministrasjonen": {
      "id": "186.26.0.0"
    }
  },
  {
    "Personverneombudet": {
      "id": "186.26.0.5"
    }
  },
  {
    "Fellestjenester i Administrasjonen": {
      "id": "186.26.1.0"
    }
  },
  {
    "Ombud ved UiT": {
      "id": "186.26.5.0"
    }
  },
  {
    "Personvernombudet/Studentombudet": {
      "id": "186.26.5.5"
    }
  },
  {
    "Rektor og direktør med stab": {
      "id": "186.26.11.0"
    }
  },
  {
    "Avdeling for forskning og utviklingsarbeid": {
      "id": "186.26.21.0"
    }
  },
  {
    "Avdeling for forskning, utdanning og formidling": {
      "id": "186.26.22.0"
    }
  },
  {
    "Ledelse og stab FUF": {
      "id": "186.26.22.11"
    }
  },
  {
    "Seksjon for internasjonalisering av studier": {
      "id": "186.26.22.21"
    }
  },
  {
    "Seksjon for studiekvalitet": {
      "id": "186.26.22.22"
    }
  },
  {
    "Seksjon for studieinformasjon og opptak": {
      "id": "186.26.22.23"
    }
  },
  {
    "Seksjon for studieadministrasjon": {
      "id": "186.26.22.24"
    }
  },
  {
    "Seksjon for internasjonalt samarbeid": {
      "id": "186.26.22.25"
    }
  },
  {
    "Seksjon for forskning og utdanningskvalitet": {
      "id": "186.26.22.26"
    }
  },
  {
    "Seksjon for studentrekruttering, marked og grafiske tjenester": {
      "id": "186.26.22.27"
    }
  },
  {
    "Avdeling for kommunikasjon og samfunnskontakt": {
      "id": "186.26.23.0"
    }
  },
  {
    "Senter for karriere og arbeidsliv": {
      "id": "186.26.23.24"
    }
  },
  {
    "Seksjon for grunntjenester": {
      "id": "186.26.26.22"
    }
  },
  {
    "Seksjon for digitale forskningstjenester": {
      "id": "186.26.26.23"
    }
  },
  {
    "Seksjon for systemutvikling og arkitektur": {
      "id": "186.26.26.24"
    }
  },
  {
    "Seksjon for digitale utdanningstjenester": {
      "id": "186.26.26.25"
    }
  },
  {
    "Seksjon for brukernær IT-støtte": {
      "id": "186.26.26.26"
    }
  },
  {
    "Seksjon for dokumentasjonsforvaltning": {
      "id": "186.26.26.27"
    }
  },
  {
    "Seksjon for rådgivning og forvaltning": {
      "id": "186.26.26.28"
    }
  },
  {
    "Seksjon for virksomhetsnære tjenester": {
      "id": "186.26.26.29"
    }
  },
  {
    "Seksjon for digitale basistjenester": {
      "id": "186.26.26.30"
    }
  },
  {
    "Avdeling for bygg og eiendom": {
      "id": "186.26.27.0"
    }
  },
  {
    "Ledelse og stab BEA": {
      "id": "186.26.27.11"
    }
  },
  {
    "Prosjektseksjon": {
      "id": "186.26.27.21"
    }
  },
  {
    "Driftsseksjon": {
      "id": "186.26.27.22"
    }
  },
  {
    "Renholdsseksjon": {
      "id": "186.26.27.23"
    }
  },
  {
    "Seksjon for campusdrift": {
      "id": "186.26.27.24"
    }
  },
  {
    "Seksjon for areal og utvikling": {
      "id": "186.26.27.25"
    }
  },
  {
    "Seksjon for prosjektgjennomføring": {
      "id": "186.26.27.26"
    }
  },
  {
    "Campusdministrasjonen i Harstad": {
      "id": "186.26.28.0"
    }
  },
  {
    "Administrasjon": {
      "id": "186.26.28.11"
    }
  },
  {
    "Seksjon for studiestøtte": {
      "id": "186.26.28.21"
    }
  },
  {
    "Økonomi og personal": {
      "id": "186.26.28.22"
    }
  },
  {
    "Campusadministrasjonen i Alta": {
      "id": "186.26.29.0"
    }
  },
  {
    "Administrasjon": {
      "id": "186.26.29.11"
    }
  },
  {
    "Det helsevitenskapelige fakultet": {
      "id": "186.31.0.0"
    }
  },
  {
    "Fakultetsadministrasjon": {
      "id": "186.31.2.0"
    }
  },
  {
    "Tumorbiologisk forskningsgruppe": {
      "id": "186.31.11.33"
    }
  },
  {
    "Forskningsgruppe for RNA og molekylær patologi": {
      "id": "186.31.11.34"
    }
  },
  {
    "Vert-mikrobe interaksjoner, forskningsgruppe": {
      "id": "186.31.11.35"
    }
  },
  {
    "Vaskulær biologisk forskningsgruppe": {
      "id": "186.31.11.36"
    }
  },
  {
    "Immunologisk forskningsgruppe": {
      "id": "186.31.11.37"
    }
  },
  {
    "Gynekologisk onkologisk forskningsgruppe": {
      "id": "186.31.11.38"
    }
  },
  {
    "IMB Translasjonell kreftforskningsgruppe": {
      "id": "186.31.11.39"
    }
  },
  {
    "Kardiovaskulær forskningsgruppe": {
      "id": "186.31.11.40"
    }
  },
  {
    "Eksperimentell og klinisk farmakologi": {
      "id": "186.31.11.41"
    }
  },
  {
    "Forskningsgruppe for molekylær inflammasjon": {
      "id": "186.31.11.42"
    }
  },
  {
    "Stem Cell Aging and Cancer Research Group": {
      "id": "186.31.11.43"
    }
  },
  {
    "Molekylær farmakologi og toksikologi": {
      "id": "186.31.11.44"
    }
  },
  {
    "Hematologi": {
      "id": "186.31.13.26"
    }
  },
  {
    "Telemedisin og e-helse": {
      "id": "186.31.13.34"
    }
  },
  {
    "Administrasjon": {
      "id": "186.31.16.1"
    }
  },
  {
    "Anvendt psykologi": {
      "id": "186.31.16.22"
    }
  },
  {
    "Msc i helsefag - helsesøsterfag": {
      "id": "186.31.17.26"
    }
  },
  {
    "Jordmor videreutdanning": {
      "id": "186.31.17.27"
    }
  },
  {
    "Msc i helsefag - aldring og eldreomsorg": {
      "id": "186.31.17.28"
    }
  },
  {
    "Msc i helsefag - psykisk helse": {
      "id": "186.31.17.29"
    }
  },
  {
    "Masterstudiet og ph.d i helsefag": {
      "id": "186.31.17.30"
    }
  },
  {
    "Sykepleie Bsc i Hammerfest": {
      "id": "186.31.17.31"
    }
  },
  {
    "Sykepleie Bsc og videreutd. i Narvik": {
      "id": "186.31.17.32"
    }
  },
  {
    "Sykepleie Bsc og videreutd. i Harstad": {
      "id": "186.31.17.33"
    }
  },
  {
    "Desentralisert sykepleie i Alta": {
      "id": "186.31.17.35"
    }
  },
  {
    "Sikkerhet, beredskap og miljø campus Narvik": {
      "id": "186.31.17.34"
    }
  },
  {
    "Samisk sykepleierutdanning i Kautokeino": {
      "id": "186.31.17.36"
    }
  },
  {
    "Paramedisin Bsc": {
      "id": "186.31.17.37"
    }
  },
  {
    "Forskningsgr. for helsefaglig profesjonsutd.": {
      "id": "186.31.17.40"
    }
  },
  {
    "Forskningsgr. for pasientnær sykepleieforskning": {
      "id": "186.31.17.42"
    }
  },
  {
    "Forskningsgruppe for folkehelse og rehabilitering": {
      "id": "186.31.17.41"
    }
  },
  {
    "Forskningsgr. for innovasjon i helsefaglig prof.utøv.": {
      "id": "186.31.17.43"
    }
  },
  {
    "Forskningsgruppe for psykisk helse": {
      "id": "186.31.17.44"
    }
  },
  {
    "Forskningsgr. senter for omsorgsforskning nord": {
      "id": "186.31.17.45"
    }
  },
  {
    "Forskningsgr. for kvalitet, org. og makt": {
      "id": "186.31.17.46"
    }
  },
  {
    "Forskningsgr. for liv og livsmot": {
      "id": "186.31.17.47"
    }
  },
  {
    "Rural and Remote Nursing and Healthcare": {
      "id": "186.31.17.48"
    }
  },
  {
    "Idrettshøgskolen": {
      "id": "186.31.18.0"
    }
  },
  {
    "EISCAT": {
      "id": "186.32.1.90"
    }
  },
  {
    "Fakultetsadministrasjon": {
      "id": "186.32.2.0"
    }
  },
  {
    "Studieadministrasjon": {
      "id": "186.32.2.11"
    }
  },
  {
    "Seksjon for forskning, utdanning og formidling NT-fak": {
      "id": "186.32.2.12"
    }
  },
  {
    "Seksjon for økonomi NT-fak": {
      "id": "186.32.2.13"
    }
  },
  {
    "Økonomiforvaltning": {
      "id": "186.32.2.14"
    }
  },
  {
    "Institutt for fysikk og teknologi": {
      "id": "186.32.12.0"
    }
  },
  {
    "Institutt for geovitenskap": {
      "id": "186.32.13.0"
    }
  },
  {
    "Institutt for informatikk": {
      "id": "186.32.14.0"
    }
  },
  {
    "Institutt for kjemi": {
      "id": "186.32.15.0"
    }
  },
  {
    "Institutt for matematikk og statistikk": {
      "id": "186.32.16.0"
    }
  },
  {
    "Institutt for teknologi og sikkerhet": {
      "id": "186.32.17.0"
    }
  },
  {
    "Institutt for ingeniørvitenskap og sikkerhet": {
      "id": "186.32.17.0"
    }
  },
  {
    "Luftfartsfag": {
      "id": "186.32.17.20"
    }
  },
  {
    "Fakultetsledelse": {
      "id": "186.33.1.0"
    }
  },
  {
    "Fakultetsadministrasjon": {
      "id": "186.33.2.0"
    }
  },
  {
    "Stab HSL": {
      "id": "186.33.2.1"
    }
  },
  {
    "Seksjon for forskningstjenester": {
      "id": "186.33.2.11"
    }
  },
  {
    "Seksjon for utdanningstjenester": {
      "id": "186.33.2.12"
    }
  },
  {
    "Seksjon for økonomitjenester": {
      "id": "186.33.2.13"
    }
  },
  {
    "Seksjon for organisasjon og økonomi HSL-fak": {
      "id": "186.33.2.14"
    }
  },
  {
    "Seksjon for forskning, utdanning og formidling HSL-fak": {
      "id": "186.33.2.15"
    }
  },
  {
    "Institutt for språkvitenskap": {
      "id": "186.33.11.0"
    }
  },
  {
    "Institutt for kultur og litteratur": {
      "id": "186.33.12.0"
    }
  },
  {
    "Institutt for filosofi og førstesemesterstudier": {
      "id": "186.33.13.0"
    }
  },
  {
    "Registreringssentral for historiske data Målselv": {
      "id": "186.33.14.11"
    }
  },
  {
    "Institutt for arkeologi, historie, religionsvitenskap og teologi": {
      "id": "186.33.14.0"
    }
  },
  {
    "Institutt for arkeologi og sosialantropologi": {
      "id": "186.33.16.0"
    }
  },
  {
    "Institutt for samfunnsvitenskap": {
      "id": "186.33.15.0"
    }
  },
  {
    "Institutt for lærerutdanning og pedagogikk": {
      "id": "186.33.17.0"
    }
  },
  {
    "Lærerutdanning og pedagogikk campus Alta": {
      "id": "186.33.17.10"
    }
  },
  {
    "Institutt for språk og kultur": {
      "id": "186.33.18.0"
    }
  },
  {
    "Institutt for barnevern og sosialt arbeid": {
      "id": "186.33.19.0"
    }
  },
  {
    "Barnevern i Harstad": {
      "id": "186.33.19.21"
    }
  },
  {
    "Institutt for reiseliv og nordlige studier": {
      "id": "186.33.20.0"
    }
  },
  {
    "Senter for fredsstudier (CPS)": {
      "id": "186.33.82.0"
    }
  },
  {
    "Senter for fredsstudier": {
      "id": "186.33.82.0"
    }
  },

  {
    "Senter for samiske studier": {
      "id": "186.33.85.0"
    }
  },
  {
    "Senter for kvinne- og kjønnsforskning": {
      "id": "186.33.86.0"
    }
  },
  {
    "Barentsinstituttet": {
      "id": "186.33.87.0"
    }
  },
  {
    "Fakultet for biovitenskap, fiskeri og økonomi": {
      "id": "186.34.0.0"
    }
  },
  {
    "Fakultetsledelse": {
      "id": "186.34.1.0"
    }
  },
  {
    "Studie- og forskningsavdeling": {
      "id": "186.34.2.12"
    }
  },
  {
    "Seksjon for fartøy og tekniske tjenester": {
      "id": "186.34.2.14"
    }
  },
  {
    "Institutt for arktisk og marin biologi": {
      "id": "186.34.11.0"
    }
  },
  {
    "BFE Felles": {
      "id": "186.34.3.0"
    }
  },
  {
    "Fartøydrift": {
      "id": "186.34.3.20"
    }
  },
  {
    "Norges fiskerihøgskole": {
      "id": "186.34.12.0"
    }
  },
  {
    "Seksjon for forskning, utdanning og formidling BFE-fak": {
      "id": "186.34.2.16"
    }
  },
  {
    "Handelshøgskolen ved UiT i Tromsø": {
      "id": "186.34.13.20"
    }
  },
  {
    "Handelshøgskolen ved UiT i Harstad": {
      "id": "186.34.13.22"
    }
  },
  {
    "Handelshøgskolen ved UiT i Alta": {
      "id": "186.34.13.24"
    }
  },
  {
    "Institutt for bygg, energi og materialteknologi": {
      "id": "186.38.12.0"
    }
  },
  {
    "Institutt for datateknologi og beregningsorienterte ingeniørfag": {
      "id": "186.38.14.0"
    }
  },
  {
    "Ledelse og stab UMAK": {
      "id": "186.41.1.0"
    }
  },
  {
    "Administrasjon": {
      "id": "186.41.2.0"
    }
  },
  {
    "Institutt for automasjon og prosessteknologi": {
      "id": "186.38.15.0"
    }
  },
  {
    "Seksjon for forskning, utdanning og formidling UMAK": {
      "id": "186.41.2.11"
    }
  },
  {
    "Museumsbiblioteket": {
      "id": "186.45.14.22"
    }
  },
  {
    "Natur- og helsebiblioteket": {
      "id": "186.45.14.25"
    }
  },
  {
    "Hammerfestbiblioteket": {
      "id": "186.45.14.26"
    }
  },
  {
    "Kultur- og samfunnsfagbiblioteket": {
      "id": "186.45.14.27"
    }
  },
  {
    "Kunstakademibiblioteket": {
      "id": "186.45.14.28"
    }
  },
  {
    "Psykologi- og jusbiblioteket": {
      "id": "186.45.14.29"
    }
  },
  {
    "Universitetsbiblioteket Narvik": {
      "id": "186.45.14.30"
    }
  },
  {
    "Universitetsbiblioteket Harstad": {
      "id": "186.45.14.31"
    }
  },
  {
    "Avdeling for samlinger": {
      "id": "186.45.15.0"
    }
  },
  {
    "Avdeling vernepleie": {
      "id": "186.86.0.0"
    }
  },
  {
    "Vernepleierutdanning": {
      "id": "186.86.10.0"
    }
  },
  {
    "Andre enheter": {
      "id": "186.92.0.0"
    }
  },
  {
    "Norgesuniversitetet": {
      "id": "186.92.10.0"
    }
  },
  {
    "Eksterne Enheter": {
      "id": "186.99.0.0"
    }
  },
  {
    "Eksterne Enheter - Andre": {
      "id": "186.99.90.0"
    }
  },
  {
    "Studentorganisasjoner": {
      "id": "186.99.91.0"
    }
  },
  {
    "Eksterne Enheter - Andre": {
      "id": "186.99.90.1"
    }
  },
  {
    "Studentorganisasjoner - Andre": {
      "id": "186.99.91.1"
    }
  },
  {
    "SI": {
      "id": "186.99.91.10"
    }
  },
  {
    "IAESTE": {
      "id": "186.99.91.20"
    }
  },
  {
    "Studentrepresentanter": {
      "id": "186.99.92.0"
    }
  },
  {
    "Studentrepresentanter - Andre": {
      "id": "186.99.92.1"
    }
  },
  {
    "Studentstyret": {
      "id": "186.99.92.10"
    }
  },
  {
    "Fagforeninger": {
      "id": "186.99.93.0"
    }
  },
  {
    "Fagforeninger - Andre": {
      "id": "186.99.93.1"
    }
  },
  {
    "Akademikerne": {
      "id": "186.99.93.10"
    }
  },
  {
    "YS": {
      "id": "186.99.93.20"
    }
  },
  {
    "LO": {
      "id": "186.99.93.30"
    }
  },
  {
    "UNIO": {
      "id": "186.99.93.40"
    }
  },
  {
    "Undervisningsinstitusjoner": {
      "id": "186.99.94.0"
    }
  },
  {
    "Undervisningsinstitusjoner - Andre": {
      "id": "186.99.94.1"
    }
  },
  {
    "Kirkelig Utdanningssenter Nord-Norge": {
      "id": "186.99.94.10"
    }
  },
  {
    "Fellesadministrasjon": {
      "id": "186.99.97.10"
    }
  },
  {
    "Avdeling for lærerutdanning": {
      "id": "186.99.97.40"
    }
  }
]
