,definition,interest
demo_r_mwk3_t,Deaths by week and NUTS 3 region,x
demo_r_mwk3_ts,"Deaths by week, sex and NUTS 3 region",x
nama_10r_3nlp,Nominal Labour productivity by NUTS 3 regions,
nama_10r_3empers,Employment (thousand persons) by NUTS 3 regions,
demo_r_d3dens,Population density by NUTS 3 region,
demo_r_find3,Fertility indicators by NUTS 3 region,
demo_r_mwk3_20,"Deaths by week, sex, 20-year age group and NUTS 3 region",x
demo_r_mwk3_10,"Deaths by week, sex, 10-year age group and NUTS 3 region",x
demo_r_mweek3,"Deaths by week, sex, 5-year age group and NUTS 3 region",x
nama_10r_3gva,Gross value added at basic prices by NUTS 3 region,
demo_r_deaths,Deaths (total) by NUTS 3 region,
demo_r_births,Live births (total) by NUTS 3 region,
demo_r_magec3,"Deaths by age group, sex and NUTS 3 region",
demo_r_fagec3,Live births by age group of the mothers and NUTS 3 region,
nama_10r_3popgdp,Average annual population to calculate regional GDP data (thousand persons) by NUTS 3 regions,
bd_size_r3,Business demography by size class and NUTS 3 regions,
demo_r_pjanind3,Population structure indicators by NUTS 3 region,
proj_19rdbi3,Demographic balances and indicators by type of projection and NUTS 3 region,x
nama_10r_3gdp,Gross domestic product (GDP) at current market prices by NUTS 3 regions,
demo_r_gind3,Population change - Demographic balance and crude rates at regional level (NUTS 3) ,
bd_esize_r3,Employer business demography by size class and NUTS 3 regions,
demo_r_pjanaggr3,"Population on 1 January by broad age group, sex and NUTS 3 region",
proj_19rdth3,"Projected deaths by age, sex, type of projection and NUTS 3 region",x
bd_enace2_r3,Employer business demography by NACE Rev. 2 and NUTS 3 regions,
proj_19ranmig3,"Assumptions for net migration by age, sex, type of projection and NUTS 3 region",x
proj_19rp3,"Population on 1st January by age, sex, type of projection and NUTS 3 region",x
road_go_na7ru3g,"National annual road freight transport by regions of unloading (NUTS 3) and by group of goods (1 000 t), until 2007",
road_go_na7rl3g,"National annual road freight transport by regions of loading (NUTS 3) and by group of goods (1 000 t), until 2007",
demo_r_pjangrp3,"Population on 1 January by age group, sex and NUTS 3 region",
road_go_na_ru3g,"National annual road freight transport by regions of unloading (NUTS 3) and by group of goods (1 000 t), from 2008 onwards",
road_go_na_rl3g,"National annual road freight transport by regions of loading (NUTS 3) and by group of goods (1 000 t), from 2008 onwards",
bd_hgnace2_r3,Business demography and high growth enterprise by NACE Rev. 2 and NUTS 3 regions,
nrg_chddr2_m,Cooling and heating degree days by NUTS 3 regions - monthly data,x
nrg_chddr2_a,Cooling and heating degree days by NUTS 3 regions - annual data,
proj_19ralexp3,"Projected life expectancy by age (reached during the year), sex, type of projection and NUTS 3 region",x
lfst_r_lmdur,"Regional disparities in unemployment rates (NUTS level 2, NUTS level 3)",
lfst_r_lmder,"Regional disparities in employment rates (NUTS level 2, NUTS level 3)",
 aei_fm_ms,Manure storage facilities by NUTS 3 regions,
 aei_pr_soiler,Soil erosion by water by NUTS 3 regions (source: JRC),
 demo_r_births,Live births (total) by NUTS 3 region,
 demo_r_d3area,Area by NUTS 3 region,
 demo_r_d3dens,Population density by NUTS 3 region,
 demo_r_deaths,Deaths (total) by NUTS 3 region,
 demo_r_fagec3,Live births by age group of the mothers and NUTS 3 region,
 demo_r_frate3,Total fertility rate by NUTS 3 region,
 demo_r_gind3,Population change - Demographic balance and crude rates at regional level (NUTS 3),
 demo_r_magec3,"Deaths by age group, sex and NUTS 3 region",
 demo_r_pjanaggr3,"Population on 1 January by broad age group, sex and NUTS 3 region",
 demo_r_pjangrp3,"Population on 1 January by age group, sex and NUTS 3 region",
 demo_r_pjanind3,Population: Structure indicators by NUTS 3 region,
 nama_10r_3empers,Employment (thousand persons) by NUTS 3 regions,
 nama_10r_3gdp,Gross domestic product (GDP) at current market prices by NUTS 3 regions,
 nama_10r_3gva,Gross value added at basic prices by NUTS 3 regions,
 nama_10r_3popgdp,Average annual population to calculate regional GDP data (thousand persons) by NUTS 3 regions,
 bd_enace2_r3,Employer business demography by NACE Rev. 2 and NUTS 3 regions,
 bd_esize_r3,Employer business demography by size class and NUTS 3 regions,
 bd_hgnace2_r3,Business demography and high growth enterprise by NACE Rev. 2 and NUTS 3 regions,
 bd_size_r3,Business demography by size class and NUTS 3 regions,
 road_go_na_rl3g,"National annual road freight transport by regions of loading (NUTS 3) and by group of goods (1 000 t), from 2008 onwards",
 road_go_na_ru3g,"National annual road freight transport by regions of unloading (NUTS 3) and by group of goods (1 000 t), from 2008 onwards",
 road_go_ta_rl,"Annual road freight transport by region of loading (1 000 t, Mio Tkm, 1 000 Jrnys)",
 road_go_ta_ru,"Annual road freight transport by region of unloading (1 000 t, Mio Tkm, 1 000 Jrnys)",
 ipr_da_gdpr,Community design (CD) applications per billion GDP by NUTS 3 regions,
 ipr_da_popr,Community design (CD) applications per million population by NUTS 3 regions,
 ipr_da_reg,Community design (CD) applications by NUTS 3 regions,
 ipr_dfa_gdpr,Community designs (CD) per billion GDP by NUTS 3 regions,
 ipr_dfa_popr,Community designs (CD) per million population by NUTS 3 regions,
 ipr_dfa_reg,Community designs (CD) by NUTS 3 regions,
 ipr_dr_reg,Registered Community designs (RCD) by NUTS 3 regions,
 ipr_ta_gdpr,European Union trade mark (EUTM) applications per billion GDP by NUTS 3 regions,
 ipr_ta_popr,European Union trade mark (EUTM) applications per million population by NUTS 3 regions,
 ipr_ta_reg,European Union trade mark (EUTM) applications by NUTS 3 regions,
 ipr_tr_reg,European Union trade mark (EUTM) registrations by NUTS 3 regions,
 pat_ep_rbio,Biotechnology patent applications to the EPO by priority year by NUTS 3 regions,
 pat_ep_rict,ICT patent applications to the EPO by priority year by NUTS 3 regions,
 pat_ep_ripc,"Patent applications to the EPO by priority year by NUTS 3 regions, international patent classification (IPC) sections and classes",
 pat_ep_rtec,High-tech patent applications to the EPO by priority year by NUTS 3 regions,
 pat_ep_rtot,Patent applications to the EPO by priority year by NUTS 3 regions,
