127.0.0.1 - - [18/Nov/2019:10:43:57 -0200] "POST /Tramitacao/tramitar.json HTTP/1.1" 200 76
127.0.0.1 - - [18/Nov/2019:10:59:02 -0200] "POST /Tramitacao/tramitar/iniciar.json HTTP/1.1" 200 161
127.0.0.1 - - [18/Nov/2019:10:59:13 -0200] "POST /Tramitacao/tramitar.json HTTP/1.1" 200 76
127.0.0.1 - - [18/Nov/2019:12:00:22 -0200] "POST /Tramitacao/tramitar.json HTTP/1.1" 200 76
127.0.0.1 - - [18/Nov/2019:14:33:02 -0200] "POST /Tramitacao/tramitar/iniciar.json HTTP/1.1" 200 161
127.0.0.1 - - [18/Nov/2019:14:33:11 -0200] "POST /Tramitacao/tramitar.json HTTP/1.1" 200 76
127.0.0.1 - - [18/Nov/2019:14:33:53 -0200] "POST /Tramitacao/tramitar.json HTTP/1.1" 200 76
127.0.0.1 - - [18/Nov/2019:14:40:59 -0200] "POST /Tramitacao/tramitar.json HTTP/1.1" 200 76
127.0.0.1 - - [18/Nov/2019:14:41:42 -0200] "POST /Tramitacao/tramitar.json HTTP/1.1" 200 76
127.0.0.1 - - [18/Nov/2019:14:42:53 -0200] "POST /Tramitacao/tramitar.json HTTP/1.1" 200 76
127.0.0.1 - - [18/Nov/2019:14:43:34 -0200] "POST /Tramitacao/tramitar.json HTTP/1.1" 200 76
127.0.0.1 - - [18/Nov/2019:15:33:00 -0200] "POST /Tramitacao/tramitar/iniciar.json HTTP/1.1" 200 161
127.0.0.1 - - [18/Nov/2019:15:33:17 -0200] "POST /Tramitacao/tramitar.json HTTP/1.1" 200 76
127.0.0.1 - - [18/Nov/2019:15:34:13 -0200] "POST /Tramitacao/tramitar.json HTTP/1.1" 200 76
127.0.0.1 - - [18/Nov/2019:15:49:29 -0200] "POST /Tramitacao/tramitar.json HTTP/1.1" 200 76
127.0.0.1 - - [18/Nov/2019:15:50:38 -0200] "POST /Tramitacao/tramitar.json HTTP/1.1" 200 76
