127.0.0.1 - - [11/Mar/2020:09:13:39 -0300] "POST /Tramitacao/tramitar.json HTTP/1.1" 200 76
127.0.0.1 - - [11/Mar/2020:09:17:56 -0300] "POST /Tramitacao/tramitar.json HTTP/1.1" 200 76
127.0.0.1 - - [11/Mar/2020:09:19:11 -0300] "POST /Tramitacao/tramitar.json HTTP/1.1" 200 76
127.0.0.1 - - [11/Mar/2020:09:20:10 -0300] "POST /Tramitacao/tramitar.json HTTP/1.1" 200 76
127.0.0.1 - - [11/Mar/2020:09:35:03 -0300] "POST /Tramitacao/tramitar/iniciar.json HTTP/1.1" 200 160
127.0.0.1 - - [11/Mar/2020:09:35:40 -0300] "POST /Tramitacao/tramitar.json HTTP/1.1" 200 76
127.0.0.1 - - [11/Mar/2020:09:35:40 -0300] "POST /Tramitacao/tramitar.json HTTP/1.1" 200 76
127.0.0.1 - - [11/Mar/2020:14:55:03 -0300] "POST /Tramitacao/tramitar/iniciar.json HTTP/1.1" 200 160
127.0.0.1 - - [11/Mar/2020:14:55:11 -0300] "POST /Tramitacao/tramitar.json HTTP/1.1" 200 76
