127.0.0.1 - - [16/Mar/2020:09:46:10 -0300] "POST /Tramitacao/tramitar/iniciar.json HTTP/1.1" 200 161
127.0.0.1 - - [16/Mar/2020:09:46:39 -0300] "POST /Tramitacao/tramitar.json HTTP/1.1" 200 76
127.0.0.1 - - [16/Mar/2020:09:47:21 -0300] "POST /Tramitacao/tramitar.json HTTP/1.1" 200 76
127.0.0.1 - - [16/Mar/2020:09:53:03 -0300] "POST /Tramitacao/tramitar/iniciar.json HTTP/1.1" 200 161
127.0.0.1 - - [16/Mar/2020:09:53:08 -0300] "POST /Tramitacao/tramitar.json HTTP/1.1" 200 76
127.0.0.1 - - [16/Mar/2020:09:54:05 -0300] "POST /Tramitacao/tramitar.json HTTP/1.1" 200 76
127.0.0.1 - - [16/Mar/2020:10:04:03 -0300] "POST /Tramitacao/tramitar/iniciar.json HTTP/1.1" 200 161
127.0.0.1 - - [16/Mar/2020:10:05:00 -0300] "POST /Tramitacao/tramitar.json HTTP/1.1" 200 76
127.0.0.1 - - [16/Mar/2020:10:05:12 -0300] "POST /Tramitacao/tramitar.json HTTP/1.1" 200 76
127.0.0.1 - - [16/Mar/2020:10:09:31 -0300] "POST /Tramitacao/tramitar.json HTTP/1.1" 200 76
127.0.0.1 - - [16/Mar/2020:10:09:42 -0300] "POST /Tramitacao/tramitar.json HTTP/1.1" 200 76
127.0.0.1 - - [16/Mar/2020:10:50:03 -0300] "POST /Tramitacao/tramitar/iniciar.json HTTP/1.1" 200 161
127.0.0.1 - - [16/Mar/2020:10:50:07 -0300] "POST /Tramitacao/tramitar.json HTTP/1.1" 200 76
127.0.0.1 - - [16/Mar/2020:10:50:24 -0300] "POST /Tramitacao/tramitar.json HTTP/1.1" 200 76
127.0.0.1 - - [16/Mar/2020:10:50:57 -0300] "POST /Tramitacao/tramitar.json HTTP/1.1" 200 76
127.0.0.1 - - [16/Mar/2020:10:51:10 -0300] "POST /Tramitacao/tramitar.json HTTP/1.1" 200 76
127.0.0.1 - - [16/Mar/2020:10:52:38 -0300] "POST /Tramitacao/tramitar.json HTTP/1.1" 200 76
127.0.0.1 - - [16/Mar/2020:10:53:42 -0300] "POST /Tramitacao/tramitar.json HTTP/1.1" 200 76
127.0.0.1 - - [16/Mar/2020:10:54:28 -0300] "POST /Tramitacao/tramitar.json HTTP/1.1" 200 76
127.0.0.1 - - [16/Mar/2020:11:22:02 -0300] "POST /Tramitacao/tramitar/iniciar.json HTTP/1.1" 200 161
127.0.0.1 - - [16/Mar/2020:11:22:06 -0300] "POST /Tramitacao/tramitar.json HTTP/1.1" 200 76
127.0.0.1 - - [16/Mar/2020:11:22:20 -0300] "POST /Tramitacao/tramitar.json HTTP/1.1" 200 76
127.0.0.1 - - [16/Mar/2020:11:22:49 -0300] "POST /Tramitacao/tramitar.json HTTP/1.1" 200 76
127.0.0.1 - - [16/Mar/2020:11:23:00 -0300] "POST /Tramitacao/tramitar.json HTTP/1.1" 200 76
127.0.0.1 - - [16/Mar/2020:11:23:38 -0300] "POST /Tramitacao/tramitar.json HTTP/1.1" 200 76
127.0.0.1 - - [16/Mar/2020:11:23:53 -0300] "POST /Tramitacao/tramitar.json HTTP/1.1" 200 76
127.0.0.1 - - [16/Mar/2020:11:24:13 -0300] "POST /Tramitacao/tramitar.json HTTP/1.1" 200 76
127.0.0.1 - - [16/Mar/2020:11:24:39 -0300] "POST /Tramitacao/tramitar.json HTTP/1.1" 200 76
127.0.0.1 - - [16/Mar/2020:11:24:49 -0300] "POST /Tramitacao/tramitar.json HTTP/1.1" 200 76
127.0.0.1 - - [16/Mar/2020:11:25:03 -0300] "POST /Tramitacao/tramitar.json HTTP/1.1" 200 76
127.0.0.1 - - [16/Mar/2020:11:25:10 -0300] "POST /Tramitacao/tramitar.json HTTP/1.1" 200 76
127.0.0.1 - - [16/Mar/2020:11:25:35 -0300] "POST /Tramitacao/tramitar.json HTTP/1.1" 200 76
127.0.0.1 - - [16/Mar/2020:11:26:10 -0300] "POST /Tramitacao/tramitar.json HTTP/1.1" 200 76
127.0.0.1 - - [16/Mar/2020:13:33:02 -0300] "POST /Tramitacao/tramitar/iniciar.json HTTP/1.1" 200 161
127.0.0.1 - - [16/Mar/2020:13:33:55 -0300] "POST /Tramitacao/tramitar.json HTTP/1.1" 200 76
127.0.0.1 - - [16/Mar/2020:13:34:25 -0300] "POST /Tramitacao/tramitar.json HTTP/1.1" 200 76
