127.0.0.1 - - [17/Jan/2020:09:13:29 -0200] "POST /Tramitacao/tramitar.json HTTP/1.1" 200 76
127.0.0.1 - - [17/Jan/2020:09:14:41 -0200] "POST /Tramitacao/tramitar.json HTTP/1.1" 200 76
127.0.0.1 - - [17/Jan/2020:09:15:35 -0200] "POST /Tramitacao/tramitar.json HTTP/1.1" 200 76
127.0.0.1 - - [17/Jan/2020:09:15:46 -0200] "POST /Tramitacao/tramitar.json HTTP/1.1" 200 76
127.0.0.1 - - [17/Jan/2020:09:16:02 -0200] "POST /Tramitacao/tramitar.json HTTP/1.1" 200 76
127.0.0.1 - - [17/Jan/2020:09:16:28 -0200] "POST /Tramitacao/tramitar.json HTTP/1.1" 200 76
127.0.0.1 - - [17/Jan/2020:09:16:57 -0200] "POST /Tramitacao/tramitar.json HTTP/1.1" 200 76
127.0.0.1 - - [17/Jan/2020:09:31:12 -0200] "POST /Tramitacao/tramitar.json HTTP/1.1" 200 76
127.0.0.1 - - [17/Jan/2020:09:33:13 -0200] "POST /Tramitacao/tramitar.json HTTP/1.1" 200 76
127.0.0.1 - - [17/Jan/2020:09:34:22 -0200] "POST /Tramitacao/tramitar.json HTTP/1.1" 200 76
127.0.0.1 - - [17/Jan/2020:09:36:54 -0200] "POST /Tramitacao/tramitar.json HTTP/1.1" 200 76
127.0.0.1 - - [17/Jan/2020:09:38:05 -0200] "POST /Tramitacao/tramitar.json HTTP/1.1" 200 76
127.0.0.1 - - [17/Jan/2020:09:40:45 -0200] "POST /Tramitacao/tramitar.json HTTP/1.1" 200 76
127.0.0.1 - - [17/Jan/2020:09:42:32 -0200] "POST /Tramitacao/tramitar.json HTTP/1.1" 200 76
127.0.0.1 - - [17/Jan/2020:09:44:15 -0200] "POST /Tramitacao/tramitar.json HTTP/1.1" 200 76
127.0.0.1 - - [17/Jan/2020:09:45:45 -0200] "POST /Tramitacao/tramitar.json HTTP/1.1" 200 76
127.0.0.1 - - [17/Jan/2020:09:46:21 -0200] "POST /Tramitacao/tramitar.json HTTP/1.1" 200 76
127.0.0.1 - - [17/Jan/2020:10:14:20 -0200] "POST /Tramitacao/tramitar.json HTTP/1.1" 200 76
127.0.0.1 - - [17/Jan/2020:10:15:29 -0200] "POST /Tramitacao/tramitar.json HTTP/1.1" 200 76
127.0.0.1 - - [17/Jan/2020:10:15:40 -0200] "POST /Tramitacao/tramitar.json HTTP/1.1" 200 76
127.0.0.1 - - [17/Jan/2020:10:17:11 -0200] "POST /Tramitacao/tramitar.json HTTP/1.1" 200 76
127.0.0.1 - - [17/Jan/2020:10:17:47 -0200] "POST /Tramitacao/tramitar.json HTTP/1.1" 200 76
127.0.0.1 - - [17/Jan/2020:10:22:39 -0200] "POST /Tramitacao/tramitar.json HTTP/1.1" 200 76
127.0.0.1 - - [17/Jan/2020:10:23:46 -0200] "POST /Tramitacao/tramitar.json HTTP/1.1" 200 76
127.0.0.1 - - [17/Jan/2020:10:26:02 -0200] "POST /Tramitacao/tramitar.json HTTP/1.1" 200 76
127.0.0.1 - - [17/Jan/2020:10:26:20 -0200] "POST /Tramitacao/tramitar.json HTTP/1.1" 200 76
127.0.0.1 - - [17/Jan/2020:10:26:28 -0200] "POST /Tramitacao/tramitar.json HTTP/1.1" 200 76
127.0.0.1 - - [17/Jan/2020:10:27:03 -0200] "POST /Tramitacao/tramitar.json HTTP/1.1" 200 76
127.0.0.1 - - [17/Jan/2020:10:27:22 -0200] "POST /Tramitacao/tramitar.json HTTP/1.1" 200 76
127.0.0.1 - - [17/Jan/2020:11:12:40 -0200] "POST /Tramitacao/tramitar.json HTTP/1.1" 200 76
127.0.0.1 - - [17/Jan/2020:11:13:07 -0200] "POST /Tramitacao/tramitar.json HTTP/1.1" 200 76
127.0.0.1 - - [17/Jan/2020:11:14:03 -0200] "POST /Tramitacao/tramitar.json HTTP/1.1" 200 76
127.0.0.1 - - [17/Jan/2020:11:14:03 -0200] "POST /Tramitacao/tramitar.json HTTP/1.1" 200 76
127.0.0.1 - - [17/Jan/2020:11:14:11 -0200] "POST /Tramitacao/tramitar.json HTTP/1.1" 200 76
127.0.0.1 - - [17/Jan/2020:11:14:26 -0200] "POST /Tramitacao/tramitar.json HTTP/1.1" 200 76
127.0.0.1 - - [17/Jan/2020:11:15:23 -0200] "POST /Tramitacao/tramitar.json HTTP/1.1" 200 76
127.0.0.1 - - [17/Jan/2020:11:42:08 -0200] "POST /Tramitacao/tramitar.json HTTP/1.1" 200 76
127.0.0.1 - - [17/Jan/2020:14:58:49 -0200] "POST /Tramitacao/tramitar.json HTTP/1.1" 200 76
