127.0.0.1 - - [02/Apr/2020:09:10:02 -0300] "POST /Tramitacao/tramitar/iniciar.json HTTP/1.1" 200 159
127.0.0.1 - - [02/Apr/2020:09:52:07 -0300] "POST /Tramitacao/tramitar.json HTTP/1.1" 200 76
127.0.0.1 - - [02/Apr/2020:09:55:03 -0300] "POST /Tramitacao/tramitar/iniciar.json HTTP/1.1" 200 159
127.0.0.1 - - [02/Apr/2020:09:56:12 -0300] "POST /Tramitacao/tramitar.json HTTP/1.1" 200 76
127.0.0.1 - - [02/Apr/2020:10:12:21 -0300] "POST /Tramitacao/tramitar.json HTTP/1.1" 200 76
127.0.0.1 - - [02/Apr/2020:10:13:10 -0300] "POST /Tramitacao/tramitar.json HTTP/1.1" 200 76
127.0.0.1 - - [02/Apr/2020:10:15:07 -0300] "POST /Tramitacao/tramitar.json HTTP/1.1" 200 76
127.0.0.1 - - [02/Apr/2020:10:17:38 -0300] "POST /Tramitacao/tramitar.json HTTP/1.1" 200 76
127.0.0.1 - - [02/Apr/2020:10:17:58 -0300] "POST /Tramitacao/tramitar.json HTTP/1.1" 200 76
127.0.0.1 - - [02/Apr/2020:10:21:12 -0300] "POST /Tramitacao/tramitar.json HTTP/1.1" 200 76
127.0.0.1 - - [02/Apr/2020:10:23:47 -0300] "POST /Tramitacao/tramitar.json HTTP/1.1" 200 76
127.0.0.1 - - [02/Apr/2020:10:24:49 -0300] "POST /Tramitacao/tramitar.json HTTP/1.1" 200 76
127.0.0.1 - - [02/Apr/2020:10:25:52 -0300] "POST /Tramitacao/tramitar.json HTTP/1.1" 200 76
127.0.0.1 - - [02/Apr/2020:10:26:38 -0300] "POST /Tramitacao/tramitar.json HTTP/1.1" 200 76
127.0.0.1 - - [02/Apr/2020:10:26:47 -0300] "POST /Tramitacao/tramitar.json HTTP/1.1" 200 76
127.0.0.1 - - [02/Apr/2020:10:28:49 -0300] "POST /Tramitacao/tramitar.json HTTP/1.1" 200 76
127.0.0.1 - - [02/Apr/2020:10:30:45 -0300] "POST /Tramitacao/tramitar.json HTTP/1.1" 200 76
127.0.0.1 - - [02/Apr/2020:10:31:31 -0300] "POST /Tramitacao/tramitar.json HTTP/1.1" 200 76
127.0.0.1 - - [02/Apr/2020:10:32:15 -0300] "POST /Tramitacao/tramitar.json HTTP/1.1" 200 76
127.0.0.1 - - [02/Apr/2020:10:47:02 -0300] "POST /Tramitacao/tramitar/iniciar.json HTTP/1.1" 200 159
127.0.0.1 - - [02/Apr/2020:10:47:53 -0300] "POST /Tramitacao/tramitar.json HTTP/1.1" 200 76
127.0.0.1 - - [02/Apr/2020:11:03:33 -0300] "POST /Tramitacao/tramitar.json HTTP/1.1" 200 76
127.0.0.1 - - [02/Apr/2020:11:03:58 -0300] "POST /Tramitacao/tramitar.json HTTP/1.1" 200 76
127.0.0.1 - - [02/Apr/2020:11:04:09 -0300] "POST /Tramitacao/tramitar.json HTTP/1.1" 200 76
127.0.0.1 - - [02/Apr/2020:11:04:52 -0300] "POST /Tramitacao/tramitar.json HTTP/1.1" 200 76
127.0.0.1 - - [02/Apr/2020:11:05:23 -0300] "POST /Tramitacao/tramitar.json HTTP/1.1" 200 76
127.0.0.1 - - [02/Apr/2020:11:25:02 -0300] "POST /Tramitacao/tramitar/iniciar.json HTTP/1.1" 200 160
127.0.0.1 - - [02/Apr/2020:11:25:08 -0300] "POST /Tramitacao/tramitar.json HTTP/1.1" 200 76
127.0.0.1 - - [02/Apr/2020:11:25:43 -0300] "POST /Tramitacao/tramitar.json HTTP/1.1" 200 76
127.0.0.1 - - [02/Apr/2020:11:26:21 -0300] "POST /Tramitacao/tramitar.json HTTP/1.1" 200 76
127.0.0.1 - - [02/Apr/2020:12:52:53 -0300] "POST /Tramitacao/tramitar.json HTTP/1.1" 200 76
127.0.0.1 - - [02/Apr/2020:12:53:56 -0300] "POST /Tramitacao/tramitar.json HTTP/1.1" 200 76
127.0.0.1 - - [02/Apr/2020:12:54:53 -0300] "POST /Tramitacao/tramitar.json HTTP/1.1" 200 76
127.0.0.1 - - [02/Apr/2020:12:55:13 -0300] "POST /Tramitacao/tramitar.json HTTP/1.1" 200 76
127.0.0.1 - - [02/Apr/2020:12:55:37 -0300] "POST /Tramitacao/tramitar.json HTTP/1.1" 200 76
127.0.0.1 - - [02/Apr/2020:13:32:03 -0300] "POST /Tramitacao/tramitar.json HTTP/1.1" 200 76
127.0.0.1 - - [02/Apr/2020:13:39:26 -0300] "POST /Tramitacao/tramitar.json HTTP/1.1" 200 76
127.0.0.1 - - [02/Apr/2020:13:46:02 -0300] "POST /Tramitacao/tramitar/iniciar.json HTTP/1.1" 200 160
127.0.0.1 - - [02/Apr/2020:13:47:10 -0300] "POST /Tramitacao/tramitar.json HTTP/1.1" 200 76
127.0.0.1 - - [02/Apr/2020:13:47:39 -0300] "POST /Tramitacao/tramitar.json HTTP/1.1" 200 76
127.0.0.1 - - [02/Apr/2020:13:48:05 -0300] "POST /Tramitacao/tramitar.json HTTP/1.1" 200 76
127.0.0.1 - - [02/Apr/2020:13:55:54 -0300] "POST /Tramitacao/tramitar.json HTTP/1.1" 200 76
127.0.0.1 - - [02/Apr/2020:13:56:43 -0300] "POST /Tramitacao/tramitar.json HTTP/1.1" 200 76
127.0.0.1 - - [02/Apr/2020:13:56:54 -0300] "POST /Tramitacao/tramitar.json HTTP/1.1" 200 76
127.0.0.1 - - [02/Apr/2020:13:57:38 -0300] "POST /Tramitacao/tramitar.json HTTP/1.1" 200 76
127.0.0.1 - - [02/Apr/2020:14:01:02 -0300] "POST /Tramitacao/tramitar/iniciar.json HTTP/1.1" 200 160
127.0.0.1 - - [02/Apr/2020:14:01:17 -0300] "POST /Tramitacao/tramitar.json HTTP/1.1" 200 76
127.0.0.1 - - [02/Apr/2020:14:02:05 -0300] "POST /Tramitacao/tramitar.json HTTP/1.1" 200 76
127.0.0.1 - - [02/Apr/2020:14:02:31 -0300] "POST /Tramitacao/tramitar.json HTTP/1.1" 200 76
127.0.0.1 - - [02/Apr/2020:14:02:41 -0300] "POST /Tramitacao/tramitar.json HTTP/1.1" 200 76
127.0.0.1 - - [02/Apr/2020:14:03:24 -0300] "POST /Tramitacao/tramitar.json HTTP/1.1" 200 76
127.0.0.1 - - [02/Apr/2020:14:03:33 -0300] "POST /Tramitacao/tramitar.json HTTP/1.1" 200 76
127.0.0.1 - - [02/Apr/2020:14:04:08 -0300] "POST /Tramitacao/tramitar.json HTTP/1.1" 200 76
127.0.0.1 - - [02/Apr/2020:14:07:43 -0300] "POST /Tramitacao/tramitar.json HTTP/1.1" 200 76
127.0.0.1 - - [02/Apr/2020:14:08:16 -0300] "POST /Tramitacao/tramitar.json HTTP/1.1" 200 76
