127.0.0.1 - - [06/Dec/2019:12:51:25 -0200] "POST /Tramitacao/tramitar.json HTTP/1.1" 200 76
127.0.0.1 - - [06/Dec/2019:12:57:48 -0200] "POST /Tramitacao/tramitar.json HTTP/1.1" 200 76
127.0.0.1 - - [06/Dec/2019:14:36:54 -0200] "POST /Tramitacao/tramitar.json HTTP/1.1" 200 76
127.0.0.1 - - [06/Dec/2019:14:47:01 -0200] "POST /Tramitacao/tramitar/iniciar.json HTTP/1.1" 200 161
127.0.0.1 - - [06/Dec/2019:14:47:22 -0200] "POST /Tramitacao/tramitar.json HTTP/1.1" 200 76
127.0.0.1 - - [06/Dec/2019:15:46:48 -0200] "POST /Tramitacao/tramitar.json HTTP/1.1" 200 76
