127.0.0.1 - - [19/Dec/2019:09:58:42 -0200] "POST /Tramitacao/tramitar.json HTTP/1.1" 200 76
127.0.0.1 - - [19/Dec/2019:10:00:03 -0200] "POST /Tramitacao/tramitar.json HTTP/1.1" 200 76
127.0.0.1 - - [19/Dec/2019:10:01:23 -0200] "POST /Tramitacao/tramitar.json HTTP/1.1" 200 76
127.0.0.1 - - [19/Dec/2019:10:31:28 -0200] "POST /Tramitacao/tramitar.json HTTP/1.1" 200 76
127.0.0.1 - - [19/Dec/2019:10:32:28 -0200] "POST /Tramitacao/tramitar.json HTTP/1.1" 200 76
127.0.0.1 - - [19/Dec/2019:10:34:03 -0200] "POST /Tramitacao/tramitar.json HTTP/1.1" 200 76
127.0.0.1 - - [19/Dec/2019:10:34:09 -0200] "POST /Tramitacao/tramitar.json HTTP/1.1" 200 76
127.0.0.1 - - [19/Dec/2019:10:48:21 -0200] "POST /Tramitacao/tramitar.json HTTP/1.1" 200 76
127.0.0.1 - - [19/Dec/2019:10:48:35 -0200] "POST /Tramitacao/tramitar.json HTTP/1.1" 200 76
127.0.0.1 - - [19/Dec/2019:10:49:30 -0200] "POST /Tramitacao/tramitar.json HTTP/1.1" 200 76
127.0.0.1 - - [19/Dec/2019:14:23:24 -0200] "POST /Tramitacao/tramitar.json HTTP/1.1" 200 76
127.0.0.1 - - [19/Dec/2019:14:24:29 -0200] "POST /Tramitacao/tramitar.json HTTP/1.1" 200 76
