<?xml version="1.0" encoding="utf-8"?>
<COLLADA version="1.5.0" xmlns="http://www.collada.org/2008/03/COLLADASchema">
	<asset>
		<contributor>
			<authoring_tool>BrawlBox</authoring_tool>
		</contributor>
		<created>2017-10-04T18:29:31Z</created>
		<modified>2017-10-04T18:29:31Z</modified>
		<unit meter="0.01" name="centimeter" />
		<up_axis>Y_UP</up_axis>
	</asset>
	<library_images>
		<image id="FitPurinParts02-image" name="FitPurinParts02">
			<init_from>
				<ref>FitPurinParts02.png</ref>
			</init_from>
		</image>
		<image id="metal00-image" name="metal00">
			<init_from>
				<ref>metal00.png</ref>
			</init_from>
		</image>
	</library_images>
	<library_materials>
		<material id="PCap">
			<instance_effect url="#PCap-fx" />
		</material>
	</library_materials>
	<library_effects>
		<effect id="PCap-fx" name="PCap">
			<profile_COMMON>
				<newparam sid="FitPurinParts02-surface">
					<surface type="2D">
						<init_from>
							<ref>FitPurinParts02-image</ref>
						</init_from>
					</surface>
				</newparam>
				<newparam sid="FitPurinParts02-sampler">
					<sampler2D>
						<source>FitPurinParts02-surface</source>
						<instance_image url="#FitPurinParts02-image" />
						<wrap_s>CLAMP</wrap_s>
						<wrap_t>CLAMP</wrap_t>
						<minfilter>LINEAR</minfilter>
						<magfilter>LINEAR</magfilter>
					</sampler2D>
				</newparam>
				<technique sid="COMMON">
					<phong>
						<diffuse>
							<texture texture="FitPurinParts02-sampler" texcoord="TEXCOORD0" />
						</diffuse>
					</phong>
				</technique>
			</profile_COMMON>
		</effect>
		<effect id="PCap_ExtMtl-fx" name="PCap_ExtMtl">
			<profile_COMMON>
				<newparam sid="metal00-surface">
					<surface type="2D">
						<init_from>
							<ref>metal00-image</ref>
						</init_from>
					</surface>
				</newparam>
				<newparam sid="metal00-sampler">
					<sampler2D>
						<source>metal00-surface</source>
						<instance_image url="#metal00-image" />
						<wrap_s>CLAMP</wrap_s>
						<wrap_t>CLAMP</wrap_t>
						<minfilter>NEAREST</minfilter>
						<magfilter>NEAREST</magfilter>
					</sampler2D>
				</newparam>
				<technique sid="COMMON">
					<phong>
						<diffuse>
							<texture texture="metal00-sampler" texcoord="TEXCOORD0" />
						</diffuse>
					</phong>
				</technique>
			</profile_COMMON>
		</effect>
	</library_effects>
	<library_geometries>
		<geometry id="polygon0" name="polygon0">
			<mesh>
				<source id="polygon0_Positions">
					<float_array id="polygon0_PosArr" count="465">-2.265872 2.178501 -3.880432 -2.829618 2.754348 -5.028856 -3.452746 2.357342 -3.119155 -4.005446 2.894105 -4.234361 -4.478258 2.85286 -2.246274 -4.956887 3.413959 -3.467725 -5.142791 3.823776 -1.374721 -5.590732 4.312313 -2.634722 -5.883298 5.410491 -1.953884 -5.588891 5.630824 -2.200594 -5.595165 6.85436 -1.726982 -5.819376 7.059863 -2.936791 -5.465123 8.357357 -2.681394 -5.566897 8.3864 -4.247733 -4.853811 9.344147 -2.617519 -4.764007 9.536506 -4.279387 -3.865324 10.17647 -2.637559 -3.392614 10.3228 -4.628313 -2.845132 10.64832 -2.903494 -1.818601 10.81184 -3.407128 -1.127211 10.74893 -2.119777 -0.1149187 10.579 -2.971714 0.0843257 10.82605 -2.802917 1.04504 10.24277 -3.610677 0.7426848 10.69193 -1.610382 1.715651 10.04846 -2.517675 -3.602334 6.348928 -8.504116 -3.232264 6.619362 -9.25949 -2.955477 6.210925 -8.581187 -2.56982 6.258829 -9.227587 -2.225646 5.634501 -8.979411 -2.587359 6.042657 -9.924684 -2.18994 5.321743 -9.638117 -2.518533 4.988472 -10.19842 -2.311828 4.571587 -9.211279 -2.624091 4.338819 -9.828772 -2.906466 4.078724 -8.807208 -3.139063 3.911985 -9.478839 -3.866744 3.871011 -9.282284 -3.558587 4.120167 -10.08563 -4.207275 4.269285 -10.0088 -3.842393 4.599157 -10.4899 -4.452464 4.83497 -10.24968 -4.047723 5.251251 -10.56754 -4.767808 5.50553 -9.932014 -4.252837 5.932358 -10.28195 -4.192542 6.41165 -9.734564 -3.525152 5.973333 -10.4785 -3.352288 6.458963 -9.961525 -5.267625 7.8607 -5.81415 -5.397343 6.392375 -5.877688 -4.871528 6.299708 -7.027194 -4.540924 4.921355 -6.20607 -4.036773 5.228289 -7.159403 -3.587674 4.498764 -6.661129 -2.861918 5.128979 -7.504987 -2.527878 4.55723 -7.088626 -1.586152 5.1201 -7.413702 -2.213676 4.173358 -6.569918 -0.9828311 4.93409 -6.962074 -0.4067971 4.8446 -6.408081 -0.1016819 6.158452 -7.036837 0.6278407 6.070286 -6.38363 1.113288 8.034369 -5.848222 1.764396 6.784647 -5.505831 1.788463 7.920988 -4.974483 2.187215 6.726834 -5.559233 2.230181 7.929173 -5.004557 2.921932 6.327322 -4.407062 2.936247 7.751681 -3.800235 -2.700901 5.642557 -8.345469 -2.331203 4.984846 -8.609757 -3.093552 5.211784 -8.032385 -2.846174 4.558014 -8.259823 -3.573856 4.51704 -8.06327 -3.746725 4.03141 -8.580249 -4.511651 4.447718 -8.617087 -4.529192 4.231544 -9.314189 -4.873366 4.855873 -9.562364 -5.849464 6.77733 -1.446983 -5.238463 8.192695 -1.440484 -5.467094 8.221194 -1.162111 -4.53319 9.207427 -1.31044 -4.677264 9.347901 -1.012556 -3.477415 10.01935 -1.236099 -3.562283 10.23614 -0.8967395 -2.307762 10.55433 -1.551917 -2.276829 10.82252 -1.248231 -0.9775111 11.03854 -1.868615 -0.4303089 10.84075 -0.6778789 -4.72225 8.938831 -5.90594 -3.778615 9.690097 -6.177281 -1.941646 10.41266 -5.340596 -0.7801734 10.60873 -4.149209 0.7494087 10.05152 -3.691926 1.8317 9.161807 -4.335105 2.46241 9.106497 -3.110462 -5.714576 6.397566 -4.668314 -5.760808 5.900431 -3.263558 -4.793754 4.701884 -5.272615 -4.80194 4.38471 -4.342029 -3.564806 3.864254 -5.220668 -3.917379 3.237936 -4.30097 -2.79698 3.123172 -5.042878 -1.519933 3.038739 -5.661614 -0.8959351 2.407607 -4.523121 -2.655788 9.580327 -6.68293 -0.8510589 9.850347 -6.020891 0.05247431 10.07019 -4.756015 1.466337 9.046474 -4.382111 -3.591532 4.124267 -5.981202 -4.787181 5.918786 -9.330497 -4.909068 5.168631 -8.903658 -4.474919 6.151556 -8.713003 -4.580477 5.501901 -8.34335 -3.994986 5.918155 -8.191031 -3.740411 5.349788 -7.955313 -1.978246 5.867321 -7.93341 -0.9346026 6.040872 -7.562048 -1.921276 7.21556 -8.13649 -0.9455488 7.774354 -7.551565 -1.723356 8.960953 -7.146797 -0.01802172 8.165957 -6.810222 -4.41658 6.214119 -7.777254 -3.835545 7.49964 -8.155735 -4.657174 7.52613 -7.109826 -3.913318 8.636535 -7.405369 -4.757922 3.703847 -3.614479 -5.326897 4.583286 -2.839503 -4.290899 9.129344 0.2822482 -3.076621 10.01925 0.317136 -1.750875 10.64085 0.0005937944 0.4531221 3.022563 -4.902776 -0.1862829 3.574923 -6.022751 -0.3999071 3.867299 -5.944179 0.6832674 4.666124 -6.030818 1.556862 3.912484 -5.00277 0.9504416 4.43257 -6.097777 1.384287 5.610583 -5.923954 -4.236302 4.877573 -8.095174 0.7663052 9.104267 -5.413011 -3.399035 5.102135 -10.64437 -2.862708 5.6128 -10.4466 -3.153847 4.536449 -10.40349 -3.959947 6.578388 -9.062936 -1.959467 3.995632 -6.040562 -1.600797 3.365786 -5.606664 2.470186 5.009877 -4.858892 1.741391 5.493317 -5.986281 -5.497396 5.133611 -0.6291801 -5.466097 6.645236 -0.1293391 -5.118557 7.926904 0.05199073 -2.718673 8.127901 -7.838704 -2.602941 6.777131 -8.459184 -0.6868038 6.349347 -0.7125619</float_array>
					<technique_common>
						<accessor source="#polygon0_PosArr" count="155" stride="3">
							<param name="X" type="float" />
							<param name="Y" type="float" />
							<param name="Z" type="float" />
						</accessor>
					</technique_common>
				</source>
				<source id="polygon0_Normals">
					<float_array id="polygon0_NormArr" count="483">0.1245607 -0.9747236 0.1854677 -0.4048244 -0.533296 -0.7428371 -0.06942548 -0.9507723 0.302014 -0.6068183 -0.5091636 -0.6104107 -0.2715249 -0.8489582 0.4533702 -0.7989219 -0.3748161 -0.4704185 -0.4468964 -0.6461978 0.6186367 -0.9281486 -0.1741475 -0.3290201 -0.9704729 0.009706666 -0.2410946 -0.9551371 0.02704357 -0.2950023 -0.9502546 0.1952519 -0.2427788 -0.9942383 0.08996776 0.0585595 -0.9123239 0.3823516 0.1467609 -0.9226307 0.3720541 -0.1021947 -0.7612674 0.6361716 0.1259766 -0.6723052 0.7309977 -0.117644 -0.5185289 0.851124 0.08286976 -0.3463297 0.9249241 -0.1574571 -0.2820374 0.958597 0.04133365 -0.0572506 0.9943184 -0.09057097 -0.2022437 0.9308714 -0.3044236 -0.01485817 0.898939 -0.4379211 0.008201405 0.9162045 -0.4007352 0.2863498 0.8262404 -0.4851684 0.6237507 0.7005332 0.3466816 0.7881941 0.4930204 0.3683484 -0.0870041 0.8632962 0.4971424 0.2240179 0.9742793 0.02440847 0.5316507 0.7214447 0.443695 0.6794603 0.7274337 0.09577838 0.896204 0.3708928 0.2434274 0.6821951 0.5654347 -0.4635661 0.9824293 0.0210954 -0.1854406 0.7353468 -0.1598514 -0.6585688 0.8913554 -0.4518336 -0.03649247 0.6020658 -0.7024092 -0.3796553 0.4559375 -0.8270641 0.3287649 0.2788753 -0.9453002 -0.1692224 -0.2237534 -0.9746422 0.002480251 0.03104027 -0.8294023 -0.5577887 -0.5084162 -0.7053933 -0.4938955 -0.2076671 -0.458056 -0.8643258 -0.6624962 -0.2862284 -0.6922215 -0.3863924 0.04559354 -0.9212071 -0.8200595 0.2215789 -0.5276415 -0.4954121 0.4676846 -0.7320099 -0.4559363 0.8270644 -0.3287643 0.0199206 0.5250447 -0.850841 0.1398339 0.8606115 -0.4896879 -0.9104751 0.2053495 -0.3591721 -0.9198837 -0.2147241 -0.3283312 -0.8557295 -0.2426521 -0.4571343 -0.6853346 -0.596051 -0.4185427 -0.467091 -0.7684914 -0.4375238 -0.3266679 -0.7553337 -0.5683066 -0.003392486 -0.7670349 -0.6417803 -0.03939873 -0.716665 -0.6964731 0.2347791 -0.5810428 -0.779411 0.08222992 -0.8649031 -0.4953806 0.4397161 -0.5867032 -0.6801491 0.3583262 -0.5464256 -0.7570688 0.6089309 -0.1732146 -0.7741395 0.5290229 -0.1144988 -0.8408931 0.6881505 0.2293772 -0.6883758 0.39232 0.2636026 -0.881276 0.395418 0.4462987 -0.8028117 0.4590487 0.2564826 -0.850607 0.4463108 0.4495213 -0.7738061 0.9752139 -0.2047305 0.08392195 0.9818664 0.07733539 0.1730827 0.7155313 0.2570918 0.6495526 0.8481427 -0.1775126 0.4991423 0.4030566 -0.09494339 0.9102371 0.4914158 -0.4308859 0.7568672 -0.01251913 -0.4993669 0.8663002 -0.1398351 -0.8606118 0.4896873 -0.6821951 -0.5654347 0.4635661 -0.6888523 -0.7228422 -0.05460213 -0.9387506 -0.2887951 -0.1880017 -0.9618375 0.1974696 -0.1895262 -0.8762896 0.4375368 -0.2018524 -0.8855645 0.462441 -0.04452799 -0.7078268 0.6838195 -0.1773645 -0.7080958 0.6938431 -0.1314071 -0.5273378 0.8299519 -0.1821881 -0.5249367 0.8398749 -0.1383819 -0.3655185 0.9028216 -0.2267394 -0.3551713 0.9156228 -0.1886513 -0.1820851 0.9463069 -0.2672943 0.4109899 0.6437426 0.64551 -0.7665991 0.5178204 -0.3799763 -0.4076191 0.8157983 -0.4105566 -0.02411611 0.9322162 -0.3613634 0.2262498 0.9427283 -0.2453305 0.1975473 0.7708898 -0.6056157 0.3781403 0.6134402 -0.6933584 0.9022647 0.3352123 0.2741111 -0.9797244 -0.09414316 -0.1770285 -0.9570782 -0.281354 -0.06976897 -0.7584541 -0.5976943 -0.260002 -0.7792521 -0.5206299 -0.3489809 -0.4065437 -0.7838654 -0.4694773 -0.62751 -0.3531305 -0.6939834 -0.431071 -0.380317 -0.8183117 -0.1706969 -0.4874044 -0.8563889 0.3254638 -0.9414185 0.08834482 -0.01849534 0.7500555 -0.6612636 0.3194807 0.7576448 -0.5692293 0.4592228 0.8081232 -0.3689414 0.3397651 0.5957149 -0.727827 -0.3897307 -0.8441898 -0.3682777 -0.9135347 0.4029131 -0.05581874 -0.9602499 0.02782606 0.2777528 -0.6466123 0.6541933 0.392331 -0.6786557 0.1363163 0.721695 -0.4202144 0.4888751 0.7644743 -0.2092853 0.02217824 0.9776028 0.4111339 -0.5045875 -0.7593029 0.4667539 -0.2384062 -0.8517286 0.3748406 0.1385939 -0.9167395 0.474731 0.2182085 -0.8527071 0.2394867 0.5623341 -0.7915584 0.5430241 0.3785663 -0.7495828 -0.7596865 -0.2298133 -0.6083269 -0.3926114 0.1822804 -0.9014603 -0.7907277 -0.1014747 -0.6038381 -0.4195612 0.3340456 -0.8441666 -0.8106171 0.2518758 -0.5288101 -0.4379161 0.5874357 -0.6807235 -0.7813874 -0.1944565 -0.5930358 -0.9092588 -0.1404487 -0.3918816 -0.5248969 0.3439565 0.7785737 -0.1838275 0.4590924 0.8691617 0.1114365 0.6002894 0.7919811 0.5249025 -0.8504448 0.03493899 0.06549801 -0.387294 -0.9196784 -0.04092935 -0.2592046 -0.9650052 0.1419458 -0.114267 -0.9832993 0.7031619 -0.7109367 0.01152074 0.2582461 -0.2406212 -0.9356753 0.2184494 0.1159245 -0.968975 -0.4561964 -0.224188 0.8611761 0.602744 0.5857217 -0.5419067 -0.6565688 -0.6583039 -0.368175 0.1530621 -0.07841294 -0.9851006 0.4723139 0.2452232 -0.8466316 0.302401 -0.5080346 -0.8065081 -0.2710068 0.9437498 0.1894491 -0.04708725 -0.7052556 -0.7075015 -0.2532414 -0.2987562 -0.9201711 0.1721507 -0.9384738 -0.2993835 0.5296357 -0.307707 -0.7904442 0.8685096 -0.4950547 0.02471557 0.3942149 -0.004428575 -0.9190387 -0.5383096 -0.3945755 0.7446697 -0.5572602 -0.1178705 0.8228932 -0.5089139 0.09035689 0.8560618 0.05333294 0.5212935 -0.8518152 0.1823111 0.1962894 -0.9635353 0.4241368 -0.3595742 0.831152 0.2350718 0.06358938 -0.9698955</float_array>
					<technique_common>
						<accessor source="#polygon0_NormArr" count="161" stride="3">
							<param name="X" type="float" />
							<param name="Y" type="float" />
							<param name="Z" type="float" />
						</accessor>
					</technique_common>
				</source>
				<source id="polygon0_Colors0">
					<float_array id="polygon0_ColorArr0" count="4">0.4509804 0.4509804 0.4509804 1</float_array>
					<technique_common>
						<accessor source="#polygon0_ColorArr0" count="1" stride="4">
							<param name="R" type="float" />
							<param name="G" type="float" />
							<param name="B" type="float" />
							<param name="A" type="float" />
						</accessor>
					</technique_common>
				</source>
				<source id="polygon0_UVs0">
					<float_array id="polygon0_UVArr0" count="258">0.017251 0.111776 0.133927 0.111776 0.017251 0.211579 0.133927 0.211579 0.017251 0.27322 0.133927 0.27322 0.017251 0.369659 0.133927 0.371089 0.133927 0.482324 0.166021 0.482324 0.166021 0.58148 0.280442 0.581459 0.280442 0.693635 0.430599 0.70984 0.282796 0.795094 0.436131 0.831967 0.285066 0.892895 0.452319 0.949934 0.287287 0.988562 0.166021 0.893 0.166021 0.797084 0.133927 0.797084 0.133927 0.693687 0.017251 0.797084 0.017251 0.693687 0.851696 0.006461024 0.828824 0.04745102 0.872833 0.006461024 0.864231 0.04936099 0.910332 0.05087799 0.86126 0.09540403 0.914493 0.09715599 0.910464 0.149416 0.959742 0.09778601 0.949651 0.149962 0.996363 0.097054 0.982657 0.149328 0.955768 0.147755 0.92794 0.186642 0.906197 0.185017 0.886603 0.199526 0.865689 0.183791 0.846965 0.184193 0.835072 0.143782 0.800672 0.144417 0.788521 0.09138298 0.828956 0.145989 0.820375 0.09319901 0.603741 0.511635 0.540802 0.405679 0.643382 0.340533 0.490788 0.248274 0.596557 0.209177 0.463107 0.165278 0.589183 0.126311 0.445435 0.08245099 0.368607 0.06664801 0.38266 0.185572 0.299903 0.173973 0.394343 0.276745 0.280442 0.306109 0.280442 0.482324 0.166021 0.371089 0.017251 0.482324 0.913578 0.006461024 0.949519 0.05142403 0.933205 0.006461024 0.98392 0.05079001 0.955636 0.04921699 0.966805 0.09523797 0.925921 0.09303302 0.920361 0.145846 0.87426 0.144328 0.133927 0.58148 0.166021 0.693687 0.133927 0.893 0.166021 0.988693 0.133927 0.988693 0.017251 0.893 0.599181 0.746817 0.631021 0.855514 0.017251 0.594591 0.429521 0.469114 0.166021 0.211579 0.166021 0.111776 0.133927 0.01489002 0.017251 0.01489002 0.827438 0.09065098 0.872688 0.091281 0.834941 0.04524398 0.874128 0.04579002 0.871323 0.006461024 0.912069 0.006461024 0.989475 0.787562 0.964368 0.806587 0.944537 0.75594 0.844294 0.841376 0.794618 0.760351 0.742667 0.855514 0.619734 0.746817 0.589449 0.855514 0.166021 0.27322 0.017251 0.988693 0.920229 0.04730803 0.580623 0.64229 0.429605 0.506018 0.658496 0.651603 0.861427 0.680675 0.989475 0.679489 0.868708 0.185817 0.864362 0.147899 0.909216 0.187044 0.801934 0.04587901 0.280442 0.049945 0.166021 0.01489002 0.754849 0.198778 0.749259 0.289481 0.996559 0.966617 0.996559 0.978609 0.744304 0.944307 0.996559 0.984139 0.996559 0.955454 0.996559 0.947434 0.996559 0.939909 0.996559 0.932513 0.99656 0.928516 0.996559 0.924755 0.99656 0.91887 0.996559 0.913275</float_array>
					<technique_common>
						<accessor source="#polygon0_UVArr0" count="129" stride="2">
							<param name="S" type="float" />
							<param name="T" type="float" />
						</accessor>
					</technique_common>
				</source>
				<vertices id="polygon0_Vertices">
					<input semantic="POSITION" source="#polygon0_Positions" />
				</vertices>
				<triangles material="PCap" count="306">
					<input semantic="VERTEX" source="#polygon0_Vertices" offset="0" />
					<input semantic="NORMAL" source="#polygon0_Normals" offset="1" />
					<input semantic="COLOR" source="#polygon0_Colors0" set="0" offset="2" />
					<input semantic="TEXCOORD" source="#polygon0_UVs0" set="0" offset="3" />
					<p>2 2 0 2 1 1 0 1 0 0 0 0 3 3 0 3 1 1 0 1 2 2 0 2 4 4 0 4 3 3 0 3 2 2 0 2 5 5 0 5 3 3 0 3 4 4 0 4 6 6 0 6 5 5 0 5 4 4 0 4 7 7 0 7 5 5 0 5 6 6 0 6 8 8 0 8 7 7 0 7 6 6 0 6 9 9 0 9 7 7 0 7 8 8 0 8 10 10 0 10 9 9 0 9 8 8 0 8 11 11 0 11 9 9 0 9 10 10 0 10 12 12 0 12 11 11 0 11 10 10 0 10 13 13 0 13 11 11 0 11 12 12 0 12 14 14 0 14 13 13 0 13 12 12 0 12 15 15 0 15 13 13 0 13 14 14 0 14 16 16 0 16 15 15 0 15 14 14 0 14 17 17 0 17 15 15 0 15 16 16 0 16 18 18 0 18 17 17 0 17 16 16 0 16 19 19 0 16 17 17 0 17 18 18 0 18 20 20 0 19 19 19 0 16 18 18 0 18 21 21 0 20 19 19 0 16 20 20 0 19 22 22 0 21 21 21 0 20 20 20 0 19 23 23 0 22 21 21 0 20 22 22 0 21 24 24 0 23 23 23 0 22 22 22 0 21 25 25 0 24 23 23 0 22 24 24 0 23 28 28 0 27 27 27 0 26 26 26 0 25 29 29 0 28 27 27 0 26 28 28 0 27 30 30 0 29 29 29 0 28 28 28 0 27 31 31 0 30 29 29 0 28 30 30 0 29 32 32 0 31 31 31 0 30 30 30 0 29 33 33 0 32 31 31 0 30 32 32 0 31 34 34 0 33 33 33 0 32 32 32 0 31 35 35 0 34 33 33 0 32 34 34 0 33 36 36 0 35 35 35 0 34 34 34 0 33 37 37 0 36 35 35 0 34 36 36 0 35 38 38 0 37 37 37 0 36 36 36 0 35 39 39 0 38 37 37 0 36 38 38 0 37 40 40 0 39 39 39 0 38 38 38 0 37 41 41 0 40 39 39 0 38 40 40 0 39 42 42 0 41 41 41 0 40 40 40 0 39 43 43 0 42 41 41 0 40 42 42 0 41 44 44 0 43 43 43 0 42 42 42 0 41 45 45 0 44 43 43 0 42 44 44 0 43 46 46 0 45 45 45 0 44 44 44 0 43 47 47 0 46 45 45 0 44 46 46 0 45 48 48 0 47 47 47 0 46 46 46 0 45 31 31 0 30 47 47 0 46 48 48 0 47 27 27 0 26 31 31 0 30 48 48 0 47 29 29 0 28 31 31 0 30 27 27 0 26 51 51 0 50 50 50 0 49 49 49 0 48 52 52 0 51 50 50 0 49 51 51 0 50 53 53 0 52 52 52 0 51 51 51 0 50 54 54 0 53 52 52 0 51 53 53 0 52 55 55 0 54 54 54 0 53 53 53 0 52 56 56 0 55 54 54 0 53 55 55 0 54 57 57 0 53 56 56 0 55 55 55 0 54 58 58 0 56 56 56 0 55 57 57 0 53 59 59 0 57 58 58 0 56 57 57 0 53 60 60 0 58 58 58 0 56 59 59 0 57 61 61 0 59 60 60 0 58 59 59 0 57 62 62 0 60 60 60 0 58 61 61 0 59 63 63 0 61 62 62 0 60 61 61 0 59 64 64 0 62 62 62 0 60 63 63 0 61 65 65 0 9 64 64 0 62 63 63 0 61 66 66 0 7 64 64 0 62 65 65 0 9 67 67 0 8 66 66 0 7 65 65 0 9 68 68 0 6 66 66 0 7 67 67 0 8 69 69 0 63 68 68 0 6 67 67 0 8 70 70 0 64 30 30 0 29 28 28 0 27 71 71 0 65 30 30 0 29 70 70 0 64 72 72 0 66 71 71 0 65 70 70 0 64 73 73 0 67 71 71 0 65 72 72 0 66 74 74 0 68 73 73 0 67 72 72 0 66 36 36 0 35 73 73 0 67 74 74 0 68 75 75 0 69 36 36 0 35 74 74 0 68 38 38 0 37 36 36 0 35 75 75 0 69 76 76 0 70 38 38 0 37 75 75 0 69 77 77 0 71 38 38 0 37 76 76 0 70 78 78 0 72 77 77 0 71 76 76 0 70 40 40 0 39 77 77 0 71 78 78 0 72 42 42 0 41 40 40 0 39 78 78 0 72 79 79 0 73 10 10 0 10 8 8 0 8 80 80 0 74 10 10 0 10 79 79 0 73 81 81 0 22 80 80 0 74 79 79 0 73 82 82 0 20 80 80 0 74 81 81 0 22 83 83 0 21 82 82 0 20 81 81 0 22 84 84 0 19 82 82 0 20 83 83 0 21 85 85 0 75 84 84 0 19 83 83 0 21 86 86 0 76 84 84 0 19 85 85 0 75 87 87 0 77 86 86 0 76 85 85 0 75 88 88 0 75 86 86 0 76 87 87 0 77 89 89 0 78 88 88 0 75 87 87 0 77 24 24 0 23 88 88 0 75 89 89 0 78 15 15 0 15 90 90 0 79 13 13 0 13 91 91 0 80 90 90 0 79 15 15 0 15 17 17 0 17 91 91 0 80 15 15 0 15 92 92 0 15 91 91 0 80 17 17 0 17 19 19 0 16 92 92 0 15 17 17 0 17 93 93 0 14 92 92 0 15 19 19 0 16 21 21 0 20 93 93 0 14 19 19 0 16 94 94 0 74 93 93 0 14 21 21 0 20 23 23 0 22 94 94 0 74 21 21 0 20 95 95 0 73 94 94 0 74 23 23 0 22 25 25 0 24 95 95 0 73 23 23 0 22 96 96 0 81 95 95 0 73 25 25 0 24 80 80 0 74 12 12 0 12 10 10 0 10 14 14 0 14 12 12 0 12 80 80 0 74 82 82 0 20 14 14 0 14 80 80 0 74 16 16 0 16 14 14 0 14 82 82 0 20 84 84 0 19 16 16 0 16 82 82 0 20 18 18 0 18 16 16 0 16 84 84 0 19 86 86 0 76 18 18 0 18 84 84 0 19 20 20 0 19 18 18 0 18 86 86 0 76 88 88 0 75 20 20 0 19 86 86 0 76 22 22 0 21 20 20 0 19 88 88 0 75 24 24 0 23 22 22 0 21 88 88 0 75 99 99 0 59 98 98 0 61 97 97 0 82 100 100 0 60 98 98 0 61 99 99 0 59 101 101 0 58 100 100 0 60 99 99 0 59 102 102 0 83 100 100 0 60 101 101 0 58 103 103 0 84 102 102 0 83 101 101 0 58 1 1 0 1 102 102 0 83 103 103 0 84 104 104 0 85 1 1 0 1 103 103 0 84 0 0 0 0 1 1 0 1 104 104 0 85 105 105 0 86 0 0 0 0 104 104 0 85 92 92 0 15 106 106 0 79 91 91 0 80 107 107 0 13 106 106 0 79 92 92 0 15 93 93 0 14 107 107 0 13 92 92 0 15 108 108 0 12 107 107 0 13 93 93 0 14 94 94 0 74 108 108 0 12 93 93 0 14 109 109 0 10 108 108 0 12 94 94 0 74 95 95 0 73 109 109 0 10 94 94 0 74 67 67 0 8 109 109 0 10 95 95 0 73 69 69 0 63 67 67 0 8 95 95 0 73 50 50 0 49 97 97 0 82 49 49 0 48 99 99 0 59 97 97 0 82 50 50 0 49 52 52 0 51 99 99 0 59 50 50 0 49 110 110 0 57 99 99 0 59 52 52 0 51 54 54 0 53 110 110 0 57 52 52 0 51 58 58 0 56 110 110 0 57 54 54 0 53 56 56 0 55 58 58 0 56 54 54 0 53 78 78 0 72 44 44 0 43 42 42 0 41 111 111 0 87 44 44 0 43 78 78 0 72 112 112 0 88 111 111 0 87 78 78 0 72 113 113 0 89 111 111 0 87 112 112 0 88 114 114 0 90 113 113 0 89 112 112 0 88 115 115 0 91 113 113 0 89 114 114 0 90 116 116 0 92 115 115 0 91 114 114 0 90 117 117 0 52 57 57 0 53 55 55 0 54 118 118 0 51 57 57 0 53 117 117 0 52 119 119 0 50 118 118 0 51 117 117 0 52 120 120 0 49 118 118 0 51 119 119 0 50 121 121 0 48 120 120 0 49 119 119 0 50 122 122 0 82 120 120 0 49 121 121 0 48 123 125 0 95 26 124 0 94 115 123 0 93 124 126 0 96 26 124 0 94 123 125 0 95 125 127 0 97 124 126 0 96 123 125 0 95 126 128 0 98 124 126 0 96 125 127 0 97 90 90 0 99 126 128 0 98 125 127 0 97 91 91 0 100 126 128 0 98 90 90 0 99 3 3 0 3 102 102 0 83 1 1 0 1 127 129 0 101 102 102 0 83 3 3 0 3 5 5 0 5 127 129 0 101 3 3 0 3 128 130 0 62 127 129 0 101 5 5 0 5 7 7 0 7 128 130 0 62 5 5 0 5 9 9 0 9 128 130 0 62 7 7 0 7 129 131 0 23 83 83 0 21 81 81 0 22 85 85 0 75 83 83 0 21 129 131 0 23 130 132 0 78 85 85 0 75 129 131 0 23 87 87 0 77 85 85 0 75 130 132 0 78 131 133 0 102 87 87 0 77 130 132 0 78 89 89 0 78 87 87 0 77 131 133 0 102 104 104 0 85 132 134 0 0 105 105 0 86 133 135 0 1 132 134 0 0 104 104 0 85 134 136 0 84 133 135 0 1 104 104 0 85 135 137 0 83 133 135 0 1 134 136 0 84 60 60 0 58 135 137 0 83 134 136 0 84 62 62 0 60 135 137 0 83 60 60 0 58 133 135 0 1 136 138 0 2 132 134 0 0 137 139 0 3 136 138 0 2 133 135 0 1 135 137 0 83 137 139 0 3 133 135 0 1 138 140 0 101 137 139 0 3 135 137 0 83 62 62 0 60 138 140 0 101 135 137 0 83 64 64 0 62 138 140 0 101 62 62 0 60 76 76 0 70 112 112 0 88 78 78 0 72 114 114 0 90 112 112 0 88 76 76 0 70 139 141 0 103 114 114 0 90 76 76 0 70 116 116 0 92 114 114 0 90 139 141 0 103 74 74 0 68 116 116 0 92 139 141 0 103 72 72 0 66 116 116 0 92 74 74 0 68 107 107 0 13 121 121 0 104 106 106 0 79 122 122 0 105 121 121 0 104 107 107 0 13 140 142 0 11 122 122 0 105 107 107 0 13 63 63 0 61 122 122 0 105 140 142 0 11 65 65 0 9 63 63 0 61 140 142 0 11 125 127 0 97 49 49 0 106 90 90 0 99 51 51 0 107 49 49 0 106 125 127 0 97 123 125 0 95 51 51 0 107 125 127 0 97 116 143 0 108 51 51 0 107 123 125 0 95 115 123 0 93 116 143 0 108 123 125 0 95 47 47 0 46 43 43 0 42 45 45 0 44 141 144 0 109 43 43 0 42 47 47 0 46 142 145 0 110 141 144 0 109 47 47 0 46 33 33 0 32 141 144 0 109 142 145 0 110 31 31 0 30 33 33 0 32 142 145 0 110 39 39 0 38 35 35 0 34 37 37 0 36 143 146 0 111 35 35 0 34 39 39 0 38 41 41 0 40 143 146 0 111 39 39 0 38 141 144 0 109 143 146 0 111 41 41 0 40 43 43 0 42 141 144 0 109 41 41 0 40 26 26 0 25 113 113 0 89 115 115 0 91 144 147 0 112 113 113 0 89 26 26 0 25 27 27 0 26 144 147 0 112 26 26 0 25 46 46 0 45 144 147 0 112 27 27 0 26 48 48 0 47 46 46 0 45 27 27 0 26 145 148 0 113 101 101 0 58 58 58 0 56 103 103 0 84 101 101 0 58 145 148 0 113 146 149 0 114 103 103 0 84 145 148 0 113 104 104 0 85 103 103 0 84 146 149 0 114 134 136 0 84 104 104 0 85 146 149 0 114 11 11 0 11 98 98 0 61 9 9 0 9 97 97 0 105 98 98 0 61 11 11 0 11 13 13 0 13 97 97 0 105 11 11 0 11 49 49 0 104 97 97 0 105 13 13 0 13 90 90 0 79 49 49 0 104 13 13 0 13 72 150 0 115 55 55 0 54 53 53 0 52 117 117 0 52 55 55 0 54 72 150 0 115 70 151 0 116 117 117 0 52 72 150 0 115 119 119 0 50 117 117 0 52 70 151 0 116 118 118 0 51 59 59 0 57 57 57 0 53 61 61 0 59 59 59 0 57 118 118 0 51 120 120 0 49 61 61 0 59 118 118 0 51 122 122 0 82 61 61 0 59 120 120 0 49 137 139 0 3 147 152 0 4 136 138 0 2 148 153 0 5 147 152 0 4 137 139 0 3 138 140 0 101 148 153 0 5 137 139 0 3 64 64 0 62 148 153 0 5 138 140 0 101 149 154 0 63 8 8 0 8 6 6 0 6 79 79 0 73 8 8 0 8 149 154 0 63 150 155 0 81 79 79 0 73 149 154 0 63 151 156 0 24 79 79 0 73 150 155 0 81 106 106 0 99 126 128 0 98 91 91 0 100 152 157 0 97 126 128 0 98 106 106 0 99 121 121 0 106 152 157 0 97 106 106 0 99 119 119 0 107 152 157 0 97 121 121 0 106 152 157 0 97 124 126 0 96 126 128 0 98 153 158 0 95 124 126 0 96 152 157 0 97 119 119 0 107 153 158 0 95 152 157 0 97 70 151 0 108 153 158 0 95 119 119 0 107 71 71 0 65 32 32 0 31 30 30 0 29 34 34 0 33 32 32 0 31 71 71 0 65 36 36 0 35 34 34 0 33 71 71 0 65 154 159 0 119 130 132 0 118 129 131 0 117 131 133 0 120 130 132 0 118 154 159 0 119 89 89 0 118 131 133 0 120 154 159 0 119 154 159 0 119 24 24 0 117 89 89 0 118 25 25 0 121 24 24 0 117 154 159 0 119 96 96 0 122 25 25 0 121 154 159 0 119 154 159 0 119 69 69 0 123 96 96 0 122 68 68 0 124 69 69 0 123 154 159 0 119 147 152 0 125 68 68 0 124 154 159 0 119 116 143 0 116 53 53 0 52 51 51 0 50 72 150 0 115 53 53 0 52 116 143 0 116 110 110 0 57 101 101 0 58 99 99 0 59 58 58 0 56 101 101 0 58 110 110 0 57 127 129 0 101 100 100 0 60 102 102 0 83 128 130 0 62 100 100 0 60 127 129 0 101 128 130 0 62 98 98 0 61 100 100 0 60 9 9 0 9 98 98 0 61 128 130 0 62 28 160 0 93 153 158 0 95 70 151 0 108 26 124 0 94 153 158 0 95 28 160 0 93 151 156 0 24 81 81 0 22 79 79 0 73 129 131 0 23 81 81 0 22 151 156 0 24 66 66 0 7 148 153 0 5 64 64 0 62 68 68 0 6 148 153 0 5 66 66 0 7 33 33 0 32 143 146 0 111 141 144 0 109 35 35 0 34 143 146 0 111 33 33 0 32 109 109 0 10 65 65 0 9 140 142 0 11 67 67 0 8 65 65 0 9 109 109 0 10 108 108 0 12 140 142 0 11 107 107 0 13 109 109 0 10 140 142 0 11 108 108 0 12 111 111 0 87 46 46 0 45 44 44 0 43 113 113 0 89 46 46 0 45 111 111 0 87 76 76 0 70 74 74 0 68 139 141 0 103 75 75 0 69 74 74 0 68 76 76 0 70 60 60 0 58 145 148 0 113 58 58 0 56 134 136 0 84 145 148 0 113 60 60 0 58 151 156 0 121 154 159 0 119 129 131 0 117 150 155 0 122 154 159 0 119 151 156 0 121 149 154 0 123 154 159 0 119 150 155 0 122 6 6 0 124 154 159 0 119 149 154 0 123 4 4 0 125 154 159 0 119 6 6 0 124 2 2 0 126 154 159 0 119 4 4 0 125 0 0 0 127 154 159 0 119 2 2 0 126 105 105 0 128 154 159 0 119 0 0 0 127 132 134 0 127 154 159 0 119 105 105 0 128 136 138 0 126 154 159 0 119 132 134 0 127 63 63 0 61 61 61 0 59 122 122 0 82 96 96 0 81 69 69 0 63 95 95 0 73 68 68 0 6 147 152 0 4 148 153 0 5 124 126 0 96 153 158 0 95 26 124 0 94 77 77 0 71 40 40 0 39 38 38 0 37 36 36 0 35 71 71 0 65 73 73 0 67 46 46 0 45 113 113 0 89 144 147 0 112 142 145 0 110 47 47 0 46 31 31 0 30 134 136 0 84 146 149 0 114 145 148 0 113 147 152 0 125 154 159 0 119 136 138 0 126</p>
				</triangles>
			</mesh>
		</geometry>
	</library_geometries>
	<library_controllers>
		<controller id="polygon0_Controller">
			<skin source="#polygon0">
				<bind_shape_matrix>1 0 0 0 0 1 0 0 0 0 1 0 0 0 0 1</bind_shape_matrix>
				<source id="polygon0_Joints">
					<Name_array id="polygon0_JointArr" count="5">TopN AttachN CapJa CapJb CapJc</Name_array>
					<technique_common>
						<accessor source="#polygon0_JointArr" count="5">
							<param name="JOINT" type="Name" />
						</accessor>
					</technique_common>
				</source>
				<source id="polygon0_Matrices">
					<float_array id="polygon0_MatArr" count="80">1 0 0 0 0 1 0 0 0 0 1 0 0 0 0 1 1 0 0 0 0 1 0 0 0 0 1 0 0 0 0 1 0 0.5723134 -0.820088 1.132473 0 0.820088 0.5723134 3.708407 1 0 0 0 0 0 0 1 0 0.1072916 -0.9943463 -2.179002 0 0.9943463 0.1072916 3.034693 1 0 0 0 0 0 0 1 0 0.1072916 -0.9943463 -5.781626 0 0.9943463 0.1072916 3.034693 1 0 0 0 0 0 0 1</float_array>
					<technique_common>
						<accessor source="#polygon0_MatArr" count="5" stride="16">
							<param type="float4x4" />
						</accessor>
					</technique_common>
				</source>
				<source id="polygon0_Weights">
					<float_array id="polygon0_WeightArr" count="4">1 0.9 0.099999994 0.5</float_array>
					<technique_common>
						<accessor source="#polygon0_WeightArr" count="4">
							<param type="float" />
						</accessor>
					</technique_common>
				</source>
				<joints>
					<input semantic="JOINT" source="#polygon0_Joints" />
					<input semantic="INV_BIND_MATRIX" source="#polygon0_Matrices" />
				</joints>
				<vertex_weights count="155">
					<input semantic="JOINT" offset="0" source="#polygon0_Joints" />
					<input semantic="WEIGHT" offset="1" source="#polygon0_Weights" />
					<vcount>1 2 1 2 1 2 1 2 2 2 2 2 2 2 2 2 2 2 2 2 2 2 2 2 1 1 1 1 1 1 1 1 1 1 1 1 1 1 1 1 1 1 1 1 1 1 1 1 1 2 2 2 2 2 2 2 2 2 2 2 2 2 2 2 2 2 2 2 1 1 1 1 1 1 1 1 1 1 1 2 2 2 2 2 2 2 2 2 2 1 2 2 2 2 2 2 1 2 2 2 2 2 2 2 2 1 2 2 2 2 2 1 1 1 1 1 1 2 2 2 2 2 2 2 2 2 2 2 2 1 1 1 1 2 2 2 1 2 2 1 2 1 1 1 1 2 2 1 2 1 1 1 2 2 1</vcount>
					<v>2 0 2 1 3 2 2 0 2 1 3 2 2 0 2 1 3 2 2 0 2 1 3 2 2 1 3 2 2 1 3 2 2 1 3 2 2 3 3 3 2 3 3 3 3 1 2 2 2 3 3 3 3 1 2 2 2 3 3 3 3 1 2 2 2 3 3 3 2 3 3 3 2 1 3 2 2 1 3 2 2 1 3 2 2 1 3 2 2 0 2 0 4 0 4 0 4 0 4 0 4 0 4 0 4 0 4 0 4 0 4 0 4 0 4 0 4 0 4 0 4 0 4 0 4 0 4 0 4 0 4 0 4 0 4 0 4 0 3 1 4 2 3 1 4 2 3 3 4 3 3 1 4 2 3 3 4 3 3 1 4 2 3 3 4 3 3 1 4 2 3 1 4 2 3 1 2 2 3 1 2 2 2 3 3 3 3 1 2 2 2 3 3 3 2 3 3 3 2 1 3 2 2 1 3 2 2 1 3 2 2 1 3 2 2 0 2 0 4 0 4 0 4 0 4 0 4 0 4 0 4 0 4 0 4 0 2 1 3 2 2 1 3 2 2 1 3 2 2 1 3 2 2 1 3 2 2 1 3 2 2 1 3 2 2 1 3 2 2 1 3 2 2 1 3 2 2 0 3 1 4 2 3 1 4 2 3 1 2 2 2 3 3 3 2 1 3 2 2 1 3 2 2 0 3 1 2 2 2 3 3 3 3 1 2 2 2 3 3 3 2 3 3 3 2 1 3 2 2 1 3 2 2 1 3 2 2 0 3 1 4 2 3 1 2 2 2 3 3 3 2 1 3 2 3 1 2 2 4 0 4 0 4 0 4 0 4 0 4 0 3 3 4 3 3 1 4 2 3 3 4 3 3 1 4 2 3 1 4 2 3 1 2 2 4 1 3 2 3 3 4 3 3 3 4 3 3 3 4 3 2 1 3 2 2 1 3 2 2 0 2 0 2 0 2 0 2 1 3 2 2 1 3 2 2 1 3 2 2 0 2 1 3 2 2 1 3 2 4 0 2 3 3 3 4 0 4 0 4 0 4 0 2 3 3 3 2 1 3 2 2 0 2 1 3 2 2 0 2 0 2 0 3 3 4 3 4 1 3 2 2 0</v>
				</vertex_weights>
			</skin>
		</controller>
	</library_controllers>
	<library_visual_scenes>
		<visual_scene id="RootNode" name="RootNode">
			<node id="TopN" name="TopN" sid="TopN" type="JOINT">
				<translate>0 5 0</translate>
				<rotate>0 0 1 17.246</rotate>
				<rotate>0 1 0 19.753</rotate>
				<rotate>1 0 0 -1.386</rotate>
				<node id="AttachN" name="AttachN" sid="AttachN" type="JOINT">
					<translate>0 5.5 -1</translate>
					<node id="CapJa" name="CapJa" sid="CapJa" type="JOINT">
						<translate>0 -3.689029 -1.19354</translate>
						<rotate>0 0 1 90</rotate>
						<rotate>0 1 0 55.09003</rotate>
						<rotate>1 0 0 90</rotate>
						<node id="CapJb" name="CapJb" sid="CapJb" type="JOINT">
							<translate>1.583079 0 0</translate>
							<rotate>0 0 1 -28.75148</rotate>
							<node id="CapJc" name="CapJc" sid="CapJc" type="JOINT">
								<translate>3.602625 0 0</translate>
								<rotate>0 0 1 2E-06</rotate>
							</node>
						</node>
					</node>
				</node>
			</node>
			<node id="polygon0" name="polygon0" type="NODE">
				<instance_controller url="#polygon0_Controller">
					<skeleton>#TopN</skeleton>
					<bind_material>
						<technique_common>
							<instance_material symbol="PCap" target="#PCap">
								<bind_vertex_input semantic="TEXCOORD0" input_semantic="TEXCOORD" input_set="0" />
							</instance_material>
						</technique_common>
					</bind_material>
				</instance_controller>
			</node>
		</visual_scene>
	</library_visual_scenes>
	<scene>
		<instance_visual_scene url="#RootNode" />
	</scene>
</COLLADA>