Model scale: 
X: 0.200
Y: 0.200
Z: 0.200

Left eye iris location:
X: 0.150
Y: 0.000
Z: 0.000

Left eye highlight location: 
X: 0.100
Y: 0.000
Z: 0.000

Right eye iris location:
X: 0.150
Y: 0.000
Z: 0.000 

Right eye highlight location: 
X: 0.150
Y: 0.000
Z: 0.000