Model scale: 
X: 0.1397
Y: 0.1397
Z: 0.1397

Left eye iris location:
X: 0.000
Y: 0.000
Z: 0.000

Right eye iris location:
X: 0.000
Y: 0.000
Z: 0.000 

Edited vertex of "Bling" object in Armature to prevent clipping with mouth.

Edited shell to be hidden from being visible in the arm socket.