<?xml version="1.0" encoding="utf-8"?>
<COLLADA version="1.5.0" xmlns="http://www.collada.org/2008/03/COLLADASchema">
	<asset>
		<contributor>
			<authoring_tool>BrawlBox</authoring_tool>
		</contributor>
		<created>2017-10-21T19:59:44Z</created>
		<modified>2017-10-21T19:59:44Z</modified>
		<unit meter="0.01" name="centimeter" />
		<up_axis>Y_UP</up_axis>
	</asset>
	<library_images>
		<image id="MarioPill1-image" name="MarioPill1">
			<init_from>
				<ref>MarioPill1.png</ref>
			</init_from>
		</image>
	</library_images>
	<library_materials>
		<material id="WpnMarioPill">
			<instance_effect url="#WpnMarioPill-fx" />
		</material>
	</library_materials>
	<library_effects>
		<effect id="WpnMarioPill-fx" name="WpnMarioPill">
			<profile_COMMON>
				<newparam sid="MarioPill1-surface">
					<surface type="2D">
						<init_from>
							<ref>MarioPill1-image</ref>
						</init_from>
					</surface>
				</newparam>
				<newparam sid="MarioPill1-sampler">
					<sampler2D>
						<source>MarioPill1-surface</source>
						<instance_image url="#MarioPill1-image" />
						<wrap_s>CLAMP</wrap_s>
						<wrap_t>CLAMP</wrap_t>
						<minfilter>LINEAR_MIPMAP_NEAREST</minfilter>
						<magfilter>LINEAR</magfilter>
					</sampler2D>
				</newparam>
				<technique sid="COMMON">
					<phong>
						<diffuse>
							<texture texture="MarioPill1-sampler" texcoord="TEXCOORD0" />
						</diffuse>
					</phong>
				</technique>
			</profile_COMMON>
		</effect>
	</library_effects>
	<library_geometries>
		<geometry id="polygon0" name="polygon0">
			<mesh>
				<source id="polygon0_Positions">
					<float_array id="polygon0_PosArr" count="441">2.851583 3.774011 -2.539299 2.86513 3.80265 -2.281759 2.962272 3.717348 -2.311625 2.931458 3.888969 -2.04627 3.116198 3.726736 -2.102889 3.044008 4.024448 -1.855808 3.298272 3.80116 -1.933736 3.191785 4.195856 -1.728974 3.490668 3.933392 -1.820716 3.674648 4.110503 -1.774756 3.916412 3.909833 -2.067197 5.106174 5.239898 -1.996283 5.210696 5.168265 -2.406373 5.251848 5.454328 -2.0076 5.351242 5.386213 -2.39762 5.333097 5.694842 -2.060766 5.417567 5.636973 -2.392575 5.341931 5.938042 -2.150645 5.146215 6.339237 -2.402532 5.105697 6.307435 -2.148214 5.012176 6.393162 -2.187069 5.015044 6.218262 -1.922082 4.837173 6.381301 -1.995797 4.883191 6.080517 -1.746187 4.638379 6.304914 -1.847645 4.723015 5.907656 -1.637708 4.435257 6.171424 -1.757107 4.550146 5.716537 -1.607362 4.247581 5.99388 -1.732924 3.057819 4.663815 -1.803837 2.847996 4.868232 -2.117569 2.704457 4.654052 -2.146775 2.646555 4.727036 -2.54421 2.629401 4.414266 -2.211146 2.58023 4.476276 -2.549256 2.630219 4.172197 -2.304447 5.202838 6.222132 -2.17808 5.277503 6.160158 -2.268396 5.403303 5.895998 -2.391725 5.368397 5.698983 -2.730685 5.29334 5.459197 -2.795056 5.09377 5.653625 -3.093457 4.939978 5.449434 -3.137993 4.637414 5.726776 -3.263555 3.750216 4.119369 -3.208907 3.447652 4.396711 -3.334469 3.56254 3.941824 -3.184723 3.274783 4.205593 -3.304123 3.114606 4.032732 -3.195644 2.77161 3.888377 -2.320614 2.706809 3.951508 -2.417505 2.594494 4.217251 -2.550105 2.6647 4.418407 -2.881064 2.74595 4.658921 -2.934231 2.9759 4.468057 -3.212381 2.891624 4.873351 -2.945547 3.133388 4.672681 -3.237988 4.081386 6.203416 -2.874634 4.32315 6.002746 -3.167075 4.50713 6.179857 -3.121115 4.806013 5.917393 -3.212857 4.95379 6.0888 -3.086023 5.149802 5.245017 -2.824262 4.020934 3.838201 -2.477287 3.720617 3.742528 -2.098866 3.493914 3.638773 -2.170388 3.258346 3.60875 -2.274833 3.036937 3.655374 -2.401941 2.787101 4.944983 -2.535458 4.037758 6.198297 -2.046655 4.235687 6.365852 -2.055508 4.468585 6.470335 -2.101525 4.713805 6.50149 -2.180259 4.947375 6.456293 -2.283961 3.960039 3.914952 -2.895175 3.820012 3.674412 -2.488886 3.578383 3.580904 -2.502196 3.319717 3.566705 -2.515913 3.069278 3.633203 -2.528699 3.976863 6.275048 -2.464544 4.177785 6.438837 -2.452945 4.419414 6.532345 -2.439635 4.67808 6.546544 -2.425917 4.928519 6.480046 -2.413132 3.360384 4.386473 -1.678275 4.86441 5.440567 -1.703842 5.021898 5.645192 -1.72945 5.137455 5.857229 -1.824115 5.199784 6.056028 -1.978701 3.76211 3.747396 -2.886322 3.529213 3.642915 -2.840306 3.283993 3.611759 -2.761572 3.050423 3.656956 -2.65787 4.27718 6.370721 -2.842964 4.503884 6.474476 -2.771443 4.739452 6.504499 -2.666998 4.96086 6.457875 -2.53989 5.198602 5.864403 -2.984565 5.244211 6.06124 -2.821846 5.066339 6.22428 -2.895561 5.226188 6.224872 -2.621217 5.132667 6.310599 -2.660072 2.860342 4.25602 -3.117715 2.798013 4.057221 -2.96313 2.982753 3.894987 -3.019749 2.794959 3.891117 -2.763751 2.892101 3.805814 -2.793617 3.359418 3.808334 -3.094186 3.160625 3.731948 -2.946034 2.985622 3.720087 -2.754761 2.904027 4.459624 -1.848374 2.799196 4.248846 -1.957266 2.753587 4.052009 -2.119985 4.699525 6.312088 -3.008094 4.881599 6.386513 -2.838941 5.035525 6.395901 -2.630206 5.367579 5.941051 -2.637384 5.290989 6.16174 -2.524325 2.655866 4.175207 -2.791186 2.720294 3.95309 -2.673434 5.309844 6.137987 -2.395154 2.687953 3.975262 -2.546677 3.998899 5.056624 -2.470915 3.998899 5.056624 -2.470915 3.998899 5.056624 -2.470915 3.998899 5.056624 -2.470915 3.998899 5.056624 -2.470915 3.998899 5.056624 -2.470915 3.998899 5.056624 -2.470915 3.998899 5.056624 -2.470915 3.998899 5.056624 -2.470915 3.998899 5.056624 -2.470915 3.998899 5.056624 -2.470915 3.998899 5.056624 -2.470915 3.998899 5.056624 -2.470915 3.998899 5.056624 -2.470915 3.998899 5.056624 -2.470915 3.998899 5.056624 -2.470915 3.998899 5.056624 -2.470915 3.998899 5.056624 -2.470915 3.998899 5.056624 -2.470915 3.998899 5.056624 -2.470915 3.998899 5.056624 -2.470915 3.998899 5.056624 -2.470915 3.998899 5.056624 -2.470915 3.998899 5.056624 -2.470915 3.998899 5.056624 -2.470915</float_array>
					<technique_common>
						<accessor source="#polygon0_PosArr" count="147" stride="3">
							<param name="X" type="float" />
							<param name="Y" type="float" />
							<param name="Z" type="float" />
						</accessor>
					</technique_common>
				</source>
				<source id="polygon0_Normals">
					<float_array id="polygon0_NormArr" count="438">-0.3237621 -0.3619416 -0.01929723 -0.315863 -0.3452165 0.1313802 -0.259042 -0.3951147 0.1139555 -0.2771018 -0.2947566 0.2693072 -0.1689473 -0.3897351 0.2361591 -0.2111906 -0.2154067 0.3810398 -0.06224564 -0.3462044 0.3353534 -0.1245248 -0.1148774 0.4555292 0.05063928 -0.2686988 0.4017844 0.1327344 -0.192666 0.4259774 0.2739839 -0.3099064 0.25512 0.3248088 -0.2530879 0.2581493 0.3858395 -0.294904 0.01850753 0.3857821 -0.1564776 0.2507607 0.4440176 -0.1963832 0.02218212 0.433333 -0.01532137 0.2195031 0.4828415 -0.04924465 0.02513745 0.4384245 0.1272014 0.1667679 0.3237621 0.3619416 0.01929723 0.3000832 0.3433651 0.1680925 0.2453755 0.3935113 0.1454097 0.2470749 0.2912337 0.3005498 0.142941 0.3866839 0.2573931 0.1698384 0.2105551 0.4037503 0.02643436 0.3420028 0.3442807 0.0758899 0.1091712 0.4674745 -0.09275624 0.2637573 0.3975202 -8.027273E-05 0.02541829 0.4853214 -0.1768897 0.1874855 0.4120128 -0.2277147 0.130667 0.4089835 -0.3503031 0.2500967 0.2256871 -0.4100996 0.1536245 0.2107412 -0.4440176 0.1963832 -0.02218212 -0.4540107 0.01289536 0.1729216 -0.4828415 0.04924465 -0.02513745 -0.4534395 -0.128963 0.1181902 0.3569042 0.2934669 0.1506679 0.4006401 0.2571651 0.09776439 0.4743548 0.1025861 0.0256289 0.4540107 -0.01289536 -0.1729216 0.4100798 -0.1536466 -0.2107423 0.2931512 -0.03973086 -0.3855761 0.2277147 -0.130667 -0.4089835 0.05090522 0.03140018 -0.4822921 0.1768897 -0.1874855 -0.4120128 8.027273E-05 -0.02541829 -0.4853214 0.09277601 -0.2637353 -0.3975191 -0.0758899 -0.1091712 -0.4674745 -0.1698384 -0.2105551 -0.4037503 -0.3705707 -0.2950703 0.1086974 -0.4085284 -0.2580906 0.05194231 -0.4743548 -0.1025861 -0.0256289 -0.433333 0.01532137 -0.2195031 -0.3857821 0.1564776 -0.2507607 -0.251054 0.04465015 -0.4137297 -0.3248088 0.2530879 -0.2581493 -0.1835593 0.1358475 -0.4290067 -0.2739839 0.3099064 -0.25512 -0.1327344 0.192666 -0.4259774 -0.05063928 0.2686988 -0.4017844 0.1245248 0.1148774 -0.4555292 0.2111906 0.2154067 -0.3810398 0.3503031 -0.2500967 -0.2256871 0.3350145 -0.3517224 0.0154782 0.1853674 -0.3805262 0.2388153 0.05230398 -0.4412832 0.1967926 -0.08575231 -0.4587888 0.1355254 -0.2153062 -0.4314165 0.06105206 -0.3858395 0.294904 -0.01850753 -0.2994782 0.3069152 0.2287164 -0.2096849 0.3776731 0.2226865 -0.07298163 0.4388572 0.1956321 0.07073729 0.4570272 0.1494328 0.2074178 0.4304909 0.08865464 0.2994782 -0.3069152 -0.2287164 0.2436029 -0.4204318 0.01023677 0.1018125 -0.4752065 0.002426927 -0.04982197 -0.4834041 -0.005613674 -0.1964224 -0.444355 -0.01309694 -0.3350145 0.3517224 -0.0154782 -0.2436029 0.4204318 -0.01023677 -0.1018125 0.4752065 -0.002426927 0.04982197 0.4834041 0.005613674 0.1964224 0.444355 0.01309694 -0.05090522 -0.03140018 0.4822921 0.1835593 -0.1358475 0.4290067 0.251054 -0.04465015 0.4137297 0.3187834 0.07975745 0.3580639 0.3552295 0.1962551 0.2674017 0.2097046 -0.377651 -0.2226853 0.07298163 -0.4388572 -0.1956321 -0.07073729 -0.4570272 -0.1494328 -0.2074178 -0.4304909 -0.08865464 -0.1853674 0.3805262 -0.2388153 -0.05230398 0.4412832 -0.1967926 0.08575231 0.4587888 -0.1355254 0.2153062 0.4314165 -0.06105206 0.3545947 0.08395902 -0.3215701 0.3812357 0.1993063 -0.2261505 0.2771018 0.2947566 -0.2693072 0.3705707 0.2950703 -0.1086974 0.315863 0.3452165 -0.1313802 -0.3187834 -0.07975745 -0.3580639 -0.3552295 -0.1962551 -0.2674017 -0.2470749 -0.2912337 -0.3005498 -0.3569042 -0.2934669 -0.1506679 -0.3000832 -0.3433651 -0.1680925 -0.02643436 -0.3420028 -0.3442807 -0.142941 -0.3866839 -0.2573931 -0.2453755 -0.3935113 -0.1454097 -0.293171 0.03970877 0.3855749 -0.3545947 -0.08395902 0.3215701 -0.3812357 -0.1993063 0.2261505 0.06224564 0.3462044 -0.3353534 0.1689473 0.3897351 -0.2361591 0.259042 0.3951147 -0.1139555 0.4534395 0.128963 -0.1181902 0.4085284 0.2580906 -0.05194231 -0.4384245 -0.1272014 -0.1667679 -0.4006401 -0.2571651 -0.09776439 0.4195239 0.2442266 0.02361539 -0.4195239 -0.2442266 -0.02361539 -0.3259006 0.2793724 0.2278965 -0.4259439 0.1171302 0.2025812 -0.3615524 0.3243228 -0.01704593 -0.4588226 0.1585782 -0.02319594 -0.3003283 0.2823727 -0.257421 -0.4023724 0.1198957 -0.2447616 -0.1586298 0.1647597 -0.4288214 -0.2717793 0.01150035 -0.4027289 0.02557235 0.003000284 -0.4853175 -0.1019892 -0.1376017 -0.4548266 0.2029226 -0.159563 -0.4117755 0.06148276 -0.2874451 -0.3870168 0.3259006 -0.2793724 -0.2278965 0.1748227 -0.3978647 -0.2175488 0.3615524 -0.3243228 0.01704593 0.2077015 -0.4393127 0.00822833 0.3003283 -0.2823727 0.257421 0.1512513 -0.4006302 0.229794 0.1586298 -0.1647597 0.4288214 0.02065815 -0.2922349 0.3877613 -0.02557235 -0.003000284 0.4853175 -0.1491319 -0.1431328 0.439859 -0.2029226 0.159563 0.4117755 -0.3126039 0.006710589 0.3720492</float_array>
					<technique_common>
						<accessor source="#polygon0_NormArr" count="146" stride="3">
							<param name="X" type="float" />
							<param name="Y" type="float" />
							<param name="Z" type="float" />
						</accessor>
					</technique_common>
				</source>
				<source id="polygon0_Colors0">
					<float_array id="polygon0_ColorArr0" count="4">0.5019608 0.5019608 0.5019608 1</float_array>
					<technique_common>
						<accessor source="#polygon0_ColorArr0" count="1" stride="4">
							<param name="R" type="float" />
							<param name="G" type="float" />
							<param name="B" type="float" />
							<param name="A" type="float" />
						</accessor>
					</technique_common>
				</source>
				<source id="polygon0_UVs0">
					<float_array id="polygon0_UVArr0" count="248">0.5 0.3795471 0.005249023 0.3881226 0.1702881 0.3881226 0.005249023 0.4090271 0.1702881 0.4090271 0.005249023 0.4416199 0.1702881 0.4416199 0.005249023 0.4826965 0.1702881 0.4826965 0.1702881 0.5282288 0.3478088 0.5282288 0.3478088 0.84552 0.5 0.84552 0.3478088 0.8910217 0.5 0.8910217 0.3478088 0.9320984 0.5 0.9320984 0.3478088 0.9646912 0.5 0.9973145 0.9961548 0.9856262 0.8404846 0.9856262 0.9961548 0.9646912 0.8404846 0.9646912 0.9961548 0.9320984 0.8404846 0.9320984 0.9961548 0.8910217 0.8404846 0.8910217 0.9961548 0.84552 0.8404846 0.84552 0.8404846 0.5282288 0.6682434 0.5282288 0.6682434 0.4826965 0.5 0.4826965 0.6682434 0.4416199 0.5 0.4416199 0.6682434 0.4090271 0.005249023 0.9856262 0.1702881 0.9856262 0.3480225 0.9856262 0.5 0.9646912 0.6679382 0.9320984 0.6679382 0.8910217 0.8401489 0.8910217 0.8401489 0.84552 0.8401489 0.5282288 0.9961548 0.5282288 0.8401489 0.4826965 0.9961548 0.4826965 0.9961548 0.4416199 0.9961548 0.3881226 0.8404846 0.3881226 0.6682434 0.3881226 0.5 0.4090271 0.348114 0.4416199 0.348114 0.4826965 0.348114 0.5282288 0.348114 0.84552 0.1702881 0.84552 0.1702881 0.8910217 0.005249023 0.8910217 0.005249023 0.9320984 0.6679382 0.84552 0.5 0.5282288 0.3478088 0.4826965 0.3478088 0.4416199 0.3478088 0.4090271 0.3480225 0.3881226 0.6682434 0.84552 0.6682434 0.8910217 0.6682434 0.9320984 0.6682434 0.9646912 0.6682434 0.9856262 0.6679382 0.5282288 0.5 0.3881226 0.5 0.9856262 0.005249023 0.5282288 0.1702881 0.9320984 0.1702881 0.9646912 0.6679382 0.4826965 0.6679382 0.4416199 0.6679382 0.4090271 0.6680603 0.3881226 0.348114 0.8910217 0.348114 0.9320984 0.348114 0.9646912 0.348114 0.9856262 0.8401489 0.9320984 0.8401489 0.9646912 0.8401489 0.9856262 0.8401489 0.4416199 0.8401489 0.4090271 0.8401489 0.3881226 0.8404846 0.4826965 0.8404846 0.4416199 0.8404846 0.4090271 0.9961548 0.4090271 0.6679382 0.9646912 0.6680603 0.9856262 0.348114 0.4090271 0.348114 0.3881226 0.005249023 0.9646912 0.005249023 0.84552 0.18573 0.3743591 0.18573 0.3641052 0.125 0.3743591 0.125 0.3641052 0.06427002 0.3743591 0.06427002 0.3641052 0.01983643 0.3743591 0.01983643 0.3641052 0.003540039 0.3743591 0.003540039 0.3641052 0.2301636 0.3743591 0.2301636 0.3641052 0.24646 0.3743591 0.24646 0.3641052 0.125 0.3131409 0.239624 0.3161011 0.2242737 0.3161011 0.182312 0.3161011 0.01037598 0.3161011 0.02572632 0.3161011 0.06768799 0.3161011 0.125 0.3161011</float_array>
					<technique_common>
						<accessor source="#polygon0_UVArr0" count="124" stride="2">
							<param name="S" type="float" />
							<param name="T" type="float" />
						</accessor>
					</technique_common>
				</source>
				<vertices id="polygon0_Vertices">
					<input semantic="POSITION" source="#polygon0_Positions" />
				</vertices>
				<triangles material="WpnMarioPill" count="286">
					<input semantic="VERTEX" source="#polygon0_Vertices" offset="0" />
					<input semantic="NORMAL" source="#polygon0_Normals" offset="1" />
					<input semantic="COLOR" source="#polygon0_Colors0" set="0" offset="2" />
					<input semantic="TEXCOORD" source="#polygon0_UVs0" set="0" offset="3" />
					<p>2 2 0 2 1 1 0 1 0 0 0 0 3 3 0 3 1 1 0 1 2 2 0 2 4 4 0 4 3 3 0 3 2 2 0 2 5 5 0 5 3 3 0 3 4 4 0 4 6 6 0 6 5 5 0 5 4 4 0 4 7 7 0 7 5 5 0 5 6 6 0 6 8 8 0 8 7 7 0 7 6 6 0 6 9 9 0 9 7 7 0 7 8 8 0 8 10 10 0 10 9 9 0 9 8 8 0 8 11 11 0 11 9 9 0 9 10 10 0 10 12 12 0 12 11 11 0 11 10 10 0 10 13 13 0 13 11 11 0 11 12 12 0 12 14 14 0 14 13 13 0 13 12 12 0 12 15 15 0 15 13 13 0 13 14 14 0 14 16 16 0 16 15 15 0 15 14 14 0 14 17 17 0 17 15 15 0 15 16 16 0 16 20 20 0 20 19 19 0 19 18 18 0 18 21 21 0 21 19 19 0 19 20 20 0 20 22 22 0 22 21 21 0 21 20 20 0 20 23 23 0 23 21 21 0 21 22 22 0 22 24 24 0 24 23 23 0 23 22 22 0 22 25 25 0 25 23 23 0 23 24 24 0 24 26 26 0 26 25 25 0 25 24 24 0 24 27 27 0 27 25 25 0 25 26 26 0 26 28 28 0 28 27 27 0 27 26 26 0 26 29 29 0 29 27 27 0 27 28 28 0 28 30 30 0 30 29 29 0 29 28 28 0 28 31 31 0 31 29 29 0 29 30 30 0 30 32 32 0 32 31 31 0 31 30 30 0 30 33 33 0 33 31 31 0 31 32 32 0 32 34 34 0 34 33 33 0 33 32 32 0 32 35 35 0 35 33 33 0 33 34 34 0 34 36 36 0 37 18 18 0 18 19 19 0 36 37 37 0 38 18 18 0 18 36 36 0 37 17 17 0 17 37 37 0 38 36 36 0 37 38 38 0 39 37 37 0 38 17 17 0 17 16 16 0 16 38 38 0 39 17 17 0 17 39 39 0 40 38 38 0 39 16 16 0 16 40 40 0 41 39 39 0 40 16 16 0 16 41 41 0 42 39 39 0 40 40 40 0 41 42 42 0 43 41 41 0 42 40 40 0 41 43 43 0 27 41 41 0 42 42 42 0 43 44 44 0 44 43 43 0 27 42 42 0 43 45 45 0 45 43 43 0 27 44 44 0 44 46 46 0 46 45 45 0 45 44 44 0 44 47 47 0 47 45 45 0 45 46 46 0 46 48 48 0 48 47 47 0 47 46 46 0 46 49 49 0 50 0 0 0 0 1 1 0 49 50 50 0 51 0 0 0 0 49 49 0 50 35 35 0 35 50 50 0 51 49 49 0 50 51 51 0 52 50 50 0 51 35 35 0 35 34 34 0 34 51 51 0 52 35 35 0 35 52 52 0 53 51 51 0 52 34 34 0 34 53 53 0 54 52 52 0 53 34 34 0 34 54 54 0 8 52 52 0 53 53 53 0 54 55 55 0 55 54 54 0 8 53 53 0 54 56 56 0 9 54 54 0 8 55 55 0 55 57 57 0 56 56 56 0 9 55 55 0 55 58 58 0 57 56 56 0 9 57 57 0 56 59 59 0 58 58 58 0 57 57 57 0 56 60 60 0 59 58 58 0 57 59 59 0 58 61 61 0 60 60 60 0 59 59 59 0 58 14 14 0 14 40 40 0 41 16 16 0 16 62 62 0 61 40 40 0 41 14 14 0 14 12 12 0 12 62 62 0 61 14 14 0 14 63 63 0 62 62 62 0 61 12 12 0 12 10 10 0 10 63 63 0 62 12 12 0 12 64 64 0 63 63 63 0 62 10 10 0 10 8 8 0 8 64 64 0 63 10 10 0 10 65 65 0 64 64 64 0 63 8 8 0 8 6 6 0 6 65 65 0 64 8 8 0 8 66 66 0 65 65 65 0 64 6 6 0 6 4 4 0 4 66 66 0 65 6 6 0 6 67 67 0 66 66 66 0 65 4 4 0 4 2 2 0 2 67 67 0 66 4 4 0 4 0 0 0 0 67 67 0 66 2 2 0 2 32 32 0 32 53 53 0 54 34 34 0 34 68 68 0 62 53 53 0 54 32 32 0 32 30 30 0 30 68 68 0 62 32 32 0 32 69 69 0 67 68 68 0 62 30 30 0 30 28 28 0 28 69 69 0 67 30 30 0 30 70 70 0 68 69 69 0 67 28 28 0 28 26 26 0 26 70 70 0 68 28 28 0 28 71 71 0 69 70 70 0 68 26 26 0 26 24 24 0 24 71 71 0 69 26 26 0 26 72 72 0 70 71 71 0 69 24 24 0 24 22 22 0 22 72 72 0 70 24 24 0 24 73 73 0 71 72 72 0 70 22 22 0 22 20 20 0 20 73 73 0 71 22 22 0 22 18 18 0 18 73 73 0 71 20 20 0 20 62 62 0 61 42 42 0 43 40 40 0 41 74 74 0 72 42 42 0 43 62 62 0 61 63 63 0 62 74 74 0 72 62 62 0 61 75 75 0 32 74 74 0 72 63 63 0 62 64 64 0 63 75 75 0 32 63 63 0 62 76 76 0 34 75 75 0 32 64 64 0 63 65 65 0 64 76 76 0 34 64 64 0 63 77 77 0 52 76 76 0 34 65 65 0 64 66 66 0 65 77 77 0 52 65 65 0 64 78 78 0 73 77 77 0 52 66 66 0 65 67 67 0 66 78 78 0 73 66 66 0 65 0 0 0 0 78 78 0 73 67 67 0 66 68 68 0 62 55 55 0 55 53 53 0 54 79 79 0 12 55 55 0 55 68 68 0 62 69 69 0 67 79 79 0 12 68 68 0 62 80 80 0 14 79 79 0 12 69 69 0 67 70 70 0 68 80 80 0 14 69 69 0 67 81 81 0 16 80 80 0 14 70 70 0 68 71 71 0 69 81 81 0 16 70 70 0 68 82 82 0 39 81 81 0 16 71 71 0 69 72 72 0 70 82 82 0 39 71 71 0 69 83 83 0 74 82 82 0 39 72 72 0 70 73 73 0 71 83 83 0 74 72 72 0 70 18 18 0 18 83 83 0 74 73 73 0 71 9 9 0 9 84 84 0 75 7 7 0 7 85 85 0 57 84 84 0 75 9 9 0 9 11 11 0 11 85 85 0 57 9 9 0 9 86 86 0 58 85 85 0 57 11 11 0 11 13 13 0 13 86 86 0 58 11 11 0 11 87 87 0 76 86 86 0 58 13 13 0 13 15 15 0 15 87 87 0 76 13 13 0 13 88 88 0 77 87 87 0 76 15 15 0 15 17 17 0 17 88 88 0 77 15 15 0 15 36 36 0 37 88 88 0 77 17 17 0 17 74 74 0 72 44 44 0 44 42 42 0 43 89 89 0 78 44 44 0 44 74 74 0 72 75 75 0 32 89 89 0 78 74 74 0 72 90 90 0 79 89 89 0 78 75 75 0 32 76 76 0 34 90 90 0 79 75 75 0 32 91 91 0 80 90 90 0 79 76 76 0 34 77 77 0 52 91 91 0 80 76 76 0 34 92 92 0 81 91 91 0 80 77 77 0 52 78 78 0 73 92 92 0 81 77 77 0 52 0 0 0 0 92 92 0 81 78 78 0 73 79 79 0 12 57 57 0 56 55 55 0 55 93 93 0 82 57 57 0 56 79 79 0 12 80 80 0 14 93 93 0 82 79 79 0 12 94 94 0 83 93 93 0 82 80 80 0 14 81 81 0 16 94 94 0 83 80 80 0 14 95 95 0 84 94 94 0 83 81 81 0 16 82 82 0 39 95 95 0 84 81 81 0 16 96 96 0 85 95 95 0 84 82 82 0 39 83 83 0 74 96 96 0 85 82 82 0 39 18 18 0 18 96 96 0 85 83 83 0 74 60 60 0 25 41 41 0 42 43 43 0 27 97 97 0 86 41 41 0 42 60 60 0 25 61 61 0 23 97 97 0 86 60 60 0 25 98 98 0 87 97 97 0 86 61 61 0 23 99 99 0 21 98 98 0 87 61 61 0 23 100 100 0 88 98 98 0 87 99 99 0 21 101 101 0 19 100 100 0 88 99 99 0 21 18 18 0 18 100 100 0 88 101 101 0 19 47 47 0 7 54 54 0 8 56 56 0 9 102 102 0 6 54 54 0 8 47 47 0 7 48 48 0 5 102 102 0 6 47 47 0 7 103 103 0 4 102 102 0 6 48 48 0 5 104 104 0 3 103 103 0 4 48 48 0 5 105 105 0 2 103 103 0 4 104 104 0 3 106 106 0 1 105 105 0 2 104 104 0 3 0 0 0 0 105 105 0 2 106 106 0 1 89 89 0 78 46 46 0 46 44 44 0 44 107 107 0 89 46 46 0 46 89 89 0 78 90 90 0 79 107 107 0 89 89 89 0 78 108 108 0 90 107 107 0 89 90 90 0 79 91 91 0 80 108 108 0 90 90 90 0 79 109 109 0 91 108 108 0 90 91 91 0 80 92 92 0 81 109 109 0 91 91 91 0 80 0 0 0 0 109 109 0 91 92 92 0 81 29 29 0 29 84 84 0 45 27 27 0 27 110 110 0 92 84 84 0 45 29 29 0 29 31 31 0 31 110 110 0 92 29 29 0 29 111 111 0 93 110 110 0 92 31 31 0 31 33 33 0 33 111 111 0 93 31 31 0 31 112 112 0 94 111 111 0 93 33 33 0 33 35 35 0 35 112 112 0 94 33 33 0 33 49 49 0 50 112 112 0 94 35 35 0 35 93 93 0 82 59 59 0 58 57 57 0 56 113 113 0 76 59 59 0 58 93 93 0 82 94 94 0 83 113 113 0 76 93 93 0 82 114 114 0 77 113 113 0 76 94 94 0 83 95 95 0 84 114 114 0 77 94 94 0 83 115 115 0 37 114 114 0 77 95 95 0 84 96 96 0 85 115 115 0 37 95 95 0 84 18 18 0 18 115 115 0 37 96 96 0 85 110 110 0 92 7 7 0 47 84 84 0 45 5 5 0 48 7 7 0 47 110 110 0 92 111 111 0 93 5 5 0 48 110 110 0 92 3 3 0 95 5 5 0 48 111 111 0 93 112 112 0 94 3 3 0 95 111 111 0 93 1 1 0 49 3 3 0 95 112 112 0 94 49 49 0 50 1 1 0 49 112 112 0 94 97 97 0 86 39 39 0 40 41 41 0 42 116 116 0 96 39 39 0 40 97 97 0 86 98 98 0 87 116 116 0 96 97 97 0 86 117 117 0 97 116 116 0 96 98 98 0 87 100 100 0 88 117 117 0 97 98 98 0 87 18 18 0 18 117 117 0 97 100 100 0 88 102 102 0 6 52 52 0 53 54 54 0 8 118 118 0 98 52 52 0 53 102 102 0 6 103 103 0 4 118 118 0 98 102 102 0 6 119 119 0 99 118 118 0 98 103 103 0 4 105 105 0 2 119 119 0 99 103 103 0 4 0 0 0 0 119 119 0 99 105 105 0 2 106 106 0 49 109 109 0 91 0 0 0 0 108 108 0 90 109 109 0 91 106 106 0 49 104 104 0 95 108 108 0 90 106 106 0 49 107 107 0 89 108 108 0 90 104 104 0 95 48 48 0 48 107 107 0 89 104 104 0 95 46 46 0 46 107 107 0 89 48 48 0 48 101 101 0 36 115 115 0 37 18 18 0 18 114 114 0 77 115 115 0 37 101 101 0 36 99 99 0 100 114 114 0 77 101 101 0 36 113 113 0 76 114 114 0 77 99 99 0 100 61 61 0 60 113 113 0 76 99 99 0 100 59 59 0 58 113 113 0 76 61 61 0 60 116 116 0 96 38 38 0 39 39 39 0 40 120 120 0 74 38 38 0 39 116 116 0 96 117 117 0 97 120 120 0 74 116 116 0 96 18 18 0 18 120 120 0 74 117 117 0 97 118 118 0 98 51 51 0 52 52 52 0 53 121 121 0 73 51 51 0 52 118 118 0 98 119 119 0 99 121 121 0 73 118 118 0 98 0 0 0 0 121 121 0 73 119 119 0 99 37 37 0 38 120 120 0 74 18 18 0 18 38 38 0 39 120 120 0 74 37 37 0 38 43 43 0 101 58 58 0 57 60 60 0 59 45 45 0 75 58 58 0 57 43 43 0 101 45 45 0 75 56 56 0 9 58 58 0 57 47 47 0 7 56 56 0 9 45 45 0 75 50 50 0 51 121 121 0 73 0 0 0 0 51 51 0 52 121 121 0 73 50 50 0 51 19 19 0 36 88 88 0 77 36 36 0 37 21 21 0 100 88 88 0 77 19 19 0 36 21 21 0 100 87 87 0 76 88 88 0 77 23 23 0 60 87 87 0 76 21 21 0 100 23 23 0 60 86 86 0 58 87 87 0 76 25 25 0 59 86 86 0 58 23 23 0 60 25 25 0 59 85 85 0 57 86 86 0 58 27 27 0 101 85 85 0 57 25 25 0 59 85 85 0 57 27 27 0 101 84 84 0 75 124 124 0 104 123 123 0 103 122 122 0 102 125 125 0 105 123 123 0 103 124 124 0 104 126 126 0 106 125 125 0 105 124 124 0 104 127 127 0 107 125 125 0 105 126 126 0 106 128 128 0 108 127 127 0 107 126 126 0 106 129 129 0 109 127 127 0 107 128 128 0 108 130 130 0 110 129 129 0 109 128 128 0 108 131 131 0 111 129 129 0 109 130 130 0 110 132 132 0 108 131 131 0 111 130 130 0 110 133 133 0 109 131 131 0 111 132 132 0 108 134 134 0 106 133 133 0 109 132 132 0 108 135 135 0 107 133 133 0 109 134 134 0 106 136 136 0 104 135 135 0 107 134 134 0 106 137 137 0 105 135 135 0 107 136 136 0 104 138 138 0 102 137 137 0 105 136 136 0 104 139 139 0 103 137 137 0 105 138 138 0 102 140 140 0 112 139 139 0 103 138 138 0 102 141 141 0 113 139 139 0 103 140 140 0 112 142 142 0 114 141 141 0 113 140 140 0 112 143 143 0 115 141 141 0 113 142 142 0 114 144 144 0 112 143 143 0 115 142 142 0 114 145 145 0 113 143 143 0 115 144 144 0 112 122 122 0 102 145 145 0 113 144 144 0 112 123 123 0 103 145 145 0 113 122 122 0 102 146 0 0 116 123 123 0 103 125 125 0 105 145 145 0 113 123 123 0 103 146 0 0 116 143 143 0 115 145 145 0 113 146 0 0 116 146 0 0 116 141 141 0 113 143 143 0 115 139 139 0 103 141 141 0 113 146 0 0 116 137 137 0 105 139 139 0 103 146 0 0 116 146 0 0 116 135 135 0 107 137 137 0 105 133 133 0 109 135 135 0 107 146 0 0 116 131 131 0 111 133 133 0 109 146 0 0 116 146 0 0 116 129 129 0 109 131 131 0 111 127 127 0 107 129 129 0 109 146 0 0 116 125 125 0 105 127 127 0 107 146 0 0 116 140 18 0 118 144 18 0 118 142 18 0 117 138 18 0 119 144 18 0 118 140 18 0 118 128 18 0 121 132 18 0 121 130 18 0 120 126 18 0 122 132 18 0 121 128 18 0 121 126 18 0 122 134 18 0 122 132 18 0 121 124 18 0 123 134 18 0 122 126 18 0 122 124 18 0 123 136 18 0 123 134 18 0 122 122 18 0 119 136 18 0 123 124 18 0 123 138 18 0 119 122 18 0 119 144 18 0 118 136 18 0 123 122 18 0 119 138 18 0 119</p>
				</triangles>
			</mesh>
		</geometry>
	</library_geometries>
	<library_controllers>
		<controller id="polygon0_Controller">
			<skin source="#polygon0">
				<bind_shape_matrix>1 0 0 0 0 1 0 0 0 0 1 0 0 0 0 1</bind_shape_matrix>
				<source id="polygon0_Joints">
					<Name_array id="polygon0_JointArr" count="3">TopN HaveN BodyM</Name_array>
					<technique_common>
						<accessor source="#polygon0_JointArr" count="3">
							<param name="JOINT" type="Name" />
						</accessor>
					</technique_common>
				</source>
				<source id="polygon0_Matrices">
					<float_array id="polygon0_MatArr" count="48">1 0 0 0 0 1 0 0 0 0 1 0 0 0 0 1 1.538462 0 0 2.625 0 1.538462 0 0 0 0 1.538462 0 0 0 0 1 1.538462 0 0 0.91875 0 1.538462 0 0 0 0 1.538462 0 0 0 0 1</float_array>
					<technique_common>
						<accessor source="#polygon0_MatArr" count="3" stride="16">
							<param type="float4x4" />
						</accessor>
					</technique_common>
				</source>
				<source id="polygon0_Weights">
					<float_array id="polygon0_WeightArr" count="1">1</float_array>
					<technique_common>
						<accessor source="#polygon0_WeightArr" count="1">
							<param type="float" />
						</accessor>
					</technique_common>
				</source>
				<joints>
					<input semantic="JOINT" source="#polygon0_Joints" />
					<input semantic="INV_BIND_MATRIX" source="#polygon0_Matrices" />
				</joints>
				<vertex_weights count="147">
					<input semantic="JOINT" offset="0" source="#polygon0_Joints" />
					<input semantic="WEIGHT" offset="1" source="#polygon0_Weights" />
					<vcount>1 1 1 1 1 1 1 1 1 1 1 1 1 1 1 1 1 1 1 1 1 1 1 1 1 1 1 1 1 1 1 1 1 1 1 1 1 1 1 1 1 1 1 1 1 1 1 1 1 1 1 1 1 1 1 1 1 1 1 1 1 1 1 1 1 1 1 1 1 1 1 1 1 1 1 1 1 1 1 1 1 1 1 1 1 1 1 1 1 1 1 1 1 1 1 1 1 1 1 1 1 1 1 1 1 1 1 1 1 1 1 1 1 1 1 1 1 1 1 1 1 1 1 1 1 1 1 1 1 1 1 1 1 1 1 1 1 1 1 1 1 1 1 1 1 1 1</vcount>
					<v>2 0 2 0 2 0 2 0 2 0 2 0 2 0 2 0 2 0 2 0 2 0 2 0 2 0 2 0 2 0 2 0 2 0 2 0 2 0 2 0 2 0 2 0 2 0 2 0 2 0 2 0 2 0 2 0 2 0 2 0 2 0 2 0 2 0 2 0 2 0 2 0 2 0 2 0 2 0 2 0 2 0 2 0 2 0 2 0 2 0 2 0 2 0 2 0 2 0 2 0 2 0 2 0 2 0 2 0 2 0 2 0 2 0 2 0 2 0 2 0 2 0 2 0 2 0 2 0 2 0 2 0 2 0 2 0 2 0 2 0 2 0 2 0 2 0 2 0 2 0 2 0 2 0 2 0 2 0 2 0 2 0 2 0 2 0 2 0 2 0 2 0 2 0 2 0 2 0 2 0 2 0 2 0 2 0 2 0 2 0 2 0 2 0 2 0 2 0 2 0 2 0 2 0 2 0 2 0 2 0 2 0 2 0 2 0 2 0 2 0 2 0 2 0 2 0 2 0 2 0 2 0 2 0 2 0 2 0 2 0 2 0 2 0 2 0 2 0 2 0 2 0 2 0 2 0 2 0 2 0 2 0 2 0 2 0 2 0 2 0 2 0 2 0 2 0 2 0 2 0 2 0 2 0 2 0 2 0 2 0 2 0 2 0</v>
				</vertex_weights>
			</skin>
		</controller>
	</library_controllers>
	<library_visual_scenes>
		<visual_scene id="RootNode" name="RootNode">
			<node id="TopN" name="TopN" sid="TopN" type="JOINT">
				<node id="HaveN" name="HaveN" sid="HaveN" type="JOINT">
					<translate>3.382 5.61 -2.5</translate>
					<rotate>0 0 1 -41.893</rotate>
					<rotate>0 1 0 -2.01</rotate>
					<rotate>1 0 0 2.277</rotate>
					<scale>0.486 0.486 0.486</scale>
					<node id="BodyM" name="BodyM" sid="BodyM" type="JOINT">
						<translate>1.70625 0 0</translate>
					</node>
				</node>
			</node>
			<node id="polygon0" name="polygon0" type="NODE">
				<instance_controller url="#polygon0_Controller">
					<skeleton>#TopN</skeleton>
					<bind_material>
						<technique_common>
							<instance_material symbol="WpnMarioPill" target="#WpnMarioPill">
								<bind_vertex_input semantic="TEXCOORD0" input_semantic="TEXCOORD" input_set="0" />
								<bind_vertex_input semantic="TEXCOORD0" input_semantic="TEXCOORD" input_set="0" />
							</instance_material>
						</technique_common>
					</bind_material>
				</instance_controller>
			</node>
		</visual_scene>
	</library_visual_scenes>
	<scene>
		<instance_visual_scene url="#RootNode" />
	</scene>
</COLLADA>