[
    {
        "id": "1",
        "titulo": "Chef Parrillero Grill",
        "informacion": "El Chef Parrillero ofrece una variada carta especializada en carnes a la parrilla. Nos distinguimos por la sazón, la calidad de los cortes, una surtida barra internacional y sobre todo nuestra esmerada atención. Contamos con estacionamiento privado.",
        "longitud": "-71.530303",
        "latitud": "-16.4135013",
        "imagen": "https://media-cdn.tripadvisor.com/media/photo-s/0f/70/85/41/darse-el-gusto-con-nuestros.jpg"
    },
    {
        "id": "2",
        "titulo": "Chifa Ka Hing",
        "informacion": "Comida china y latinoamericana, su comida es una fusión de comida china con ingredientes y sabores peruanos.",
        "longitud": "-71.5308965",
        "latitud": "-16.4115122",
        "imagen": "https://3.bp.blogspot.com/-cRfglK9kPvU/V5-2YW_Aj5I/AAAAAAAADcc/8VsdHsE6EV4-lHnJc8Ctbc6VTTHhefv1gCLcB/s640/chifa_ka_hing_0%255B1%255D.jpg"
    },
    {
        "id": "3",
        "titulo": "Tipika",
        "informacion": "Símbolo de la sazón Arequipeña, nace resaltando la identidad culinaraia mistiana en el Perú y el Mundo brindando lo mejor.",
        "longitud": "-71.5447761",
        "latitud": "-16.4062396",
        "imagen": "http://www.programasperu.com/restaurantes-peruanos/wp-content/uploads/2012/10/tipika.jpg"
    },
    {
        "id": "4",
        "titulo": "Cevicheria Arrecife",
        "informacion": "Si lo que deseas es probar un cebiche refrescante en un ambiente agradable y de frescura.",
        "longitud": "-71.540469",
        "latitud": "-16.408572",
        "imagen": "https://image.ibb.co/crGWRL/r-arecife.jpg"
    },
    {
        "id": "5",
        "titulo": "Sambambaias",
        "informacion": "Sambambaias es un versátil restaurante cuya amplia carta cuenta con muy variadas opciones.",
        "longitud": "-71.539586",
        "latitud": "-16.3917321",
        "imagen": "https://igx.4sqi.net/img/general/width960/952134_owxhLXU1cb0PhQclz4DxZyUfqnbii1j4l_K47fTuIdA.jpg"
    },
    {
        "id": "6",
        "titulo": "Zig Zag restaurant",
        "informacion": "Zig Zag Restaurant ofrece, a través de su gastronomía Alpandina, una creativa fusión culinaria que tiene hondas raíces en las montañas, donde el sol llena de equilibrio a los alimentos.",
        "longitud": "-71.5376579",
        "latitud": "-16.3953295",
        "imagen": "https://encrypted-tbn0.gstatic.com/images?q=tbn:ANd9GcTVuZSWxQUdHvIMsFra_Zk8gkKE808HQ9A5xmwO9q0-n1iwcg3Nyw"
    }
]