-------------------------------------------------------------------------------
Test set: com.bbva.pzic.listHistoricalLettersSummaries.dao.tx.mapper.ITxListHistoricalLettersSummariesMapperTest
-------------------------------------------------------------------------------
Tests run: 6, Failures: 0, Errors: 0, Skipped: 0, Time elapsed: 2.524 sec
