{
  "numtarj": "4940 1970 8307 0361",
  "idtiptj": "1",
  "dstiptj": "Permanent Account Number",
  "tiprodf": "D",
  "dsprodf": "Debit Card",
  "idmatar": "V",
  "nomatar": "Visa",
  "sopfisi": "S",
  "dsopfis": "Sticker",
  "fecvenc": "2016-07-01",
  "nombcli": "John Smith",
  "monpri": "USD",
  "monsec": "PEN",
  "ilimcre": 0,
  "dlimcre": "USD",
  "estarjs": "I",
  "destarj": "Inoperative",
  "fecalta": "2017-02-08",
  "idcorel": "1234",
  "nucorel": "ES90 0182 1642 0302 0153 5555",
  "idtcore": "1",
  "detcore": "Permanent Account Number",
  "codofen": "Codigo ofen",
  "desofen": "Descripcion ofen",
  "codseri": "001",
  "desseri": "EECC Físico",
  "numdomi": "000",
  "desdomi": "ABCDE",
  "codser2": "002",
  "desser2": "Entrega de Tarjeta de Crédito",
  "numdom2": "002",
  "desdom2": "ABCDE",
  "codser3": "003",
  "desser3": "Entrega de Sticker (Wallet)",
  "numdom3": "003",
  "desdom3": "ABCDE"
}