[
  {
    "idettas":"TEAC",
    "desttas":"TASA EFECTIVA ANUAL CALCULADA",
    "fecctas":"2018-10-01",
    "idmodta":"P",
    "nommod":"PERCENTAGE",
    "valtasa":50
  },
  {
    "idettas":"TEAC",
    "desttas":"TASA EFECTIVA ANUAL CALCULADA",
    "fecctas":"2018-10-01",
    "idmodta":"M",
    "nommod":"AMOUNT",
    "intdeut":2000.00,
    "montasa":"PEN"
  },
  {
    "idettas":"TEAC",
    "desttas":"TASA EFECTIVA ANUAL CALCULADA",
    "fecctas":"2018-10-01",
    "idmodta":"P",
    "nommod":"PERCENTAGE",
    "valtasa":25.32
  },
  {
    "idettas":"TEAC",
    "desttas":"TASA EFECTIVA ANUAL CALCULADA",
    "fecctas":"2018-10-01",
    "idmodta":"M",
    "nommod":"AMOUNT",
    "intdeut":1000.00,
    "montasa":"PEN"
  }
]