[
  {
    "numtarj": "4940197083070360",
    "fecvenc": "2018-02-01",
    "nombcli": "John Smith",
    "idtnuco": "1",
    "detnuco": "Permanent Account Number",
    "mdispue": "EUR",
    "mdispub": "USD",
    "tiptarj": "R",
    "dtitarj": "Credit Card.",
    "sopfiss": "S",
    "dsopfis": "Sticker",
    "estarjs": "I",
    "destarj": "Inoperative card",
    "sdispon": 1500,
    "mdispon": "EUR",
    "sdispue": 1500,
    "sdispub": 1449,
    "iprotar": "YOUNG_CARD",
    "dprotar": "Young card.",
    "idmatar": "V",
    "nomatar": "Visa",
    "ilimcre": 3000,
    "dlimcre": "EUR",
    "idcorel": "0234098493851239",
    "nucorel": "123456789",
    "idtcore": "1",
    "detcore": "Primary Account Number",
    "idcortv": "0215455454654654",
    "nucortv": "987654321",
    "idtcotv": "1",
    "detcotv": "Primary Account Number",
    "idimgt1": "FRONT_CARD_1",
    "nimgta1": "Front face of the card #1",
    "imgtar1": "pg=0001&bin=491910&default_image=false&v=4&width=&height=&country=pe&app_id=com.bbva.wallet&issue_date=19700101&back=false",
    "idimgt2": "FRONT_CARD_2",
    "nimgta2": "Front face of the card #2",
    "imgtar2": "pg=0001&bin=491910&default_image=false&v=4&width=&height=&country=pe&app_id=com.bbva.wallet&issue_date=19700101&back=true",
    "idebloq": "LO",
    "iderazo": "4341",
    "desrazo": "reason1",
    "fecbloq": "2018-02-01",
    "idactbl": "S",
    "codactv": "01",
    "indactv": "S",
    "codreti": "02",
    "indreti": "N",
    "codinte": "03",
    "indinte": "S",
    "codcoex": "04",
    "indcoex": "N",
    "codsobr": "05",
    "indsobr": "S",
    "fecsitt": "2017-03-14",
    "idpart": "1234",
    "nompart": "Juan David",
    "apepart": "Flores",
    "tippart": "T",
    "despart": "HOLDER"
  },
  {
    "numtarj": "4345344253421322",
    "fecvenc": "2018-02-01",
    "nombcli": "John Smith",
    "idtnuco": "1",
    "detnuco": "Permanent Account Number",
    "mdispue": "EUR",
    "mdispub": "USD",
    "tiptarj": "R",
    "dtitarj": "Credit Card.",
    "sopfiss": "S",
    "dsopfis": "Sticker",
    "estarjs": "I",
    "destarj": "Inoperative card",
    "sdispon": 1500,
    "mdispon": "EUR",
    "sdispue": 1500,
    "sdispub": 1449,
    "iprotar": "YOUNG_CARD",
    "dprotar": "Young card.",
    "idmatar": "V",
    "nomatar": "Visa",
    "ilimcre": 3000,
    "dlimcre": "EUR",
    "idcorel": "2340948239488127",
    "nucorel": "454334321",
    "idtcore": "1",
    "detcore": "Primary Account Number",
    "idcortv": "0215455454654654",
    "nucortv": "987654321",
    "idtcotv": "1",
    "detcotv": "Primary Account Number",
    "idimgt1": "FRONT_CARD_1",
    "nimgta1": "Front face of the card #1",
    "imgtar1": "pg=0002&bin=491911&default_image=false&v=4&width=&height=&country=pe&app_id=com.bbva.wallet&issue_date=19700101&back=false",
    "idimgt2": "FRONT_CARD_2",
    "nimgta2": "Front face of the card #2",
    "imgtar2": "pg=0002&bin=491911&default_image=false&v=4&width=&height=&country=pe&app_id=com.bbva.wallet&issue_date=19700101&back=true",
    "idebloq": "LO",
    "iderazo": "4322",
    "desrazo": "reason2",
    "fecbloq": "2008-10-01",
    "idactbl": "N",
    "codactv": "01",
    "indactv": "N",
    "idpart": "1235",
    "nompart": "Juan",
    "apepart": "Peres",
    "tippart": "A",
    "despart": "AUTHORIZED"
  },
  {
    "numtarj": "4445423423678932",
    "fecvenc": "2018-02-01",
    "nombcli": "John Smith",
    "idtnuco": "1",
    "detnuco": "Permanent Account Number",
    "mdispue": "EUR",
    "mdispub": "USD",
    "tiptarj": "R",
    "dtitarj": "Credit Card.",
    "sopfiss": "S",
    "dsopfis": "Sticker",
    "estarjs": "I",
    "destarj": "Inoperative card",
    "sdispon": 1500,
    "mdispon": "EUR",
    "sdispue": 1500,
    "sdispub": 1449,
    "iprotar": "YOUNG_CARD",
    "dprotar": "Young card.",
    "idmatar": "V",
    "nomatar": "Visa",
    "ilimcre": 3000,
    "dlimcre": "EUR",
    "idcorel": "2847811009993837491",
    "nucorel": "875636821",
    "idtcore": "2",
    "detcore": "Primary Account Number",
    "idcortv": "0215455454654654",
    "nucortv": "987654321",
    "idtcotv": "1",
    "detcotv": "Primary Account Number",
    "idimgt1": "FRONT_CARD_1",
    "nimgta1": "Front face of the card #1",
    "imgtar1": "pg=0003&bin=491912&default_image=false&v=4&width=&height=&country=pe&app_id=com.bbva.wallet&issue_date=19700101&back=false",
    "idimgt2": "FRONT_CARD_2",
    "nimgta2": "Front face of the card #2",
    "imgtar2": "pg=0003&bin=491912&default_image=false&v=4&width=&height=&country=pe&app_id=com.bbva.wallet&issue_date=19700101&back=true",
    "idebloq": "LO",
    "iderazo": "432",
    "desrazo": "reason",
    "fecbloq": "2018-02-01",
    "idactbl": "S",
    "codactv": "01",
    "indactv": "S",
    "idpart": "1237",
    "nompart": "Juan",
    "apepart": "Peres",
    "tippart": "T",
    "despart": "HOLDER"
  },
  {
    "numtarj": "4554463083742333",
    "fecvenc": "2018-02-01",
    "nombcli": "John Smith",
    "idtnuco": "1",
    "detnuco": "Permanent Account Number",
    "mdispue": "EUR",
    "mdispub": "USD",
    "tiptarj": "R",
    "dtitarj": "Credit Card.",
    "sopfiss": "S",
    "dsopfis": "Sticker",
    "estarjs": "I",
    "destarj": "Inoperative card",
    "sdispon": 1500,
    "mdispon": "EUR",
    "sdispue": 1500,
    "sdispub": 1449,
    "iprotar": "YOUNG_CARD",
    "dprotar": "Young card.",
    "idmatar": "V",
    "nomatar": "Visa",
    "ilimcre": 3000,
    "dlimcre": "EUR",
    "idcorel": "0020029484725751",
    "nucorel": "674839234",
    "idtcore": "2",
    "detcore": "Primary Account Number",
    "idcortv": "0215455454654654",
    "nucortv": "987654321",
    "idtcotv": "1",
    "detcotv": "Primary Account Number",
    "idpart": "1239",
    "nompart": "Juan",
    "apepart": "Peres",
    "tippart": "A",
    "despart": "AUTHORIZED"
  },
  {
    "numtarj": "4140640001346275",
    "fecvenc": "2022-03-31T00:00:00",
    "nombcli": "PRISCU MORE",
    "sdispon": 3031.79,
    "mdispon": "PEN",
    "sdispue": 0,
    "mdispue": "PEN",
    "sdispub": -11.00,
    "mdispub": "USD",
    "dprotar": "VISA ORO LIFEMILES",
    "ilimcre": 3000.00,
    "dlimcre": "PEN",
    "tiptarj": "C",
    "dtitarj": "CREDITO",
    "sopfiss": "P",
    "dsopfis": "PLASTICO NORMAL",
    "idtnuco": "1",
    "detnuco": "PRIMARY ACCOUNT NUMBER",
    "estarjs": "A",
    "destarj": "ACTIVO",
    "idmatar": "V",
    "nomatar": "VISA",
    "idcorel": "001102415008854400",
    "nucorel": "001102415008854400",
    "idtcore": "1",
    "detcore": "PRIMARY ACCOUNT NUMBER",
    "idimgt1": "FRONT_CARD",
    "nimgta1": "front face card",
    "imgtar1": "pg\u003d\u0026bin\u003d414064\u0026default_image\u003dfalse\u0026v\u003d4\u0026width\u003d\u0026height\u003d\u0026country\u003dpe\u0026app_id\u003dcom.bbva.wallet\u0026issue_date\u003d20171123",
    "idimgt2": "BACK_CARD",
    "nimgta2": "back face card",
    "imgtar2": "pg\u003d\u0026bin\u003d414064\u0026default_image\u003dfalse\u0026v\u003d4\u0026width\u003d\u0026height\u003d\u0026country\u003dpe\u0026app_id\u003dcom.bbva.wallet\u0026issue_date\u003d20171123\u0026back\u003dtrue",
    "codactv": "01",
    "indactv": "S",
    "idpart": "001102415008854400T0",
    "nompart": "JUAN",
    "apepart": "MORE LOPEZ",
    "tippart": "T",
    "despart": "HOLDER",
    "codreti": "02",
    "indreti": "S",
    "codinte": "03",
    "indinte": "S",
    "codcoex": "04",
    "indcoex": "S",
    "fecsitt": "2017-03-13"
  }
]
