{
  "tiptarj": "VISA",
  "numcont": "1234567890123456",
  "titptar": "TITULAR 1",
  "titstar": "TITULAR 2",
  "indtper": "N",
  "feccier": "2015-05-15",
  "pagcarg": "Inmediato",
  "dirptit": "Av Confraternidad mz 72 lt 23",
  "dirctit": "Av. Nicolás Ayllón 2810",
  "dirppro": "Jr. Puno 213",
  "dirpubi": "Ovalo Miraflores cuadra 22",
  "lincred": 123456789.98,
  "creutil": 143256732.32,
  "credisp": 198847302.98,
  "feculpa": "2015-05-16",
  "numcuep": "0011-132-87324367774211",
  "numcueu": "0011-154-11247776678211",
  "divcont": "PEN",
  "oficina": "SAN ISIDRO",
  "teacomp": 123.1234,
  "teacomu": 145.5678,
  "teacmpp": 167.9012,
  "teacmpu": 189.3456,
  "creutip": 233453709823145.55,
  "creutiu": 124534657980912.69,
  "teaavap": 4536.312,
  "teaavau": 1083.461,
  "teamorp": 3590.002,
  "teamoru": 2596.315,
  "nummovi": 123,
  "impcuot": 123454569012347.67,
  "monmipe": 133455785012347.03,
  "cuopape": 123456546034347.52,
  "pagmipe": 173456789672247.37,
  "pagtope": 156756784810077.47,
  "puntmes": 123456789,
  "monmius": 123456546034342.52,
  "cuopaus": 123456546034344.52,
  "pagmius": 123456546034346.52,
  "pagtous": 123456544334349.52,
  "impdetp": 113456543434346.52,
  "impdetu": 123456546034307.52,
  "impatpe": 111456546034240.52,
  "impinpe": 123456546034349.52,
  "impcope": 993456546034341.52,
  "impatus": 223456546034342.52,
  "impinus": 123456546034344.52,
  "impcous": 113456546034317.52,
  "punacum": 103432646,
  "mapmini": 123,
  "mapminf": 999,
  "numlife": "12345678901",
  "numtarj": "4551 7084 8002 0165"
}