[
  {
    "linme01": "aaaaaaaaaa1",
    "linme02": "bbbbbbbbbb1",
    "linme03": "cccccccccc1",
    "linme04": "dddddddddd1"
  },
  {
    "linme01": "aaaaaaaaaa2",
    "linme02": "bbbbbbbbbb2",
    "linme03": "cccccccccc2",
    "linme04": "dddddddddd2"
  },
  {
    "linme01": "aaaaaaaaaa3",
    "linme02": "bbbbbbbbbb3",
    "linme03": "cccccccccc3"
  },
  {
    "linme01": "aaaaaaaaaa4",
    "linme02": "bbbbbbbbbb4",
    "linme04": "dddddddddd4"
  },
  {
    "linme02": "bbbbbbbbbb5",
    "linme03": "cccccccccc5",
    "linme04": "dddddddddd5"
  }
]