{
  "data": {
    "titularTarjeta": "01",
    "descTitularidad": "SZA83082491SDS",
    "idClasificacion": "C",
    "nombreClasificacion": "SZA80712898SDS",
    "idImagen": "SZA16422946SDS",
    "nombreImagen": "SZA92524097SDS",

    "__COMMENT": "SZA89744065SDS",
    "urlImagen" : "pg=C1&bin=491910&default_image=true&v=4&width=512&height=324&country=pe&app_id=com.bbva.wallet&issue_date=19700101&back=true",

    "bin": "SZA16078440SDS",
    "nombreMarca": "SZA28119647SDS",
    "idSubproducto": "SZA48348047SDS",
    "nombreSubproducto": "SZA20481349SDS",
    "descSubproducto": "SZA87717181SDS",
    "limiteMinLinea": 1000.25,
    "monedaLimiteMin": "USD",
    "limiteMaxLinea": 4020.25,
    "monedaLimiteMax": "USD",
    "lineaSugerida": 2450.50,
    "monedaLineaSug": "USD",
    "idComisionMemb": "MF",
    "nombreMembresia": "SZA66651660SDS",
    "idModAplicMemb": "P",
    "modAplicacionMemb": "SZA66308063SDS",
    "montoMembr": 250.00,
    "monedaMembr": "USD",
    "idComisionEstadoCuenta": "PE",
    "nombreMembresiaEstadoCuenta": "SZA67504005SDS",
    "idModAplicMembEstadoCuenta": "M",
    "modAplicacionMembEstadoCuenta": "SZA14659229SDS",
    "montoMembrEstadoCuenta": 5.85,
    "monedaMembrEstadoCuenta": "USD",
    "tasa": [
      {
        "id": "SZA62020369SDS",
        "nombre": "SZA97462688SDS",
        "fecha": "2018-12-17",
        "modalidad": "P",
        "descModalidad": "SZA59301078SDS",
        "valor": 1.85
      },
      {
        "id": "SZA62020360SDS",
        "nombre": "SZA97462689SDS",
        "fecha": "2018-12-18",
        "modalidad": "M",
        "descModalidad": "SZA59301079SDS",
        "valor": 1.86
      }
    ],
    "tipoSeguro": "I",
    "montoSeguro": 1.99,
    "divisaMontoSeguro": "USD",
    "beneficio": [
      {
        "id": "SZA32645970SDS",
        "descripcion": "SZA48818599SDS"
      }
    ],
    "idProgBenef": "SZA83321051SDS",
    "nombreProgBenef": "SZA90093737SDS",
    "idPeriodicidad": "M",
    "nombrePeriodicidad": "SZA18093070SDS",
    "diapago": [
      {
        "valor": 5
      },
      {
        "valor": 16
      }
    ],
    "idTipoDeuda": "TAP",
    "nombreTipoDeuda": "TAP"
  }
}