{
  "amoity3": "M",
  "amocty3": "M",
  "idmcig1": "P",
  "mcipagv": 12312,
  "idiinac": "TEA_PURCHASE_SECOND_CURRENCY",
  "mciinac": 123,
  "idiinam": "TEA_PURCHASE_SECOND_CURRENCY",
  "mciinam": 213,
  "idiinsd": "TEA_PURCHASE_SECOND_CURRENCY",
  "mciinsd": 867,
  "idiinsm": "TEA_PURCHASE_SECOND_CURRENCY",
  "mciinsm": 567,
  "iditocu": "423423123",
  "mcitocu": 342,
  "idmcie1": "P",
  "mciexcl": 2315,
  "iddcim1": "P",
  "mcitois": 645,
  "idiinne": "TEA_PURCHASE_SECOND_CURRENCY",
  "mciinne": 765,
  "idideu1": "P",
  "ideumes": 5543,
  "idmcir1": "P",
  "mcicarp": 432,
  "moncon4": "PEN",
  "amoityp": "M",
  "amoctyp": "M",
  "idmcig2": "P",
  "mcipagb": 213,
  "idiinab": "TEA_PURCHASE_SECOND_CURRENCY",
  "mciinab": 675,
  "idiiamb": "TEA_PURCHASE_SECOND_CURRENCY",
  "mciiamb": 4123,
  "idiincb": "TEA_PURCHASE_SECOND_CURRENCY",
  "mciincb": 123,
  "idiinmb": "TEA_PURCHASE_SECOND_CURRENCY",
  "mciinmb": 31231,
  "iditcmb": "43251451",
  "mcitcmb": 31231,
  "idmcie2": "P",
  "mciexcb": 5986,
  "iddcim2": "P",
  "mcitccb": 21123,
  "idiicub": "TEA_PURCHASE_SECOND_CURRENCY",
  "mciicub": 54364,
  "idideu2": "P",
  "ideumbm": 12312,
  "idmcir2": "P",
  "mcicplb": 31231
}