%YAML 1.1
%TAG !u! tag:unity3d.com,2011:
--- !u!114 &11400000
MonoBehaviour:
  m_ObjectHideFlags: 0
  m_PrefabParentObject: {fileID: 0}
  m_PrefabInternal: {fileID: 0}
  m_GameObject: {fileID: 0}
  m_Enabled: 1
  m_EditorHideFlags: 0
  m_Script: {fileID: 11500000, guid: 10d7728ffab08894b817ff4dbae17046, type: 3}
  m_Name: Profile 3
  m_EditorClassIdentifier: 
  WoodBoxPriority: 3.62
  TNTBoxPriority: 1.9
  EvasionChance: 100
  AimAccuracy: 100
  WaveEvasionChance: 20
  CanJumpNitro: 1
  CanEvadeNitroWhileCarryingBoxes: 1
