{
	"meta":{
		"width":32,
		"height":32
	},
	"frames":[
		{
			"name":"Bullet_01",
			"x":0,
			"y":9,
			"w":8,
			"h":9
		},
		{
			"name":"Bullet_02",
			"x":0,
			"y":0,
			"w":8,
			"h":9
		}

	]
}