{
  "displayMode": {
    "renderWidth": 960,
    "renderHeight": 640,
    "clearColor" : "93,152,141",
    "targetFPS" : 60,
    "verticalSync" : true,
    "windowTittle": "GlitchEngine",
    "fullScreen": false,
    "preserveAspectRatio": true,
    "designWidth": 960,
    "designHeight": 640
  },

  "lightning": {
    "useLights": false,
    "ambientColor": "0.05,0.05,0.05",
    "maxLightsOnScreen": 20
  }
}