{ "height":10,
 "layers":[
        {
         "compression":"zlib",
         "data":"eJyzYGBgsIBieyC2ZEAAcyRxCzR1FmhYG4idkfQ6ArETEOugqXGCYlz6kIE5kl3I7nLAIoYOYPY7oZmPTYxSoAvEekCsT4YeMwbMcOegntMGDAAAplgLsg==",
         "encoding":"base64",
         "height":10,
         "name":"Background",
         "opacity":1,
         "type":"tilelayer",
         "visible":true,
         "width":15,
         "x":0,
         "y":0
        }, 
        {
         "compression":"zlib",
         "data":"eJxjYBgFgx2wAjETEDND2eiYEYs8TIwfirmR2PjEyFGPTRwAirgB5Q==",
         "encoding":"base64",
         "height":10,
         "name":"Floor",
         "opacity":1,
         "type":"tilelayer",
         "visible":true,
         "width":15,
         "x":0,
         "y":0
        }, 
        {
         "compression":"zlib",
         "data":"eJxjYBgF9ARuUFoWCwYBKyC2RqKHKgAAbX8Bwg==",
         "encoding":"base64",
         "height":10,
         "name":"Foreground",
         "opacity":1,
         "type":"tilelayer",
         "visible":true,
         "width":15,
         "x":0,
         "y":0
        }, 
        {
         "draworder":"topdown",
         "height":10,
         "name":"Collision",
         "objects":[
                {
                 "height":0,
                 "id":46,
                 "name":"Rock",
                 "polygon":[
                        {
                         "x":0,
                         "y":0
                        }, 
                        {
                         "x":16,
                         "y":0
                        }, 
                        {
                         "x":16,
                         "y":32
                        }, 
                        {
                         "x":0,
                         "y":32
                        }],
                 "rotation":0,
                 "type":"Collider",
                 "visible":true,
                 "width":0,
                 "x":0,
                 "y":80
                }, 
                {
                 "height":0,
                 "id":47,
                 "name":"Floor",
                 "polygon":[
                        {
                         "x":0,
                         "y":0
                        }, 
                        {
                         "x":224,
                         "y":0
                        }, 
                        {
                         "x":224,
                         "y":16
                        }, 
                        {
                         "x":0,
                         "y":16
                        }],
                 "rotation":0,
                 "type":"Collider",
                 "visible":true,
                 "width":0,
                 "x":16,
                 "y":112
                }, 
                {
                 "height":0,
                 "id":49,
                 "name":"InfoBox",
                 "polygon":[
                        {
                         "x":0,
                         "y":0
                        }, 
                        {
                         "x":16,
                         "y":0
                        }, 
                        {
                         "x":16,
                         "y":16
                        }, 
                        {
                         "x":0,
                         "y":16
                        }],
                 "rotation":0,
                 "type":"Trigger",
                 "visible":true,
                 "width":0,
                 "x":176,
                 "y":96
                }, 
                {
                 "height":0,
                 "id":50,
                 "name":"RightExit",
                 "polygon":[
                        {
                         "x":0,
                         "y":0
                        }, 
                        {
                         "x":1,
                         "y":0
                        }, 
                        {
                         "x":1,
                         "y":80
                        }, 
                        {
                         "x":0,
                         "y":80
                        }],
                 "rotation":0,
                 "type":"Trigger",
                 "visible":true,
                 "width":0,
                 "x":239,
                 "y":32
                }],
         "opacity":1,
         "type":"objectgroup",
         "visible":true,
         "width":15,
         "x":0,
         "y":0
        }],
 "nextobjectid":52,
 "orientation":"orthogonal",
 "renderorder":"left-up",
 "tileheight":16,
 "tilesets":[
        {
         "columns":10,
         "firstgid":1,
         "image":"Env_Tiles.png",
         "imageheight":112,
         "imagewidth":160,
         "margin":0,
         "name":"Env_Tiles",
         "spacing":0,
         "tilecount":70,
         "tileheight":16,
         "tilewidth":16
        }],
 "tilewidth":16,
 "version":1,
 "width":15
}