# Blender 3.5.1 MTL File: 'roda.blend1'
# www.blender.org

newmtl calota
Ns 548.349670
Ka 0.569620 0.569620 0.569620
Kd 0.800000 0.800000 0.800000
Ks 0.500000 0.500000 0.500000
Ke 0.000000 0.000000 0.000000
Ni 1.450000
d 1.000000
illum 3

newmtl pneu
Ns 90.000000
Ka 1.000000 1.000000 1.000000
Kd 0.130000 0.130000 0.130000
Ks 0.246835 0.246835 0.246835
Ke 0.000000 0.000000 0.000000
Ni 1.450000
d 1.000000
illum 2
