# Blender 3.5.1
# www.blender.org
mtllib roda.mtl
o Circle
v -0.000000 -0.000000 0.300000
v 0.267878 0.646716 -0.193779
v 0.388899 0.582029 -0.193779
v 0.494975 0.494975 -0.193779
v 0.582029 0.388899 -0.193779
v 0.646716 0.267879 -0.193779
v 0.686550 0.136563 -0.193779
v 0.700000 0.000000 -0.193779
v 0.686550 -0.136563 -0.193779
v 0.646716 -0.267879 -0.193779
v 0.582029 -0.388899 -0.193779
v 0.494975 -0.494975 -0.193779
v 0.388899 -0.582029 -0.193779
v 0.267878 -0.646716 -0.193779
v 0.136563 -0.686550 -0.193779
v 0.000000 -0.700000 -0.193779
v -0.136563 -0.686550 -0.193779
v -0.267878 -0.646716 -0.193779
v -0.388899 -0.582029 -0.193779
v -0.494975 -0.494975 -0.193779
v -0.582029 -0.388899 -0.193779
v -0.646716 -0.267878 -0.193779
v -0.686550 -0.136563 -0.193779
v -0.700000 -0.000000 -0.193779
v -0.686550 0.136563 -0.193779
v -0.646716 0.267878 -0.193779
v -0.582029 0.388899 -0.193779
v -0.494975 0.494975 -0.193779
v -0.388899 0.582029 -0.193779
v -0.267878 0.646716 -0.193779
v -0.136563 0.686550 -0.193779
v -0.000000 0.700000 -0.193779
v 0.136563 0.686550 -0.193779
v 0.000000 0.000000 -0.193779
v 0.000000 1.000000 -0.225000
v -0.000000 0.924637 -0.300000
v -0.000000 0.977927 -0.278033
v -0.180388 0.906870 -0.300000
v -0.195090 0.980785 -0.225000
v -0.190784 0.959136 -0.278033
v -0.353843 0.854253 -0.300000
v -0.382683 0.923880 -0.225000
v -0.374236 0.903486 -0.278033
v -0.513701 0.768808 -0.300000
v -0.555570 0.831470 -0.225000
v -0.543307 0.813116 -0.278033
v -0.653817 0.653817 -0.300000
v -0.707107 0.707107 -0.225000
v -0.691499 0.691499 -0.278033
v -0.768808 0.513701 -0.300000
v -0.831470 0.555570 -0.225000
v -0.813116 0.543307 -0.278033
v -0.854253 0.353843 -0.300000
v -0.923880 0.382683 -0.225000
v -0.903486 0.374236 -0.278033
v -0.906870 0.180388 -0.300000
v -0.980785 0.195090 -0.225000
v -0.959136 0.190784 -0.278033
v -0.924637 -0.000000 -0.300000
v -1.000000 -0.000000 -0.225000
v -0.977927 -0.000000 -0.278033
v -0.906870 -0.180388 -0.300000
v -0.980785 -0.195090 -0.225000
v -0.959136 -0.190784 -0.278033
v -0.854253 -0.353843 -0.300000
v -0.923880 -0.382683 -0.225000
v -0.903487 -0.374236 -0.278033
v -0.768808 -0.513701 -0.300000
v -0.831470 -0.555570 -0.225000
v -0.813116 -0.543307 -0.278033
v -0.653817 -0.653817 -0.300000
v -0.707107 -0.707107 -0.225000
v -0.691499 -0.691499 -0.278033
v -0.513701 -0.768808 -0.300000
v -0.555570 -0.831470 -0.225000
v -0.543307 -0.813116 -0.278033
v -0.353843 -0.854253 -0.300000
v -0.382683 -0.923880 -0.225000
v -0.374236 -0.903486 -0.278033
v -0.180388 -0.906870 -0.300000
v -0.195090 -0.980785 -0.225000
v -0.190784 -0.959136 -0.278033
v 0.000000 -0.924637 -0.300000
v 0.000000 -1.000000 -0.225000
v 0.000000 -0.977927 -0.278033
v 0.180388 -0.906870 -0.300000
v 0.195090 -0.980785 -0.225000
v 0.190784 -0.959136 -0.278033
v 0.353843 -0.854253 -0.300000
v 0.382683 -0.923880 -0.225000
v 0.374236 -0.903486 -0.278033
v 0.513701 -0.768808 -0.300000
v 0.555570 -0.831470 -0.225000
v 0.543307 -0.813116 -0.278033
v 0.653817 -0.653817 -0.300000
v 0.707107 -0.707107 -0.225000
v 0.691499 -0.691499 -0.278033
v 0.768808 -0.513701 -0.300000
v 0.831469 -0.555570 -0.225000
v 0.813116 -0.543307 -0.278033
v 0.854253 -0.353843 -0.300000
v 0.923880 -0.382684 -0.225000
v 0.903486 -0.374237 -0.278033
v 0.906870 -0.180388 -0.300000
v 0.980785 -0.195090 -0.225000
v 0.959136 -0.190784 -0.278033
v 0.924637 0.000000 -0.300000
v 1.000000 0.000000 -0.225000
v 0.977927 0.000000 -0.278033
v 0.906870 0.180388 -0.300000
v 0.980785 0.195090 -0.225000
v 0.959136 0.190784 -0.278033
v 0.854253 0.353843 -0.300000
v 0.923879 0.382684 -0.225000
v 0.903486 0.374236 -0.278033
v 0.768808 0.513701 -0.300000
v 0.831470 0.555570 -0.225000
v 0.813116 0.543307 -0.278033
v 0.653817 0.653817 -0.300000
v 0.707107 0.707107 -0.225000
v 0.691499 0.691499 -0.278033
v 0.513701 0.768808 -0.300000
v 0.555570 0.831470 -0.225000
v 0.543307 0.813116 -0.278033
v 0.353843 0.854253 -0.300000
v 0.382683 0.923880 -0.225000
v 0.374236 0.903487 -0.278033
v 0.180388 0.906870 -0.300000
v 0.195090 0.980785 -0.225000
v 0.190784 0.959136 -0.278033
v -0.000000 0.924637 0.300000
v 0.000000 1.000000 0.225000
v -0.000000 0.977927 0.278033
v -0.195090 0.980785 0.225000
v -0.180388 0.906870 0.300000
v -0.190784 0.959136 0.278033
v -0.382683 0.923880 0.225000
v -0.353843 0.854253 0.300000
v -0.374236 0.903486 0.278033
v -0.555570 0.831470 0.225000
v -0.513701 0.768808 0.300000
v -0.543307 0.813116 0.278033
v -0.707107 0.707107 0.225000
v -0.653817 0.653817 0.300000
v -0.691499 0.691499 0.278033
v -0.831470 0.555570 0.225000
v -0.768808 0.513701 0.300000
v -0.813116 0.543307 0.278033
v -0.923880 0.382683 0.225000
v -0.854253 0.353843 0.300000
v -0.903486 0.374236 0.278033
v -0.980785 0.195090 0.225000
v -0.906870 0.180388 0.300000
v -0.959136 0.190784 0.278033
v -1.000000 -0.000000 0.225000
v -0.924637 -0.000000 0.300000
v -0.977927 -0.000000 0.278033
v -0.980785 -0.195090 0.225000
v -0.906870 -0.180388 0.300000
v -0.959136 -0.190784 0.278033
v -0.923880 -0.382683 0.225000
v -0.854253 -0.353843 0.300000
v -0.903487 -0.374236 0.278033
v -0.831470 -0.555570 0.225000
v -0.768808 -0.513701 0.300000
v -0.813116 -0.543307 0.278033
v -0.707107 -0.707107 0.225000
v -0.653817 -0.653817 0.300000
v -0.691499 -0.691499 0.278033
v -0.555570 -0.831470 0.225000
v -0.513701 -0.768808 0.300000
v -0.543307 -0.813116 0.278033
v -0.382683 -0.923880 0.225000
v -0.353843 -0.854253 0.300000
v -0.374236 -0.903486 0.278033
v -0.195090 -0.980785 0.225000
v -0.180388 -0.906870 0.300000
v -0.190784 -0.959136 0.278033
v 0.000000 -1.000000 0.225000
v 0.000000 -0.924637 0.300000
v 0.000000 -0.977927 0.278033
v 0.195090 -0.980785 0.225000
v 0.180388 -0.906870 0.300000
v 0.190784 -0.959136 0.278033
v 0.382683 -0.923880 0.225000
v 0.353843 -0.854253 0.300000
v 0.374236 -0.903486 0.278033
v 0.555570 -0.831470 0.225000
v 0.513701 -0.768808 0.300000
v 0.543307 -0.813116 0.278033
v 0.707107 -0.707107 0.225000
v 0.653817 -0.653817 0.300000
v 0.691498 -0.691499 0.278033
v 0.831469 -0.555570 0.225000
v 0.768808 -0.513701 0.300000
v 0.813116 -0.543307 0.278033
v 0.923880 -0.382684 0.225000
v 0.854253 -0.353843 0.300000
v 0.903486 -0.374236 0.278033
v 0.980785 -0.195090 0.225000
v 0.906870 -0.180388 0.300000
v 0.959136 -0.190784 0.278033
v 1.000000 0.000000 0.225000
v 0.924637 0.000000 0.300000
v 0.977927 0.000000 0.278033
v 0.980785 0.195090 0.225000
v 0.906870 0.180388 0.300000
v 0.959136 0.190784 0.278033
v 0.923879 0.382684 0.225000
v 0.854253 0.353843 0.300000
v 0.903486 0.374237 0.278033
v 0.831470 0.555570 0.225000
v 0.768808 0.513701 0.300000
v 0.813116 0.543307 0.278033
v 0.707107 0.707107 0.225000
v 0.653817 0.653817 0.300000
v 0.691499 0.691499 0.278033
v 0.555570 0.831470 0.225000
v 0.513701 0.768808 0.300000
v 0.543307 0.813116 0.278033
v 0.382683 0.923880 0.225000
v 0.353843 0.854253 0.300000
v 0.374236 0.903487 0.278033
v 0.195090 0.980785 0.225000
v 0.180388 0.906870 0.300000
v 0.190784 0.959136 0.278033
v 0.296719 0.716342 -0.300000
v 0.267878 0.646716 -0.232442
v 0.276325 0.667109 -0.270591
v 0.430769 0.644691 -0.300000
v 0.388899 0.582029 -0.232442
v 0.401162 0.600382 -0.270591
v 0.548264 0.548264 -0.300000
v 0.494975 0.494975 -0.232442
v 0.510583 0.510583 -0.270591
v 0.644691 0.430768 -0.300000
v 0.582029 0.388899 -0.232442
v 0.600382 0.401162 -0.270591
v 0.716342 0.296719 -0.300000
v 0.646716 0.267879 -0.232442
v 0.667109 0.276326 -0.270591
v 0.760464 0.151266 -0.300000
v 0.686550 0.136563 -0.232442
v 0.708199 0.140870 -0.270591
v 0.775363 0.000000 -0.300000
v 0.700000 0.000000 -0.232442
v 0.722073 0.000000 -0.270591
v 0.760464 -0.151266 -0.300000
v 0.686550 -0.136563 -0.232442
v 0.708199 -0.140870 -0.270591
v 0.716342 -0.296719 -0.300000
v 0.646716 -0.267879 -0.232442
v 0.667109 -0.276326 -0.270591
v 0.644691 -0.430769 -0.300000
v 0.582029 -0.388899 -0.232442
v 0.600382 -0.401163 -0.270591
v 0.548264 -0.548264 -0.300000
v 0.494975 -0.494975 -0.232442
v 0.510583 -0.510583 -0.270591
v 0.430769 -0.644691 -0.300000
v 0.388899 -0.582029 -0.232442
v 0.401162 -0.600382 -0.270591
v 0.296719 -0.716342 -0.300000
v 0.267878 -0.646716 -0.232442
v 0.276325 -0.667109 -0.270591
v 0.151266 -0.760465 -0.300000
v 0.136563 -0.686550 -0.232442
v 0.140869 -0.708199 -0.270591
v 0.000000 -0.775363 -0.300000
v 0.000000 -0.700000 -0.232442
v 0.000000 -0.722073 -0.270591
v -0.151266 -0.760465 -0.300000
v -0.136563 -0.686550 -0.232442
v -0.140869 -0.708199 -0.270591
v -0.296719 -0.716342 -0.300000
v -0.267878 -0.646716 -0.232442
v -0.276326 -0.667109 -0.270591
v -0.430769 -0.644691 -0.300000
v -0.388899 -0.582029 -0.232442
v -0.401162 -0.600382 -0.270591
v -0.548264 -0.548264 -0.300000
v -0.494975 -0.494975 -0.232442
v -0.510583 -0.510583 -0.270591
v -0.644691 -0.430768 -0.300000
v -0.582029 -0.388899 -0.232442
v -0.600382 -0.401162 -0.270591
v -0.716342 -0.296719 -0.300000
v -0.646716 -0.267878 -0.232442
v -0.667109 -0.276325 -0.270591
v -0.760464 -0.151266 -0.300000
v -0.686550 -0.136563 -0.232442
v -0.708199 -0.140869 -0.270591
v -0.775363 -0.000000 -0.300000
v -0.700000 -0.000000 -0.232442
v -0.722073 -0.000000 -0.270591
v -0.760464 0.151266 -0.300000
v -0.686550 0.136563 -0.232442
v -0.708199 0.140870 -0.270591
v -0.716342 0.296718 -0.300000
v -0.646716 0.267878 -0.232442
v -0.667109 0.276325 -0.270591
v -0.644691 0.430769 -0.300000
v -0.582029 0.388899 -0.232442
v -0.600382 0.401162 -0.270591
v -0.548264 0.548264 -0.300000
v -0.494975 0.494975 -0.232442
v -0.510583 0.510583 -0.270591
v -0.430769 0.644691 -0.300000
v -0.388899 0.582029 -0.232442
v -0.401162 0.600382 -0.270591
v -0.296719 0.716342 -0.300000
v -0.267878 0.646716 -0.232442
v -0.276325 0.667109 -0.270591
v -0.151266 0.760464 -0.300000
v -0.136563 0.686550 -0.232442
v -0.140869 0.708199 -0.270591
v -0.000000 0.700000 -0.232442
v -0.000000 0.775363 -0.300000
v -0.000000 0.722073 -0.270591
v 0.151266 0.760464 -0.300000
v 0.136563 0.686550 -0.232442
v 0.140869 0.708199 -0.270591
vn -0.4714 0.8819 -0.0000
vn 0.8819 -0.4714 -0.0000
vn -0.6344 0.7730 -0.0000
vn 0.9569 -0.2903 -0.0000
vn -0.7730 0.6344 -0.0000
vn 0.9952 -0.0980 -0.0000
vn -0.8819 0.4714 -0.0000
vn 0.9952 0.0980 -0.0000
vn -0.9569 0.2903 -0.0000
vn 0.9569 0.2903 -0.0000
vn -0.9952 0.0980 -0.0000
vn 0.8819 0.4714 -0.0000
vn -0.9952 -0.0980 -0.0000
vn 0.7730 0.6344 -0.0000
vn -0.9569 -0.2903 -0.0000
vn 0.6344 0.7730 -0.0000
vn -0.8819 -0.4714 -0.0000
vn 0.4714 0.8819 -0.0000
vn -0.7730 -0.6344 -0.0000
vn 0.2903 0.9569 -0.0000
vn 0.2903 -0.9569 -0.0000
vn 0.0788 0.1902 -0.9786
vn -0.0458 -0.2302 -0.9721
vn 0.0402 0.2019 -0.9786
vn 0.0980 0.9952 -0.0000
vn 0.4714 -0.8819 -0.0000
vn -0.4714 -0.8819 -0.0000
vn -0.0980 0.9952 -0.0000
vn 0.6344 -0.7730 -0.0000
vn -0.2903 0.9569 -0.0000
vn 0.7730 -0.6344 -0.0000
vn -0.0000 0.2059 -0.9786
vn 0.0458 -0.2302 -0.9721
vn -0.0402 0.2019 -0.9786
vn 0.5451 -0.8157 0.1936
vn 0.6937 -0.6937 -0.1936
vn 0.6937 -0.6937 0.1936
vn -0.9622 0.1914 0.1936
vn -0.9064 0.3754 -0.1936
vn -0.9622 0.1914 -0.1936
vn 0.8157 -0.5451 -0.1936
vn 0.8157 -0.5451 0.1936
vn -0.9811 -0.0000 0.1936
vn -0.9811 -0.0000 -0.1936
vn 0.9064 -0.3754 -0.1936
vn 0.9064 -0.3754 0.1936
vn -0.9622 -0.1914 -0.1936
vn -0.9622 -0.1914 0.1936
vn 0.9622 -0.1914 -0.1936
vn 0.9622 -0.1914 0.1936
vn -0.9064 -0.3754 0.1936
vn -0.9064 -0.3754 -0.1936
vn 0.9811 -0.0000 -0.1936
vn 0.9811 -0.0000 0.1936
vn -0.8157 -0.5451 -0.1936
vn -0.8157 -0.5451 0.1936
vn 0.9622 0.1914 -0.1936
vn 0.9622 0.1914 0.1936
vn -0.6937 -0.6937 -0.1936
vn -0.6937 -0.6937 0.1936
vn 0.9064 0.3754 -0.1936
vn 0.9064 0.3754 0.1936
vn -0.5451 -0.8157 -0.1936
vn -0.5451 -0.8157 0.1936
vn 0.8157 0.5451 -0.1936
vn 0.8157 0.5451 0.1936
vn -0.3754 -0.9064 -0.1936
vn -0.3754 -0.9064 0.1936
vn 0.6937 0.6937 -0.1936
vn 0.6937 0.6937 0.1936
vn -0.1914 -0.9622 -0.1936
vn -0.1914 -0.9622 0.1936
vn 0.1914 0.9622 0.1936
vn -0.0000 0.9811 -0.1936
vn -0.0000 0.9811 0.1936
vn 0.5451 0.8157 -0.1936
vn 0.5451 0.8157 0.1936
vn -0.0000 -0.9811 -0.1936
vn -0.0000 -0.9811 0.1936
vn -0.3754 0.9064 0.1936
vn -0.5451 0.8157 -0.1936
vn -0.5451 0.8157 0.1936
vn 0.3754 0.9064 -0.1936
vn 0.3754 0.9064 0.1936
vn 0.1914 -0.9622 -0.1936
vn 0.1914 -0.9622 0.1936
vn -0.6937 0.6937 -0.1936
vn -0.6937 0.6937 0.1936
vn 0.1914 0.9622 -0.1936
vn 0.3754 -0.9064 -0.1936
vn 0.3754 -0.9064 0.1936
vn -0.8157 0.5451 -0.1936
vn -0.8157 0.5451 0.1936
vn 0.5451 -0.8157 -0.1936
vn -0.9064 0.3754 0.1936
vn -0.1914 0.9622 0.1936
vn -0.3754 0.9064 -0.1936
vn -0.0000 -0.0000 1.0000
vn -0.2059 -0.0000 -0.9786
vn 0.2302 -0.0458 -0.9721
vn 0.2347 -0.0000 -0.9721
vn 0.1144 -0.1712 -0.9786
vn -0.1660 0.1660 -0.9721
vn 0.1456 -0.1456 -0.9786
vn -0.1902 0.0788 -0.9786
vn -0.2019 0.0402 -0.9786
vn 0.0788 -0.1902 -0.9786
vn -0.1304 0.1952 -0.9721
vn -0.0000 -0.2347 -0.9721
vn -0.1712 0.1144 -0.9786
vn 0.2169 -0.0898 -0.9721
vn -0.0458 0.2302 -0.9721
vn -0.0898 0.2169 -0.9721
vn 0.1144 0.1712 -0.9786
vn -0.0898 -0.2169 -0.9721
vn -0.1456 0.1456 -0.9786
vn 0.1952 -0.1304 -0.9721
vn -0.0000 -0.2059 -0.9786
vn 0.0402 -0.2019 -0.9786
vn -0.6344 -0.7730 -0.0000
vn -0.1144 0.1712 -0.9786
vn 0.1660 -0.1660 -0.9721
vn 0.0458 0.2302 -0.9721
vn -0.0000 0.2347 -0.9721
vn 0.1456 0.1456 -0.9786
vn -0.1304 -0.1952 -0.9721
vn 0.0898 -0.2169 -0.9721
vn 0.1304 -0.1952 -0.9721
vn -0.0788 -0.1902 -0.9786
vn -0.0402 -0.2019 -0.9786
vn -0.1952 -0.1304 -0.9721
vn -0.1660 -0.1660 -0.9721
vn -0.0788 0.1902 -0.9786
vn 0.1304 0.1952 -0.9721
vn 0.0898 0.2169 -0.9721
vn 0.1712 0.1144 -0.9786
vn -0.2169 -0.0898 -0.9721
vn -0.0980 -0.9952 -0.0000
vn -0.1456 -0.1456 -0.9786
vn -0.1144 -0.1712 -0.9786
vn 0.2019 0.0402 -0.9786
vn 0.1902 0.0788 -0.9786
vn -0.1712 -0.1144 -0.9786
vn 0.1660 0.1660 -0.9721
vn 0.2059 -0.0000 -0.9786
vn -0.2302 -0.0458 -0.9721
vn 0.2169 0.0898 -0.9721
vn 0.1952 0.1304 -0.9721
vn -0.2302 0.0458 -0.9721
vn -0.2347 -0.0000 -0.9721
vn 0.2019 -0.0402 -0.9786
vn -0.2169 0.0898 -0.9721
vn -0.2019 -0.0402 -0.9786
vn -0.1902 -0.0788 -0.9786
vn 0.1712 -0.1144 -0.9786
vn 0.1902 -0.0788 -0.9786
vn 0.2302 0.0458 -0.9721
vn -0.1952 0.1304 -0.9721
vn -0.0000 -0.0000 -1.0000
vn -0.1400 0.7037 -0.6966
vn -0.1914 0.9622 -0.1936
vn -0.0000 0.7175 -0.6966
vn -0.2746 0.6629 -0.6966
vn -0.3986 0.5966 -0.6966
vn -0.5073 0.5073 -0.6966
vn -0.5966 0.3986 -0.6966
vn -0.6629 0.2746 -0.6966
vn -0.7037 0.1400 -0.6966
vn -0.7175 -0.0000 -0.6966
vn -0.7037 -0.1400 -0.6966
vn -0.6629 -0.2746 -0.6966
vn -0.5966 -0.3986 -0.6966
vn -0.5073 -0.5073 -0.6966
vn -0.3986 -0.5966 -0.6966
vn -0.2746 -0.6629 -0.6966
vn -0.1400 -0.7037 -0.6966
vn -0.0000 -0.7175 -0.6966
vn 0.1400 -0.7037 -0.6966
vn 0.2746 -0.6629 -0.6966
vn 0.3986 -0.5966 -0.6966
vn 0.5073 -0.5073 -0.6966
vn 0.5966 -0.3986 -0.6966
vn 0.6629 -0.2746 -0.6966
vn 0.7037 -0.1400 -0.6966
vn 0.7175 -0.0000 -0.6966
vn 0.7037 0.1400 -0.6966
vn 0.6629 0.2746 -0.6966
vn 0.5966 0.3986 -0.6966
vn 0.5073 0.5073 -0.6966
vn 0.3986 0.5966 -0.6966
vn 0.2746 0.6629 -0.6966
vn 0.1400 0.7037 -0.6966
vn 0.0980 -0.9952 -0.0000
vn -0.0000 0.2059 0.9786
vn -0.1400 0.7037 0.6966
vn -0.0402 0.2019 0.9786
vn -0.0000 0.7175 0.6966
vn -0.0788 0.1902 0.9786
vn -0.2746 0.6629 0.6966
vn -0.3986 0.5966 0.6966
vn -0.1144 0.1712 0.9786
vn -0.5073 0.5073 0.6966
vn -0.1456 0.1456 0.9786
vn -0.5966 0.3986 0.6966
vn -0.1712 0.1144 0.9786
vn -0.6629 0.2746 0.6966
vn -0.1902 0.0788 0.9786
vn -0.2019 0.0402 0.9786
vn -0.7037 0.1400 0.6966
vn -0.7175 -0.0000 0.6966
vn -0.2059 -0.0000 0.9786
vn -0.2019 -0.0402 0.9786
vn -0.7037 -0.1400 0.6966
vn -0.1902 -0.0788 0.9786
vn -0.6629 -0.2746 0.6966
vn -0.5966 -0.3986 0.6966
vn -0.1712 -0.1144 0.9786
vn -0.1456 -0.1456 0.9786
vn -0.5073 -0.5073 0.6966
vn -0.3986 -0.5966 0.6966
vn -0.1144 -0.1712 0.9786
vn -0.2746 -0.6629 0.6966
vn -0.0788 -0.1902 0.9786
vn -0.0402 -0.2019 0.9786
vn -0.1400 -0.7037 0.6966
vn -0.0000 -0.7175 0.6966
vn -0.0000 -0.2059 0.9786
vn 0.0402 -0.2019 0.9786
vn 0.1400 -0.7037 0.6966
vn 0.2746 -0.6629 0.6966
vn 0.0788 -0.1902 0.9786
vn 0.1144 -0.1712 0.9786
vn 0.3986 -0.5966 0.6966
vn 0.1456 -0.1456 0.9786
vn 0.5073 -0.5073 0.6966
vn 0.1712 -0.1144 0.9786
vn 0.5966 -0.3986 0.6966
vn 0.6629 -0.2746 0.6966
vn 0.1902 -0.0788 0.9786
vn 0.7037 -0.1400 0.6966
vn 0.2019 -0.0402 0.9786
vn 0.7175 -0.0000 0.6966
vn 0.2059 -0.0000 0.9786
vn 0.2019 0.0402 0.9786
vn 0.7037 0.1400 0.6966
vn 0.6629 0.2746 0.6966
vn 0.1902 0.0788 0.9786
vn 0.1712 0.1144 0.9786
vn 0.5966 0.3986 0.6966
vn 0.1456 0.1456 0.9786
vn 0.5073 0.5073 0.6966
vn 0.1144 0.1712 0.9786
vn 0.3986 0.5966 0.6966
vn 0.0788 0.1902 0.9786
vn 0.2746 0.6629 0.6966
vn 0.1400 0.7037 0.6966
vn 0.0402 0.2019 0.9786
vn -0.1348 -0.6779 -0.7227
vn -0.0000 -0.6912 -0.7227
vn -0.0000 -0.9647 -0.2634
vn -0.2645 -0.6386 -0.7227
vn -0.1882 -0.9461 -0.2634
vn -0.3840 -0.5747 -0.7227
vn -0.3692 -0.8913 -0.2634
vn -0.6821 -0.6821 -0.2634
vn -0.5359 -0.8021 -0.2634
vn -0.5747 -0.3840 -0.7227
vn -0.4887 -0.4887 -0.7227
vn -0.8021 -0.5359 -0.2634
vn -0.6386 -0.2645 -0.7227
vn -0.6779 -0.1348 -0.7227
vn -0.9461 -0.1882 -0.2634
vn -0.8913 -0.3692 -0.2634
vn -0.9647 -0.0000 -0.2634
vn -0.6779 0.1348 -0.7227
vn -0.6912 -0.0000 -0.7227
vn -0.6386 0.2645 -0.7227
vn -0.9461 0.1882 -0.2634
vn -0.5747 0.3840 -0.7227
vn -0.8913 0.3692 -0.2634
vn -0.6821 0.6821 -0.2634
vn -0.8021 0.5359 -0.2634
vn -0.4887 0.4887 -0.7227
vn -0.3840 0.5747 -0.7227
vn -0.2645 0.6386 -0.7227
vn -0.5359 0.8021 -0.2634
vn -0.1348 0.6779 -0.7227
vn -0.3692 0.8913 -0.2634
vn -0.0000 0.6912 -0.7227
vn -0.1882 0.9461 -0.2634
vn 0.1348 0.6779 -0.7227
vn 0.1882 0.9461 -0.2634
vn -0.0000 0.9647 -0.2634
vn 0.2645 0.6386 -0.7227
vn 0.3840 0.5747 -0.7227
vn 0.3692 0.8913 -0.2634
vn 0.4887 0.4887 -0.7227
vn 0.5359 0.8021 -0.2634
vn 0.5747 0.3840 -0.7227
vn 0.6821 0.6821 -0.2634
vn 0.6386 0.2645 -0.7227
vn 0.8021 0.5359 -0.2634
vn 0.9461 0.1882 -0.2634
vn 0.8913 0.3692 -0.2634
vn 0.6779 0.1348 -0.7227
vn 0.9647 -0.0000 -0.2634
vn 0.6912 -0.0000 -0.7227
vn 0.6779 -0.1348 -0.7227
vn 0.6386 -0.2645 -0.7227
vn 0.9461 -0.1882 -0.2634
vn 0.8021 -0.5359 -0.2634
vn 0.8913 -0.3692 -0.2634
vn 0.4887 -0.4887 -0.7227
vn 0.5747 -0.3840 -0.7227
vn 0.5359 -0.8021 -0.2634
vn 0.6821 -0.6821 -0.2634
vn 0.2645 -0.6386 -0.7227
vn 0.3840 -0.5747 -0.7227
vn 0.3692 -0.8913 -0.2634
vn 0.1882 -0.9461 -0.2634
vn 0.1348 -0.6779 -0.7227
vn -0.2903 -0.9569 -0.0000
vt 0.000000 0.000000
vt 0.000000 0.000000
vt 0.000000 0.000000
vt 0.000000 0.000000
vt 0.000000 0.000000
vt 0.000000 0.000000
vt 0.000000 0.000000
vt 0.000000 0.000000
vt 0.000000 0.000000
vt 0.000000 0.000000
vt 0.000000 0.000000
vt 0.000000 0.000000
vt 0.000000 0.000000
vt 0.000000 0.000000
vt 0.000000 0.000000
vt 0.000000 0.000000
vt 0.000000 0.000000
vt 0.000000 0.000000
vt 0.000000 0.000000
vt 0.000000 0.000000
vt 0.000000 0.000000
vt 0.000000 0.000000
vt 0.000000 0.000000
vt 0.000000 0.000000
vt 0.000000 0.000000
vt 0.000000 0.000000
vt 0.000000 0.000000
vt 0.000000 0.000000
vt 0.000000 0.000000
vt 0.000000 0.000000
vt 0.000000 0.000000
vt 0.000000 0.000000
vt 0.000000 0.000000
vt 0.000000 0.000000
vt 0.000000 0.000000
vt 0.000000 0.000000
vt 0.000000 0.000000
vt 0.000000 0.000000
vt 0.000000 0.000000
vt 0.000000 0.000000
vt 0.000000 0.000000
vt 0.000000 0.000000
vt 0.000000 0.000000
vt 0.000000 0.000000
vt 0.000000 0.000000
vt 0.000000 0.000000
vt 0.000000 0.000000
vt 0.000000 0.000000
vt 0.000000 0.000000
vt 0.000000 0.000000
vt 0.000000 0.000000
vt 0.000000 0.000000
vt 0.000000 0.000000
vt 0.000000 0.000000
vt 0.000000 0.000000
vt 0.000000 0.000000
vt 0.000000 0.000000
vt 0.000000 0.000000
vt 0.000000 0.000000
vt 0.000000 0.000000
vt 0.000000 0.000000
vt 0.000000 0.000000
vt 0.000000 0.000000
vt 0.000000 0.000000
vt 0.000000 0.000000
vt 0.000000 0.000000
vt 0.000000 0.000000
vt 0.000000 0.000000
vt 0.000000 0.000000
vt 0.000000 0.000000
vt 0.000000 0.000000
vt 0.000000 0.000000
vt 0.000000 0.000000
vt 0.000000 0.000000
vt 0.000000 0.000000
vt 0.000000 0.000000
vt 0.000000 0.000000
vt 0.000000 0.000000
vt 0.000000 0.000000
vt 0.000000 0.000000
vt 0.000000 0.000000
vt 0.000000 0.000000
vt 0.000000 0.000000
vt 0.000000 0.000000
vt 0.000000 0.000000
vt 0.000000 0.000000
vt 0.000000 0.000000
vt 0.000000 0.000000
vt 0.000000 0.000000
vt 0.000000 0.000000
vt 0.000000 0.000000
vt 0.000000 0.000000
vt 0.000000 0.000000
vt 0.000000 0.000000
vt 0.000000 0.000000
vt 0.000000 0.000000
vt 0.000000 0.000000
vt 0.000000 0.000000
vt 0.000000 0.000000
vt 0.000000 0.000000
vt 0.000000 0.000000
vt 0.000000 0.000000
vt 0.000000 0.000000
vt 0.000000 0.000000
vt 0.000000 0.000000
vt 0.000000 0.000000
vt 0.000000 0.000000
vt 0.000000 0.000000
vt 0.000000 0.000000
vt 0.000000 0.000000
vt 0.000000 0.000000
vt 0.000000 0.000000
vt 0.000000 0.000000
vt 0.000000 0.000000
vt 0.000000 0.000000
vt 0.000000 0.000000
vt 0.000000 0.000000
vt 0.000000 0.000000
vt 0.000000 0.000000
vt 0.000000 0.000000
vt 0.000000 0.000000
vt 0.000000 0.000000
vt 0.000000 0.000000
vt 0.000000 0.000000
vt 0.000000 0.000000
vt 0.000000 0.000000
vt 0.000000 0.000000
vt 0.000000 0.000000
vt 0.000000 0.000000
vt 0.000000 0.000000
vt 0.000000 0.000000
vt 0.000000 0.000000
vt 0.000000 0.000000
vt 0.000000 0.000000
vt 0.000000 0.000000
vt 0.000000 0.000000
vt 0.000000 0.000000
vt 0.000000 0.000000
vt 0.000000 0.000000
vt 0.000000 0.000000
vt 0.000000 0.000000
vt 0.000000 0.000000
vt 0.000000 0.000000
vt 0.000000 0.000000
vt 0.000000 0.000000
vt 0.000000 0.000000
vt 0.000000 0.000000
vt 0.000000 0.000000
vt 0.000000 0.000000
vt 0.000000 0.000000
vt 0.000000 0.000000
vt 0.000000 0.000000
vt 0.000000 0.000000
vt 0.000000 0.000000
vt 0.000000 0.000000
vt 0.000000 0.000000
vt 0.000000 0.000000
vt 0.000000 0.000000
vt 0.000000 0.000000
vt 0.000000 0.000000
vt 0.000000 0.000000
vt 0.000000 0.000000
vt 0.000000 0.000000
vt 0.000000 0.000000
vt 0.000000 0.000000
vt 0.000000 0.000000
vt 0.000000 0.000000
vt 0.000000 0.000000
vt 0.000000 0.000000
vt 0.000000 0.000000
vt 0.000000 0.000000
vt 0.000000 0.000000
vt 0.000000 0.000000
vt 0.000000 0.000000
vt 0.000000 0.000000
vt 0.000000 0.000000
vt 0.000000 0.000000
vt 0.000000 0.000000
vt 0.000000 0.000000
vt 0.000000 0.000000
vt 0.000000 0.000000
vt 0.000000 0.000000
vt 0.000000 0.000000
vt 0.000000 0.000000
vt 0.000000 0.000000
vt 0.000000 0.000000
vt 0.000000 0.000000
vt 0.000000 0.000000
vt 0.000000 0.000000
vt 0.000000 0.000000
vt 0.000000 0.000000
vt 0.000000 0.000000
vt 0.000000 0.000000
vt 0.000000 0.000000
vt 0.000000 0.000000
vt 0.000000 0.000000
vt 0.000000 0.000000
vt 0.000000 0.000000
vt 0.000000 0.000000
vt 0.000000 0.000000
vt 0.000000 0.000000
vt 0.000000 0.000000
vt 0.000000 0.000000
vt 0.000000 0.000000
vt 0.000000 0.000000
vt 0.000000 0.000000
vt 0.000000 0.000000
vt 0.000000 0.000000
vt 0.000000 0.000000
vt 0.000000 0.000000
vt 0.000000 0.000000
vt 0.000000 0.000000
vt 0.000000 0.000000
vt 0.000000 0.000000
vt 0.000000 0.000000
vt 0.000000 0.000000
vt 0.000000 0.000000
vt 0.000000 0.000000
vt 0.000000 0.000000
vt 0.000000 0.000000
vt 0.000000 0.000000
vt 0.000000 0.000000
vt 0.000000 0.000000
vt 0.000000 0.000000
vt 0.000000 0.000000
vt 0.000000 0.000000
vt 0.000000 0.000000
vt 0.000000 0.000000
vt 0.000000 0.000000
vt 0.000000 0.000000
vt 0.000000 0.000000
vt 0.000000 0.000000
vt 0.000000 0.000000
vt 0.000000 0.000000
vt 0.000000 0.000000
vt 0.000000 0.000000
vt 0.000000 0.000000
vt 0.000000 0.000000
vt 0.000000 0.000000
vt 0.000000 0.000000
vt 0.000000 0.000000
vt 0.000000 0.000000
vt 0.000000 0.000000
vt 0.000000 0.000000
vt 0.000000 0.000000
vt 0.000000 0.000000
vt 0.000000 0.000000
vt 0.000000 0.000000
vt 0.000000 0.000000
vt 0.000000 0.000000
vt 0.000000 0.000000
vt 0.000000 0.000000
vt 0.000000 0.000000
vt 0.000000 0.000000
vt 0.000000 0.000000
vt 0.000000 0.000000
vt 0.000000 0.000000
vt 0.000000 0.000000
vt 0.000000 0.000000
vt 0.000000 0.000000
vt 0.000000 0.000000
vt 0.000000 0.000000
vt 0.000000 0.000000
vt 0.000000 0.000000
vt 0.000000 0.000000
vt 0.000000 0.000000
vt 0.000000 0.000000
vt 0.000000 0.000000
vt 0.000000 0.000000
vt 0.000000 0.000000
vt 0.000000 0.000000
vt 0.000000 0.000000
vt 0.000000 0.000000
vt 0.000000 0.000000
vt 0.000000 0.000000
vt 0.000000 0.000000
vt 0.000000 0.000000
vt 0.000000 0.000000
vt 0.000000 0.000000
vt 0.000000 0.000000
vt 0.000000 0.000000
vt 0.000000 0.000000
vt 0.000000 0.000000
vt 0.000000 0.000000
vt 0.000000 0.000000
vt 0.000000 0.000000
vt 0.000000 0.000000
vt 0.000000 0.000000
vt 0.000000 0.000000
vt 0.000000 0.000000
vt 0.000000 0.000000
vt 0.000000 0.000000
vt 0.000000 0.000000
vt 0.000000 0.000000
vt 0.000000 0.000000
vt 0.000000 0.000000
vt 0.000000 0.000000
vt 0.000000 0.000000
vt 0.000000 0.000000
vt 0.000000 0.000000
vt 0.000000 0.000000
vt 0.000000 0.000000
vt 0.000000 0.000000
vt 0.000000 0.000000
vt 0.000000 0.000000
vt 0.000000 0.000000
vt 0.000000 0.000000
vt 0.000000 0.000000
vt 0.000000 0.000000
vt 0.000000 0.000000
vt 0.000000 0.000000
vt 0.000000 0.000000
vt 0.000000 0.000000
vt 0.000000 0.000000
vt 0.000000 0.000000
vt 0.000000 0.000000
vt 0.000000 0.000000
vt 0.000000 0.000000
vt 0.000000 0.000000
vt 0.000000 0.000000
vt 0.000000 0.000000
vt 0.000000 0.000000
s 0
usemtl pneu
f 264/264/1 13/13/1 261/261/1
f 303/303/2 26/26/2 300/300/2
f 261/261/3 12/12/3 258/258/3
f 300/300/4 25/25/4 297/297/4
f 258/258/5 11/11/5 255/255/5
f 297/297/6 24/24/6 294/294/6
f 255/255/7 10/10/7 252/252/7
f 294/294/8 23/23/8 291/291/8
f 252/252/9 9/9/9 249/249/9
f 291/291/10 22/22/10 288/288/10
f 249/249/11 8/8/11 246/246/11
f 288/288/12 21/21/12 285/285/12
f 246/246/13 7/7/13 243/243/13
f 285/285/14 20/20/14 282/282/14
f 243/243/15 6/6/15 240/240/15
f 282/282/16 19/19/16 279/279/16
f 240/240/17 5/5/17 237/237/17
f 279/279/18 18/18/18 276/276/18
f 237/237/19 4/4/19 234/234/19
f 276/276/20 17/17/20 273/273/20
f 315/315/21 30/30/21 312/312/21
s 1
f 125/125/22 320/320/23 128/128/24
s 0
f 273/273/25 16/16/25 270/270/25
f 312/312/26 29/29/26 309/309/26
f 231/231/27 2/2/27 228/228/27
f 270/270/28 15/15/28 267/267/28
f 309/309/29 28/28/29 306/306/29
f 267/267/30 14/14/30 264/264/30
f 306/306/31 27/27/31 303/303/31
s 1
f 36/36/32 314/314/33 38/38/34
f 188/188/35 96/96/36 191/191/37
f 152/152/38 54/54/39 57/57/40
f 191/191/37 99/99/41 194/194/42
f 155/155/43 57/57/40 60/60/44
f 194/194/42 102/102/45 197/197/46
f 155/155/43 63/63/47 158/158/48
f 197/197/46 105/105/49 200/200/50
f 161/161/51 63/63/47 66/66/52
f 200/200/50 108/108/53 203/203/54
f 161/161/51 69/69/55 164/164/56
f 203/203/54 111/111/57 206/206/58
f 164/164/56 72/72/59 167/167/60
f 206/206/58 114/114/61 209/209/62
f 167/167/60 75/75/63 170/170/64
f 209/209/62 117/117/65 212/212/66
f 170/170/64 78/78/67 173/173/68
f 212/212/66 120/120/69 215/215/70
f 173/173/68 81/81/71 176/176/72
f 224/224/73 35/35/74 132/132/75
f 215/215/70 123/123/76 218/218/77
f 176/176/72 84/84/78 179/179/79
f 137/137/80 45/45/81 140/140/82
f 218/218/77 126/126/83 221/221/84
f 179/179/79 87/87/85 182/182/86
f 140/140/82 48/48/87 143/143/88
f 221/221/84 129/129/89 224/224/73
f 182/182/86 90/90/90 185/185/91
f 143/143/88 51/51/92 146/146/93
f 185/185/91 93/93/94 188/188/35
f 146/146/93 54/54/39 149/149/95
f 134/134/96 42/42/97 137/137/80
s 0
f 210/210/98 213/213/98 1/1/98
f 171/171/98 174/174/98 1/1/98
f 131/131/98 135/135/98 1/1/98
f 213/213/98 216/216/98 1/1/98
f 174/174/98 177/177/98 1/1/98
f 135/135/98 138/138/98 1/1/98
f 216/216/98 219/219/98 1/1/98
f 177/177/98 180/180/98 1/1/98
f 138/138/98 141/141/98 1/1/98
f 219/219/98 222/222/98 1/1/98
f 180/180/98 183/183/98 1/1/98
f 141/141/98 144/144/98 1/1/98
f 222/222/98 225/225/98 1/1/98
f 183/183/98 186/186/98 1/1/98
f 144/144/98 147/147/98 1/1/98
f 225/225/98 131/131/98 1/1/98
f 186/186/98 189/189/98 1/1/98
f 147/147/98 150/150/98 1/1/98
f 189/189/98 192/192/98 1/1/98
f 150/150/98 153/153/98 1/1/98
f 192/192/98 195/195/98 1/1/98
f 153/153/98 156/156/98 1/1/98
f 195/195/98 198/198/98 1/1/98
f 156/156/98 159/159/98 1/1/98
f 198/198/98 201/201/98 1/1/98
f 159/159/98 162/162/98 1/1/98
f 201/201/98 204/204/98 1/1/98
f 162/162/98 165/165/98 1/1/98
f 204/204/98 207/207/98 1/1/98
f 165/165/98 168/168/98 1/1/98
f 207/207/98 210/210/98 1/1/98
f 168/168/98 171/171/98 1/1/98
s 1
f 59/59/99 296/296/100 293/293/101
f 92/92/102 257/257/103 95/95/104
f 53/53/105 296/296/100 56/56/106
f 89/89/107 260/260/108 92/92/102
f 36/36/32 320/320/23 318/318/109
f 50/50/110 299/299/111 53/53/105
f 89/89/107 266/266/112 263/263/113
f 122/122/114 227/227/115 125/125/22
f 47/47/116 302/302/117 50/50/110
f 83/83/118 266/266/112 86/86/119
s 0
f 234/234/120 3/3/120 231/231/120
s 1
f 44/44/121 305/305/122 47/47/116
f 83/83/118 272/272/123 269/269/124
f 119/119/125 230/230/126 122/122/114
f 44/44/121 311/311/127 308/308/128
f 77/77/129 272/272/123 80/80/130
f 119/119/125 236/236/131 233/233/132
f 41/41/133 314/314/33 311/311/127
f 77/77/129 278/278/134 275/275/135
f 116/116/136 239/239/137 236/236/131
s 0
f 321/321/138 32/32/138 317/317/138
s 1
f 71/71/139 278/278/134 74/74/140
f 110/110/141 239/239/137 113/113/142
f 68/68/143 281/281/144 71/71/139
f 107/107/145 242/242/146 110/110/141
f 68/68/143 287/287/147 284/284/148
f 107/107/145 248/248/149 245/245/150
f 104/104/151 251/251/152 248/248/149
f 62/62/153 287/287/147 65/65/154
f 98/98/155 251/251/152 101/101/156
f 59/59/99 290/290/157 62/62/153
f 95/95/104 254/254/158 98/98/155
f 35/35/74 40/40/160 39/39/161
f 37/37/162 38/38/34 40/40/160
f 42/42/97 40/40/160 43/43/163
f 40/40/160 41/41/133 43/43/163
f 45/45/81 43/43/163 46/46/164
f 43/43/163 44/44/121 46/46/164
f 48/48/87 46/46/164 49/49/165
f 49/49/165 44/44/121 47/47/116
f 51/51/92 49/49/165 52/52/166
f 52/52/166 47/47/116 50/50/110
f 54/54/39 52/52/166 55/55/167
f 52/52/166 53/53/105 55/55/167
f 54/54/39 58/58/168 57/57/40
f 55/55/167 56/56/106 58/58/168
f 57/57/40 61/61/169 60/60/44
f 58/58/168 59/59/99 61/61/169
f 60/60/44 64/64/170 63/63/47
f 61/61/169 62/62/153 64/64/170
f 63/63/47 67/67/171 66/66/52
f 64/64/170 65/65/154 67/67/171
f 69/69/55 67/67/171 70/70/172
f 67/67/171 68/68/143 70/70/172
f 72/72/59 70/70/172 73/73/173
f 70/70/172 71/71/139 73/73/173
f 72/72/59 76/76/174 75/75/63
f 76/76/174 71/71/139 74/74/140
f 75/75/63 79/79/175 78/78/67
f 79/79/175 74/74/140 77/77/129
f 78/78/67 82/82/176 81/81/71
f 79/79/175 80/80/130 82/82/176
f 81/81/71 85/85/177 84/84/78
f 82/82/176 83/83/118 85/85/177
f 84/84/78 88/88/178 87/87/85
f 85/85/177 86/86/119 88/88/178
f 87/87/85 91/91/179 90/90/90
f 88/88/178 89/89/107 91/91/179
f 90/90/90 94/94/180 93/93/94
f 91/91/179 92/92/102 94/94/180
f 93/93/94 97/97/181 96/96/36
f 97/97/181 92/92/102 95/95/104
f 96/96/36 100/100/182 99/99/41
f 97/97/181 98/98/155 100/100/182
f 99/99/41 103/103/183 102/102/45
f 103/103/183 98/98/155 101/101/156
f 102/102/45 106/106/184 105/105/49
f 103/103/183 104/104/151 106/106/184
f 105/105/49 109/109/185 108/108/53
f 106/106/184 107/107/145 109/109/185
f 111/111/57 109/109/185 112/112/186
f 109/109/185 110/110/141 112/112/186
f 111/111/57 115/115/187 114/114/61
f 115/115/187 110/110/141 113/113/142
f 114/114/61 118/118/188 117/117/65
f 115/115/187 116/116/136 118/118/188
f 117/117/65 121/121/189 120/120/69
f 121/121/189 116/116/136 119/119/125
f 123/123/76 121/121/189 124/124/190
f 124/124/190 119/119/125 122/122/114
f 126/126/83 124/124/190 127/127/191
f 124/124/190 125/125/22 127/127/191
f 129/129/89 127/127/191 130/130/192
f 127/127/191 128/128/24 130/130/192
f 129/129/89 37/37/162 35/35/74
f 130/130/192 36/36/32 37/37/162
s 0
f 317/317/193 31/31/193 315/315/193
s 1
f 131/131/194 136/136/195 135/135/196
f 133/133/197 134/134/96 136/136/195
f 138/138/198 136/136/195 139/139/199
f 136/136/195 137/137/80 139/139/199
f 138/138/198 142/142/200 141/141/201
f 142/142/200 137/137/80 140/140/82
f 141/141/201 145/145/202 144/144/203
f 142/142/200 143/143/88 145/145/202
f 144/144/203 148/148/204 147/147/205
f 148/148/204 143/143/88 146/146/93
f 147/147/205 151/151/206 150/150/207
f 148/148/204 149/149/95 151/151/206
f 153/153/208 151/151/206 154/154/209
f 154/154/209 149/149/95 152/152/38
f 153/153/208 157/157/210 156/156/211
f 154/154/209 155/155/43 157/157/210
f 159/159/212 157/157/210 160/160/213
f 157/157/210 158/158/48 160/160/213
f 162/162/214 160/160/213 163/163/215
f 163/163/215 158/158/48 161/161/51
f 162/162/214 166/166/216 165/165/217
f 163/163/215 164/164/56 166/166/216
f 168/168/218 166/166/216 169/169/219
f 166/166/216 167/167/60 169/169/219
f 168/168/218 172/172/220 171/171/221
f 169/169/219 170/170/64 172/172/220
f 171/171/221 175/175/222 174/174/223
f 172/172/220 173/173/68 175/175/222
f 177/177/224 175/175/222 178/178/225
f 175/175/222 176/176/72 178/178/225
f 177/177/224 181/181/226 180/180/227
f 181/181/226 176/176/72 179/179/79
f 183/183/228 181/181/226 184/184/229
f 181/181/226 182/182/86 184/184/229
f 183/183/228 187/187/230 186/186/231
f 184/184/229 185/185/91 187/187/230
f 189/189/232 187/187/230 190/190/233
f 187/187/230 188/188/35 190/190/233
f 192/192/234 190/190/233 193/193/235
f 193/193/235 188/188/35 191/191/37
f 195/195/236 193/193/235 196/196/237
f 193/193/235 194/194/42 196/196/237
f 195/195/236 199/199/238 198/198/239
f 196/196/237 197/197/46 199/199/238
f 198/198/239 202/202/240 201/201/241
f 199/199/238 200/200/50 202/202/240
f 201/201/241 205/205/242 204/204/243
f 202/202/240 203/203/54 205/205/242
f 207/207/244 205/205/242 208/208/245
f 208/208/245 203/203/54 206/206/58
f 207/207/244 211/211/246 210/210/247
f 208/208/245 209/209/62 211/211/246
f 213/213/248 211/211/246 214/214/249
f 211/211/246 212/212/66 214/214/249
f 216/216/250 214/214/249 217/217/251
f 214/214/249 215/215/70 217/217/251
f 219/219/252 217/217/251 220/220/253
f 217/217/251 218/218/77 220/220/253
f 222/222/254 220/220/253 223/223/255
f 220/220/253 221/221/84 223/223/255
f 222/222/254 226/226/256 225/225/257
f 223/223/255 224/224/73 226/226/256
f 225/225/257 133/133/197 131/131/194
f 226/226/256 132/132/75 133/133/197
f 132/132/75 39/39/161 134/134/96
f 318/318/109 322/322/258 319/319/259
f 322/322/258 317/317/260 319/319/259
f 320/320/23 229/229/261 322/322/258
f 229/229/261 321/321/262 322/322/258
f 230/230/126 229/229/261 227/227/115
f 232/232/263 228/228/264 229/229/261
f 233/233/132 232/232/263 230/230/126
f 232/232/263 234/234/265 231/231/266
f 233/233/132 238/238/267 235/235/268
f 235/235/268 237/237/269 234/234/265
f 239/239/137 238/238/267 236/236/131
f 241/241/270 237/237/269 238/238/267
f 239/239/137 244/244/271 241/241/270
f 241/241/270 243/243/272 240/240/273
f 245/245/150 244/244/271 242/242/146
f 244/244/271 246/246/274 243/243/272
f 245/245/150 250/250/275 247/247/276
f 250/250/275 246/246/274 247/247/276
f 248/248/149 253/253/277 250/250/275
f 253/253/277 249/249/278 250/250/275
f 254/254/158 253/253/277 251/251/152
f 256/256/279 252/252/280 253/253/277
f 257/257/103 256/256/279 254/254/158
f 256/256/279 258/258/281 255/255/282
f 260/260/108 259/259/283 257/257/103
f 262/262/284 258/258/281 259/259/283
f 263/263/113 262/262/284 260/260/108
f 265/265/285 261/261/286 262/262/284
f 263/263/113 268/268/287 265/265/285
f 268/268/287 264/264/288 265/265/285
f 269/269/124 268/268/287 266/266/112
f 271/271/289 267/267/290 268/268/287
f 269/269/124 274/274/291 271/271/289
f 271/271/289 273/273/292 270/270/293
f 272/272/123 277/277/294 274/274/291
f 277/277/294 273/273/292 274/274/291
f 278/278/134 277/277/294 275/275/135
f 280/280/295 276/276/296 277/277/294
f 281/281/144 280/280/295 278/278/134
f 283/283/297 279/279/298 280/280/295
f 284/284/148 283/283/297 281/281/144
f 286/286/299 282/282/300 283/283/297
f 284/284/148 289/289/301 286/286/299
f 289/289/301 285/285/302 286/286/299
f 290/290/157 289/289/301 287/287/147
f 289/289/301 291/291/303 288/288/304
f 293/293/101 292/292/305 290/290/157
f 292/292/305 294/294/306 291/291/303
f 296/296/100 295/295/307 293/293/101
f 298/298/308 294/294/306 295/295/307
f 299/299/111 298/298/308 296/296/100
f 301/301/309 297/297/310 298/298/308
f 302/302/117 301/301/309 299/299/111
f 301/301/309 303/303/311 300/300/312
f 302/302/117 307/307/313 304/304/314
f 307/307/313 303/303/311 304/304/314
f 308/308/128 307/307/313 305/305/122
f 307/307/313 309/309/315 306/306/316
f 308/308/128 313/313/317 310/310/318
f 310/310/318 312/312/319 309/309/315
f 314/314/33 313/313/317 311/311/127
f 313/313/317 315/315/320 312/312/319
f 318/318/109 316/316/321 314/314/33
f 319/319/259 315/315/320 316/316/321
s 0
f 228/228/322 33/33/322 321/321/322
f 264/264/1 14/14/1 13/13/1
f 303/303/2 27/27/2 26/26/2
f 261/261/3 13/13/3 12/12/3
f 300/300/4 26/26/4 25/25/4
f 258/258/5 12/12/5 11/11/5
f 297/297/6 25/25/6 24/24/6
f 255/255/7 11/11/7 10/10/7
f 294/294/8 24/24/8 23/23/8
f 252/252/9 10/10/9 9/9/9
f 291/291/10 23/23/10 22/22/10
f 249/249/11 9/9/11 8/8/11
f 288/288/12 22/22/12 21/21/12
f 246/246/13 8/8/13 7/7/13
f 285/285/14 21/21/14 20/20/14
f 243/243/15 7/7/15 6/6/15
f 282/282/16 20/20/16 19/19/16
f 240/240/17 6/6/17 5/5/17
f 279/279/18 19/19/18 18/18/18
f 237/237/19 5/5/19 4/4/19
f 276/276/20 18/18/20 17/17/20
f 315/315/21 31/31/21 30/30/21
s 1
f 125/125/22 227/227/115 320/320/23
s 0
f 273/273/25 17/17/25 16/16/25
f 312/312/26 30/30/26 29/29/26
f 231/231/27 3/3/27 2/2/27
f 270/270/28 16/16/28 15/15/28
f 309/309/29 29/29/29 28/28/29
f 267/267/30 15/15/30 14/14/30
f 306/306/31 28/28/31 27/27/31
s 1
f 36/36/32 318/318/109 314/314/33
f 188/188/35 93/93/94 96/96/36
f 152/152/38 149/149/95 54/54/39
f 191/191/37 96/96/36 99/99/41
f 155/155/43 152/152/38 57/57/40
f 194/194/42 99/99/41 102/102/45
f 155/155/43 60/60/44 63/63/47
f 197/197/46 102/102/45 105/105/49
f 161/161/51 158/158/48 63/63/47
f 200/200/50 105/105/49 108/108/53
f 161/161/51 66/66/52 69/69/55
f 203/203/54 108/108/53 111/111/57
f 164/164/56 69/69/55 72/72/59
f 206/206/58 111/111/57 114/114/61
f 167/167/60 72/72/59 75/75/63
f 209/209/62 114/114/61 117/117/65
f 170/170/64 75/75/63 78/78/67
f 212/212/66 117/117/65 120/120/69
f 173/173/68 78/78/67 81/81/71
f 224/224/73 129/129/89 35/35/74
f 215/215/70 120/120/69 123/123/76
f 176/176/72 81/81/71 84/84/78
f 137/137/80 42/42/97 45/45/81
f 218/218/77 123/123/76 126/126/83
f 179/179/79 84/84/78 87/87/85
f 140/140/82 45/45/81 48/48/87
f 221/221/84 126/126/83 129/129/89
f 182/182/86 87/87/85 90/90/90
f 143/143/88 48/48/87 51/51/92
f 185/185/91 90/90/90 93/93/94
f 146/146/93 51/51/92 54/54/39
f 134/134/96 39/39/161 42/42/97
f 59/59/99 56/56/106 296/296/100
f 92/92/102 260/260/108 257/257/103
f 53/53/105 299/299/111 296/296/100
f 89/89/107 263/263/113 260/260/108
f 36/36/32 128/128/24 320/320/23
f 50/50/110 302/302/117 299/299/111
f 89/89/107 86/86/119 266/266/112
f 122/122/114 230/230/126 227/227/115
f 47/47/116 305/305/122 302/302/117
f 83/83/118 269/269/124 266/266/112
s 0
f 234/234/120 4/4/120 3/3/120
s 1
f 44/44/121 308/308/128 305/305/122
f 83/83/118 80/80/130 272/272/123
f 119/119/125 233/233/132 230/230/126
f 44/44/121 41/41/133 311/311/127
f 77/77/129 275/275/135 272/272/123
f 119/119/125 116/116/136 236/236/131
f 41/41/133 38/38/34 314/314/33
f 77/77/129 74/74/140 278/278/134
f 116/116/136 113/113/142 239/239/137
s 0
f 321/321/138 33/33/138 32/32/138
s 1
f 71/71/139 281/281/144 278/278/134
f 110/110/141 242/242/146 239/239/137
f 68/68/143 284/284/148 281/281/144
f 107/107/145 245/245/150 242/242/146
f 68/68/143 65/65/154 287/287/147
f 107/107/145 104/104/151 248/248/149
f 104/104/151 101/101/156 251/251/152
f 62/62/153 290/290/157 287/287/147
f 98/98/155 254/254/158 251/251/152
f 59/59/99 293/293/101 290/290/157
f 95/95/104 257/257/103 254/254/158
f 35/35/74 37/37/162 40/40/160
f 37/37/162 36/36/32 38/38/34
f 42/42/97 39/39/161 40/40/160
f 40/40/160 38/38/34 41/41/133
f 45/45/81 42/42/97 43/43/163
f 43/43/163 41/41/133 44/44/121
f 48/48/87 45/45/81 46/46/164
f 49/49/165 46/46/164 44/44/121
f 51/51/92 48/48/87 49/49/165
f 52/52/166 49/49/165 47/47/116
f 54/54/39 51/51/92 52/52/166
f 52/52/166 50/50/110 53/53/105
f 54/54/39 55/55/167 58/58/168
f 55/55/167 53/53/105 56/56/106
f 57/57/40 58/58/168 61/61/169
f 58/58/168 56/56/106 59/59/99
f 60/60/44 61/61/169 64/64/170
f 61/61/169 59/59/99 62/62/153
f 63/63/47 64/64/170 67/67/171
f 64/64/170 62/62/153 65/65/154
f 69/69/55 66/66/52 67/67/171
f 67/67/171 65/65/154 68/68/143
f 72/72/59 69/69/55 70/70/172
f 70/70/172 68/68/143 71/71/139
f 72/72/59 73/73/173 76/76/174
f 76/76/174 73/73/173 71/71/139
f 75/75/63 76/76/174 79/79/175
f 79/79/175 76/76/174 74/74/140
f 78/78/67 79/79/175 82/82/176
f 79/79/175 77/77/129 80/80/130
f 81/81/71 82/82/176 85/85/177
f 82/82/176 80/80/130 83/83/118
f 84/84/78 85/85/177 88/88/178
f 85/85/177 83/83/118 86/86/119
f 87/87/85 88/88/178 91/91/179
f 88/88/178 86/86/119 89/89/107
f 90/90/90 91/91/179 94/94/180
f 91/91/179 89/89/107 92/92/102
f 93/93/94 94/94/180 97/97/181
f 97/97/181 94/94/180 92/92/102
f 96/96/36 97/97/181 100/100/182
f 97/97/181 95/95/104 98/98/155
f 99/99/41 100/100/182 103/103/183
f 103/103/183 100/100/182 98/98/155
f 102/102/45 103/103/183 106/106/184
f 103/103/183 101/101/156 104/104/151
f 105/105/49 106/106/184 109/109/185
f 106/106/184 104/104/151 107/107/145
f 111/111/57 108/108/53 109/109/185
f 109/109/185 107/107/145 110/110/141
f 111/111/57 112/112/186 115/115/187
f 115/115/187 112/112/186 110/110/141
f 114/114/61 115/115/187 118/118/188
f 115/115/187 113/113/142 116/116/136
f 117/117/65 118/118/188 121/121/189
f 121/121/189 118/118/188 116/116/136
f 123/123/76 120/120/69 121/121/189
f 124/124/190 121/121/189 119/119/125
f 126/126/83 123/123/76 124/124/190
f 124/124/190 122/122/114 125/125/22
f 129/129/89 126/126/83 127/127/191
f 127/127/191 125/125/22 128/128/24
f 129/129/89 130/130/192 37/37/162
f 130/130/192 128/128/24 36/36/32
s 0
f 317/317/193 32/32/193 31/31/193
s 1
f 131/131/194 133/133/197 136/136/195
f 133/133/197 132/132/75 134/134/96
f 138/138/198 135/135/196 136/136/195
f 136/136/195 134/134/96 137/137/80
f 138/138/198 139/139/199 142/142/200
f 142/142/200 139/139/199 137/137/80
f 141/141/201 142/142/200 145/145/202
f 142/142/200 140/140/82 143/143/88
f 144/144/203 145/145/202 148/148/204
f 148/148/204 145/145/202 143/143/88
f 147/147/205 148/148/204 151/151/206
f 148/148/204 146/146/93 149/149/95
f 153/153/208 150/150/207 151/151/206
f 154/154/209 151/151/206 149/149/95
f 153/153/208 154/154/209 157/157/210
f 154/154/209 152/152/38 155/155/43
f 159/159/212 156/156/211 157/157/210
f 157/157/210 155/155/43 158/158/48
f 162/162/214 159/159/212 160/160/213
f 163/163/215 160/160/213 158/158/48
f 162/162/214 163/163/215 166/166/216
f 163/163/215 161/161/51 164/164/56
f 168/168/218 165/165/217 166/166/216
f 166/166/216 164/164/56 167/167/60
f 168/168/218 169/169/219 172/172/220
f 169/169/219 167/167/60 170/170/64
f 171/171/221 172/172/220 175/175/222
f 172/172/220 170/170/64 173/173/68
f 177/177/224 174/174/223 175/175/222
f 175/175/222 173/173/68 176/176/72
f 177/177/224 178/178/225 181/181/226
f 181/181/226 178/178/225 176/176/72
f 183/183/228 180/180/227 181/181/226
f 181/181/226 179/179/79 182/182/86
f 183/183/228 184/184/229 187/187/230
f 184/184/229 182/182/86 185/185/91
f 189/189/232 186/186/231 187/187/230
f 187/187/230 185/185/91 188/188/35
f 192/192/234 189/189/232 190/190/233
f 193/193/235 190/190/233 188/188/35
f 195/195/236 192/192/234 193/193/235
f 193/193/235 191/191/37 194/194/42
f 195/195/236 196/196/237 199/199/238
f 196/196/237 194/194/42 197/197/46
f 198/198/239 199/199/238 202/202/240
f 199/199/238 197/197/46 200/200/50
f 201/201/241 202/202/240 205/205/242
f 202/202/240 200/200/50 203/203/54
f 207/207/244 204/204/243 205/205/242
f 208/208/245 205/205/242 203/203/54
f 207/207/244 208/208/245 211/211/246
f 208/208/245 206/206/58 209/209/62
f 213/213/248 210/210/247 211/211/246
f 211/211/246 209/209/62 212/212/66
f 216/216/250 213/213/248 214/214/249
f 214/214/249 212/212/66 215/215/70
f 219/219/252 216/216/250 217/217/251
f 217/217/251 215/215/70 218/218/77
f 222/222/254 219/219/252 220/220/253
f 220/220/253 218/218/77 221/221/84
f 222/222/254 223/223/255 226/226/256
f 223/223/255 221/221/84 224/224/73
f 225/225/257 226/226/256 133/133/197
f 226/226/256 224/224/73 132/132/75
f 132/132/75 35/35/74 39/39/161
f 318/318/109 320/320/23 322/322/258
f 322/322/258 321/321/262 317/317/260
f 320/320/23 227/227/115 229/229/261
f 229/229/261 228/228/264 321/321/262
f 230/230/126 232/232/263 229/229/261
f 232/232/263 231/231/266 228/228/264
f 233/233/132 235/235/268 232/232/263
f 232/232/263 235/235/268 234/234/265
f 233/233/132 236/236/131 238/238/267
f 235/235/268 238/238/267 237/237/269
f 239/239/137 241/241/270 238/238/267
f 241/241/270 240/240/273 237/237/269
f 239/239/137 242/242/146 244/244/271
f 241/241/270 244/244/271 243/243/272
f 245/245/150 247/247/276 244/244/271
f 244/244/271 247/247/276 246/246/274
f 245/245/150 248/248/149 250/250/275
f 250/250/275 249/249/278 246/246/274
f 248/248/149 251/251/152 253/253/277
f 253/253/277 252/252/280 249/249/278
f 254/254/158 256/256/279 253/253/277
f 256/256/279 255/255/282 252/252/280
f 257/257/103 259/259/283 256/256/279
f 256/256/279 259/259/283 258/258/281
f 260/260/108 262/262/284 259/259/283
f 262/262/284 261/261/286 258/258/281
f 263/263/113 265/265/285 262/262/284
f 265/265/285 264/264/288 261/261/286
f 263/263/113 266/266/112 268/268/287
f 268/268/287 267/267/290 264/264/288
f 269/269/124 271/271/289 268/268/287
f 271/271/289 270/270/293 267/267/290
f 269/269/124 272/272/123 274/274/291
f 271/271/289 274/274/291 273/273/292
f 272/272/123 275/275/135 277/277/294
f 277/277/294 276/276/296 273/273/292
f 278/278/134 280/280/295 277/277/294
f 280/280/295 279/279/298 276/276/296
f 281/281/144 283/283/297 280/280/295
f 283/283/297 282/282/300 279/279/298
f 284/284/148 286/286/299 283/283/297
f 286/286/299 285/285/302 282/282/300
f 284/284/148 287/287/147 289/289/301
f 289/289/301 288/288/304 285/285/302
f 290/290/157 292/292/305 289/289/301
f 289/289/301 292/292/305 291/291/303
f 293/293/101 295/295/307 292/292/305
f 292/292/305 295/295/307 294/294/306
f 296/296/100 298/298/308 295/295/307
f 298/298/308 297/297/310 294/294/306
f 299/299/111 301/301/309 298/298/308
f 301/301/309 300/300/312 297/297/310
f 302/302/117 304/304/314 301/301/309
f 301/301/309 304/304/314 303/303/311
f 302/302/117 305/305/122 307/307/313
f 307/307/313 306/306/316 303/303/311
f 308/308/128 310/310/318 307/307/313
f 307/307/313 310/310/318 309/309/315
f 308/308/128 311/311/127 313/313/317
f 310/310/318 313/313/317 312/312/319
f 314/314/33 316/316/321 313/313/317
f 313/313/317 316/316/321 315/315/320
f 318/318/109 319/319/259 316/316/321
f 319/319/259 317/317/260 315/315/320
s 0
f 228/228/322 2/2/322 33/33/322
usemtl calota
f 32/32/159 33/33/159 34/34/159
f 27/27/159 28/28/159 34/34/159
f 14/14/159 15/15/159 34/34/159
f 33/33/159 2/2/159 34/34/159
f 28/28/159 29/29/159 34/34/159
f 15/15/159 16/16/159 34/34/159
f 2/2/159 3/3/159 34/34/159
f 29/29/159 30/30/159 34/34/159
f 16/16/159 17/17/159 34/34/159
f 3/3/159 4/4/159 34/34/159
f 30/30/159 31/31/159 34/34/159
f 17/17/159 18/18/159 34/34/159
f 4/4/159 5/5/159 34/34/159
f 31/31/159 32/32/159 34/34/159
f 18/18/159 19/19/159 34/34/159
f 5/5/159 6/6/159 34/34/159
f 19/19/159 20/20/159 34/34/159
f 6/6/159 7/7/159 34/34/159
f 20/20/159 21/21/159 34/34/159
f 7/7/159 8/8/159 34/34/159
f 21/21/159 22/22/159 34/34/159
f 8/8/159 9/9/159 34/34/159
f 22/22/159 23/23/159 34/34/159
f 9/9/159 10/10/159 34/34/159
f 23/23/159 24/24/159 34/34/159
f 10/10/159 11/11/159 34/34/159
f 24/24/159 25/25/159 34/34/159
f 11/11/159 12/12/159 34/34/159
f 25/25/159 26/26/159 34/34/159
f 12/12/159 13/13/159 34/34/159
f 26/26/159 27/27/159 34/34/159
f 13/13/159 14/14/159 34/34/159
