%YAML 1.1
%TAG !u! tag:unity3d.com,2011:
--- !u!1 &9033963289416021125
GameObject:
  m_ObjectHideFlags: 0
  m_CorrespondingSourceObject: {fileID: 0}
  m_PrefabInstance: {fileID: 0}
  m_PrefabAsset: {fileID: 0}
  serializedVersion: 6
  m_Component:
  - component: {fileID: 9033963289416021124}
  - component: {fileID: 9033963289416021127}
  - component: {fileID: 9033963289416021177}
  - component: {fileID: 9033963289416021126}
  - component: {fileID: 9185448262713847816}
  - component: {fileID: 9185448263309529078}
  m_Layer: 0
  m_Name: Obstacle
  m_TagString: ObstacleTag
  m_Icon: {fileID: 0}
  m_NavMeshLayer: 0
  m_StaticEditorFlags: 0
  m_IsActive: 1
--- !u!4 &9033963289416021124
Transform:
  m_ObjectHideFlags: 0
  m_CorrespondingSourceObject: {fileID: 0}
  m_PrefabInstance: {fileID: 0}
  m_PrefabAsset: {fileID: 0}
  m_GameObject: {fileID: 9033963289416021125}
  m_LocalRotation: {x: 0, y: 0, z: 0, w: 1}
  m_LocalPosition: {x: 0, y: 0, z: 0}
  m_LocalScale: {x: 0.5128, y: 0.5128, z: 0.5128}
  m_Children: []
  m_Father: {fileID: 0}
  m_RootOrder: 0
  m_LocalEulerAnglesHint: {x: 0, y: 0, z: 0}
--- !u!212 &9033963289416021127
SpriteRenderer:
  m_ObjectHideFlags: 0
  m_CorrespondingSourceObject: {fileID: 0}
  m_PrefabInstance: {fileID: 0}
  m_PrefabAsset: {fileID: 0}
  m_GameObject: {fileID: 9033963289416021125}
  m_Enabled: 1
  m_CastShadows: 0
  m_ReceiveShadows: 0
  m_DynamicOccludee: 1
  m_MotionVectors: 1
  m_LightProbeUsage: 1
  m_ReflectionProbeUsage: 1
  m_RayTracingMode: 0
  m_RayTraceProcedural: 0
  m_RenderingLayerMask: 1
  m_RendererPriority: 0
  m_Materials:
  - {fileID: 10754, guid: 0000000000000000f000000000000000, type: 0}
  m_StaticBatchInfo:
    firstSubMesh: 0
    subMeshCount: 0
  m_StaticBatchRoot: {fileID: 0}
  m_ProbeAnchor: {fileID: 0}
  m_LightProbeVolumeOverride: {fileID: 0}
  m_ScaleInLightmap: 1
  m_ReceiveGI: 1
  m_PreserveUVs: 0
  m_IgnoreNormalsForChartDetection: 0
  m_ImportantGI: 0
  m_StitchLightmapSeams: 1
  m_SelectedEditorRenderState: 0
  m_MinimumChartSize: 4
  m_AutoUVMaxDistance: 0.5
  m_AutoUVMaxAngle: 89
  m_LightmapParameters: {fileID: 0}
  m_SortingLayerID: 0
  m_SortingLayer: 0
  m_SortingOrder: 0
  m_Sprite: {fileID: -2413806693520163455, guid: ebe73ca9363db456bacf42c025bb4847, type: 3}
  m_Color: {r: 1, g: 1, b: 1, a: 1}
  m_FlipX: 0
  m_FlipY: 0
  m_DrawMode: 0
  m_Size: {x: 1, y: 1}
  m_AdaptiveModeThreshold: 0.5
  m_SpriteTileMode: 0
  m_WasSpriteAssigned: 1
  m_MaskInteraction: 0
  m_SpriteSortPoint: 0
--- !u!114 &9033963289416021177
MonoBehaviour:
  m_ObjectHideFlags: 0
  m_CorrespondingSourceObject: {fileID: 0}
  m_PrefabInstance: {fileID: 0}
  m_PrefabAsset: {fileID: 0}
  m_GameObject: {fileID: 9033963289416021125}
  m_Enabled: 1
  m_EditorHideFlags: 0
  m_Script: {fileID: -1465209106, guid: c8d0ad23af520fe46aabe2b1fecf6462, type: 3}
  m_Name: 
  m_EditorClassIdentifier: 
  _data:
    _json: '{"declarations":{"collection":{"$content":[{"name":"ObstacleSpeed","value":{"$content":0.008,"$type":"System.Single"},"$version":"A"}],"$version":"A"},"$version":"A"}}'
    _objectReferences: []
--- !u!114 &9033963289416021126
MonoBehaviour:
  m_ObjectHideFlags: 0
  m_CorrespondingSourceObject: {fileID: 0}
  m_PrefabInstance: {fileID: 0}
  m_PrefabAsset: {fileID: 0}
  m_GameObject: {fileID: 9033963289416021125}
  m_Enabled: 1
  m_EditorHideFlags: 0
  m_Script: {fileID: -57143145, guid: a040fb66244a7f54289914d98ea4ef7d, type: 3}
  m_Name: 
  m_EditorClassIdentifier: 
  _data:
    _json: '{"nest":{"source":"Embed","macro":null,"embed":{"variables":{"collection":{"$content":[],"$version":"A"},"$version":"A"},"controlInputDefinitions":[],"controlOutputDefinitions":[],"valueInputDefinitions":[],"valueOutputDefinitions":[],"title":"ObtacleBehaviour","summary":null,"pan":{"x":201.0221,"y":193.3281},"zoom":0.9,"elements":[{"coroutine":false,"defaultValues":{},"position":{"x":-633.0,"y":-434.0},"guid":"986227fb-9ddc-45cc-982e-eb507748a6dc","$version":"A","$type":"Bolt.Start","$id":"10"},{"chainable":false,"member":{"name":".ctor","parameterTypes":["System.Single","System.Single"],"targetType":"UnityEngine.Vector3","targetTypeName":"UnityEngine.Vector3","$version":"A"},"defaultValues":{"%x":{"$content":0.0,"$type":"System.Single"},"%y":{"$content":0.0,"$type":"System.Single"}},"position":{"x":309.0,"y":95.0},"guid":"c40c4b4f-bc16-4ffa-ba6e-9a0c44f47652","$version":"A","$type":"Bolt.InvokeMember","$id":"12"},{"type":"UnityEngine.Sprite","value":{"$content":0,"$type":"UnityEngine.Object"},"defaultValues":{},"position":{"x":246.0,"y":-200.0},"guid":"1ed54f12-9909-4c94-8030-2ebe6aa85d59","$version":"A","$type":"Bolt.Literal","$id":"15"},{"coroutine":true,"defaultValues":{},"position":{"x":24.0,"y":65.0},"guid":"fb04e856-84af-4c9e-9536-66484f82d8f0","$version":"A","$type":"Bolt.Update","$id":"17"},{"defaultValues":{"seconds":{"$content":0.5,"$type":"System.Single"},"unscaledTime":{"$content":false,"$type":"System.Boolean"}},"position":{"x":-303.0,"y":224.0},"guid":"2c3dfe9f-f2ce-4931-873b-002e1dcfdadd","$version":"A","$type":"Bolt.WaitForSecondsUnit","$id":"19"},{"chainable":false,"member":{"name":"sprite","parameterTypes":null,"targetType":"UnityEngine.SpriteRenderer","targetTypeName":"UnityEngine.SpriteRenderer","$version":"A"},"defaultValues":{"target":null,"input":null},"position":{"x":510.0,"y":-467.0},"guid":"8134c8b3-cd86-4da5-8c7b-462bc30ea56e","$version":"A","$type":"Bolt.SetMember","$id":"21"},{"specifyFallback":false,"kind":"Scene","defaultValues":{"name":{"$content":"ObstacleType","$type":"System.String"}},"position":{"x":-939.0,"y":287.0},"guid":"43201c15-a5ec-4fd8-afb0-c41bc16f9029","$version":"A","$type":"Bolt.GetVariable","$id":"24"},{"coroutine":true,"defaultValues":{},"position":{"x":-837.0,"y":93.0},"guid":"aee80b67-e71a-42c7-a377-14c69e272108","$version":"A","$type":"Bolt.Start","$id":"26"},{"specifyFallback":false,"kind":"Scene","defaultValues":{"name":{"$content":"ObstacleType","$type":"System.String"}},"position":{"x":-619.0,"y":-207.0},"guid":"22efeb4d-8a06-47d1-8cd2-71dd5d4543d4","$version":"A","$type":"Bolt.GetVariable","$id":"28"},{"defaultValues":{},"position":{"x":-491.0,"y":198.0},"guid":"6535c63f-810c-4e4a-b26e-9ee81c7bd812","$version":"A","$type":"Bolt.Branch","$id":"30"},{"type":"UnityEngine.Sprite","value":{"$content":1,"$type":"UnityEngine.Object"},"defaultValues":{},"position":{"x":243.0,"y":-383.0},"guid":"703d4400-01b7-46f7-b947-eb4097e65497","$version":"A","$type":"Bolt.Literal","$id":"32"},{"defaultValues":{},"position":{"x":670.0,"y":310.0},"guid":"f108644e-8cb3-4b2e-b59b-6a0fcb288b2e","$version":"A","$type":"Bolt.Self","$id":"34"},{"kind":"Flow","defaultValues":{"name":{"$content":"EnemyType","$type":"System.String"}},"position":{"x":-412.0,"y":393.0},"guid":"4a426e4d-17c3-4ff5-a6d8-712135375c95","$version":"A","$type":"Bolt.SetVariable","$id":"36"},{"type":"System.String","value":{"$content":"bat","$type":"System.String"},"defaultValues":{},"position":{"x":-665.0,"y":404.0},"guid":"e040db8a-b64a-4a00-aa38-4507b0427a6c","$version":"A","$type":"Bolt.Literal","$id":"38"},{"chainable":false,"member":{"name":"Equals","parameterTypes":["System.String"],"targetType":"System.String","targetTypeName":"System.String","$version":"A"},"defaultValues":{"target":{"$content":"","$type":"System.String"},"%value":{"$content":"bat","$type":"System.String"}},"position":{"x":-659.0,"y":173.0},"guid":"f642aafa-ee07-4616-9a2e-57cecb7eb7b3","$version":"A","$type":"Bolt.InvokeMember","$id":"40"},{"chainable":false,"member":{"name":"sprite","parameterTypes":null,"targetType":"UnityEngine.SpriteRenderer","targetTypeName":"UnityEngine.SpriteRenderer","$version":"A"},"defaultValues":{"target":null,"input":null},"position":{"x":528.0,"y":-265.0},"guid":"03bd59f2-595a-4eec-a76f-a516419d38b4","$version":"A","$type":"Bolt.SetMember","$id":"43"},{"defaultValues":{},"position":{"x":-99.0,"y":-281.0},"guid":"8208d274-92b6-4054-b733-ed27809b329b","$version":"A","$type":"Bolt.Branch","$id":"46"},{"defaultValues":{"seconds":{"$content":5.0,"$type":"System.Single"},"unscaledTime":{"$content":false,"$type":"System.Boolean"}},"position":{"x":633.0,"y":139.0},"guid":"8c1a9b63-cc85-464e-bec7-5f1b4b67e6ee","$version":"A","$type":"Bolt.WaitForSecondsUnit","$id":"48"},{"chainable":false,"member":{"name":"Translate","parameterTypes":["UnityEngine.Vector3"],"targetType":"UnityEngine.Transform","targetTypeName":"UnityEngine.Transform","$version":"A"},"defaultValues":{"target":null,"%translation":{"x":-0.05,"y":0.0,"z":0.0,"$type":"UnityEngine.Vector3"}},"position":{"x":445.0,"y":117.0},"guid":"82a4343b-d552-40d0-9d0e-1190edd67f76","$version":"A","$type":"Bolt.InvokeMember","$id":"50"},{"chainable":false,"member":{"name":"Destroy","parameterTypes":["UnityEngine.Object"],"targetType":"UnityEngine.GameObject","targetTypeName":"UnityEngine.GameObject","$version":"A"},"defaultValues":{"%obj":null},"position":{"x":907.0,"y":179.0},"guid":"5f252973-bc6d-4153-a23a-f35a234c7b11","$version":"A","$type":"Bolt.InvokeMember","$id":"53"},{"defaultValues":{},"position":{"x":199.0,"y":248.0},"guid":"8bb6d179-bc50-4350-a36b-a62400612515","$version":"A","$type":"Bolt.GenericMultiply","$id":"56"},{"type":"System.Single","value":{"$content":-1.0,"$type":"System.Single"},"defaultValues":{},"position":{"x":50.0,"y":377.0},"guid":"c31b1da8-c951-4880-8177-63d0aea10b25","$version":"A","$type":"Bolt.Literal","$id":"58"},{"chainable":false,"member":{"name":"Equals","parameterTypes":["System.String"],"targetType":"System.String","targetTypeName":"System.String","$version":"A"},"defaultValues":{"target":{"$content":"","$type":"System.String"},"%value":{"$content":"mosquito","$type":"System.String"}},"position":{"x":-382.0,"y":-265.0},"guid":"9a1ae810-0841-4402-8aa5-54f63dcecfe7","$version":"A","$type":"Bolt.InvokeMember","$id":"60"},{"specifyFallback":false,"kind":"Object","defaultValues":{"name":{"$content":"ObstacleSpeed","$type":"System.String"},"object":null},"position":{"x":29.0,"y":221.0},"guid":"038c6364-8f67-4ece-99fa-6bd79d327bef","$version":"A","$type":"Bolt.GetVariable","$id":"63"},{"sourceUnit":{"$ref":"26"},"sourceKey":"trigger","destinationUnit":{"$ref":"40"},"destinationKey":"enter","guid":"f46deaa2-f5ab-48dd-9273-4d6aa2a50bfc","$type":"Bolt.ControlConnection"},{"sourceUnit":{"$ref":"12"},"sourceKey":"exit","destinationUnit":{"$ref":"50"},"destinationKey":"enter","guid":"c5addc6c-6f33-4bf9-9d5a-da8850dcda9e","$type":"Bolt.ControlConnection"},{"sourceUnit":{"$ref":"17"},"sourceKey":"trigger","destinationUnit":{"$ref":"12"},"destinationKey":"enter","guid":"504b9038-b909-4a9f-ba43-eec34ffc2e0e","$type":"Bolt.ControlConnection"},{"sourceUnit":{"$ref":"60"},"sourceKey":"exit","destinationUnit":{"$ref":"46"},"destinationKey":"enter","guid":"26629c07-0b81-4ce2-84da-2d2870e2b347","$type":"Bolt.ControlConnection"},{"sourceUnit":{"$ref":"46"},"sourceKey":"ifFalse","destinationUnit":{"$ref":"43"},"destinationKey":"assign","guid":"6533cd6c-9327-4978-bad0-7eb888b23ba5","$type":"Bolt.ControlConnection"},{"sourceUnit":{"$ref":"30"},"sourceKey":"ifTrue","destinationUnit":{"$ref":"19"},"destinationKey":"enter","guid":"b3283a76-6cae-4d5a-a4bd-af9980f722a9","$type":"Bolt.ControlConnection"},{"sourceUnit":{"$ref":"50"},"sourceKey":"exit","destinationUnit":{"$ref":"48"},"destinationKey":"enter","guid":"d191ab6c-4e60-4644-88db-99217a41406e","$type":"Bolt.ControlConnection"},{"sourceUnit":{"$ref":"40"},"sourceKey":"exit","destinationUnit":{"$ref":"30"},"destinationKey":"enter","guid":"d4d823e6-6658-40e0-b2c4-9874a727c3b4","$type":"Bolt.ControlConnection"},{"sourceUnit":{"$ref":"19"},"sourceKey":"exit","destinationUnit":{"$ref":"36"},"destinationKey":"assign","guid":"05a81db5-02d6-4ec8-b26a-86547abcfc27","$type":"Bolt.ControlConnection"},{"sourceUnit":{"$ref":"48"},"sourceKey":"exit","destinationUnit":{"$ref":"53"},"destinationKey":"enter","guid":"06466f82-188f-4ac5-8de9-f84fc4150817","$type":"Bolt.ControlConnection"},{"sourceUnit":{"$ref":"10"},"sourceKey":"trigger","destinationUnit":{"$ref":"60"},"destinationKey":"enter","guid":"708856b9-ad7c-4b29-9b18-f0e2e75a1544","$type":"Bolt.ControlConnection"},{"sourceUnit":{"$ref":"46"},"sourceKey":"ifTrue","destinationUnit":{"$ref":"21"},"destinationKey":"assign","guid":"050e8018-f8d5-4ad3-a567-d44445b89522","$type":"Bolt.ControlConnection"},{"sourceUnit":{"$ref":"60"},"sourceKey":"result","destinationUnit":{"$ref":"46"},"destinationKey":"condition","guid":"b42113ba-c812-4dd3-afcb-355440e2f468","$type":"Bolt.ValueConnection"},{"sourceUnit":{"$ref":"12"},"sourceKey":"result","destinationUnit":{"$ref":"50"},"destinationKey":"%translation","guid":"974b9b84-3043-44a1-a631-845e73a7cc0f","$type":"Bolt.ValueConnection"},{"sourceUnit":{"$ref":"56"},"sourceKey":"product","destinationUnit":{"$ref":"12"},"destinationKey":"%x","guid":"3bd95161-b15b-4a90-b26a-a62940143d5b","$type":"Bolt.ValueConnection"},{"sourceUnit":{"$ref":"15"},"sourceKey":"output","destinationUnit":{"$ref":"43"},"destinationKey":"input","guid":"2a5b041f-2285-4854-bfbe-ef3844f5a271","$type":"Bolt.ValueConnection"},{"sourceUnit":{"$ref":"63"},"sourceKey":"value","destinationUnit":{"$ref":"56"},"destinationKey":"a","guid":"8184fa0e-462e-40a2-925b-e78512a6b7b4","$type":"Bolt.ValueConnection"},{"sourceUnit":{"$ref":"28"},"sourceKey":"value","destinationUnit":{"$ref":"60"},"destinationKey":"target","guid":"679e4f83-23e3-4e7b-b6c0-71e5a7b684ed","$type":"Bolt.ValueConnection"},{"sourceUnit":{"$ref":"38"},"sourceKey":"output","destinationUnit":{"$ref":"36"},"destinationKey":"input","guid":"0bbf05e0-2a8d-4aa3-be2f-4f7f33488b18","$type":"Bolt.ValueConnection"},{"sourceUnit":{"$ref":"24"},"sourceKey":"value","destinationUnit":{"$ref":"40"},"destinationKey":"target","guid":"2b4934c8-758c-447c-9f01-c810878c694e","$type":"Bolt.ValueConnection"},{"sourceUnit":{"$ref":"40"},"sourceKey":"result","destinationUnit":{"$ref":"30"},"destinationKey":"condition","guid":"58bf8ed5-824f-40e4-9609-a3e10a92274f","$type":"Bolt.ValueConnection"},{"sourceUnit":{"$ref":"58"},"sourceKey":"output","destinationUnit":{"$ref":"56"},"destinationKey":"b","guid":"777e06b1-7cd9-4dbc-9ecd-e40d1e2f0bec","$type":"Bolt.ValueConnection"},{"sourceUnit":{"$ref":"32"},"sourceKey":"output","destinationUnit":{"$ref":"21"},"destinationKey":"input","guid":"abeb0f9d-3f06-4839-966b-aea6ae505ff3","$type":"Bolt.ValueConnection"},{"sourceUnit":{"$ref":"34"},"sourceKey":"self","destinationUnit":{"$ref":"53"},"destinationKey":"%obj","guid":"71c7f846-cd59-437f-ad49-71dd02425bbb","$type":"Bolt.ValueConnection"},{"position":{"xMin":-988.0,"yMin":-17.0,"xMax":-35.0,"yMax":700.0},"label":"ResetToBat","comment":null,"color":{"r":0.6037736,"g":0.5045009,"b":0.5045009,"a":1.0},"guid":"9fea7f28-e5ee-4528-ae25-d427c48a8a2d","$version":"A","$type":"Ludiq.GraphGroup"},{"position":{"xMin":1.0,"yMin":-10.0,"xMax":1097.0,"yMax":502.0},"label":"MovementAndDestroy","comment":null,"color":{"r":0.5849056,"g":0.3452677,"b":0.3452677,"a":1.0},"guid":"732c26b8-0a3e-476b-a652-e09a99b81a7d","$version":"A","$type":"Ludiq.GraphGroup"},{"position":{"xMin":-707.0,"yMin":-642.0,"xMax":881.0,"yMax":-82.0},"label":"SpriteSelection","comment":null,"color":{"r":0.3176471,"g":0.5764706,"b":0.3283635,"a":1.0},"guid":"ce35cc03-ebeb-418a-b374-48f9914a1a7d","$version":"A","$type":"Ludiq.GraphGroup"}],"$version":"A"}}}'
    _objectReferences:
    - {fileID: 21300000, guid: 368c9d837fb723148b47f97008904809, type: 3}
    - {fileID: 21300000, guid: 58f847206c6d0e64dbdaaf5714cdcc57, type: 3}
--- !u!50 &9185448262713847816
Rigidbody2D:
  serializedVersion: 4
  m_ObjectHideFlags: 0
  m_CorrespondingSourceObject: {fileID: 0}
  m_PrefabInstance: {fileID: 0}
  m_PrefabAsset: {fileID: 0}
  m_GameObject: {fileID: 9033963289416021125}
  m_BodyType: 0
  m_Simulated: 1
  m_UseFullKinematicContacts: 0
  m_UseAutoMass: 0
  m_Mass: 1
  m_LinearDrag: 0
  m_AngularDrag: 0.05
  m_GravityScale: 0
  m_Material: {fileID: 0}
  m_Interpolate: 0
  m_SleepingMode: 1
  m_CollisionDetection: 0
  m_Constraints: 0
--- !u!58 &9185448263309529078
CircleCollider2D:
  m_ObjectHideFlags: 0
  m_CorrespondingSourceObject: {fileID: 0}
  m_PrefabInstance: {fileID: 0}
  m_PrefabAsset: {fileID: 0}
  m_GameObject: {fileID: 9033963289416021125}
  m_Enabled: 1
  m_Density: 1
  m_Material: {fileID: 0}
  m_IsTrigger: 1
  m_UsedByEffector: 0
  m_UsedByComposite: 0
  m_Offset: {x: 0, y: 0}
  serializedVersion: 2
  m_Radius: 0.5
