<?xml version="1.0" encoding="UTF-8" standalone="no"?>
<!-- Created with Inkscape (http://www.inkscape.org/) -->

<svg
   width="512.0px"
   height="512.0px"
   viewBox="0 0 512.0 512.0"
   version="1.1"
   id="SVGRoot"
   sodipodi:docname="fallback.svg"
   inkscape:version="1.1 (ce6663b3b7, 2021-05-25)"
   xmlns:inkscape="http://www.inkscape.org/namespaces/inkscape"
   xmlns:sodipodi="http://sodipodi.sourceforge.net/DTD/sodipodi-0.dtd"
   xmlns="http://www.w3.org/2000/svg"
   xmlns:svg="http://www.w3.org/2000/svg">
  <sodipodi:namedview
     id="namedview14"
     pagecolor="#ffffff"
     bordercolor="#999999"
     borderopacity="1"
     inkscape:pageshadow="0"
     inkscape:pageopacity="0"
     inkscape:pagecheckerboard="0"
     inkscape:document-units="px"
     showgrid="true"
     inkscape:zoom="0.5"
     inkscape:cx="99"
     inkscape:cy="143"
     inkscape:window-width="1920"
     inkscape:window-height="1004"
     inkscape:window-x="0"
     inkscape:window-y="0"
     inkscape:window-maximized="1"
     inkscape:current-layer="layer1"
     inkscape:snap-smooth-nodes="true"
     inkscape:object-nodes="false"
     inkscape:object-paths="false"
     inkscape:snap-intersection-paths="false">
    <inkscape:grid
       type="xygrid"
       id="grid20" />
  </sodipodi:namedview>
  <defs
     id="defs9">
    <rect
       x="260"
       y="100"
       width="90"
       height="80"
       id="rect8628" />
    <marker
       style="overflow:visible;"
       id="Arrow1Lend"
       refX="0.0"
       refY="0.0"
       orient="auto"
       inkscape:stockid="Arrow1Lend"
       inkscape:isstock="true">
      <path
         transform="scale(0.8) rotate(180) translate(12.5,0)"
         style="fill-rule:evenodd;fill:context-stroke;stroke:context-stroke;stroke-width:1.0pt;"
         d="M 0.0,0.0 L 5.0,-5.0 L -12.5,0.0 L 5.0,5.0 L 0.0,0.0 z "
         id="path1326" />
    </marker>
    <rect
       x="260"
       y="100"
       width="90"
       height="80"
       id="rect28918" />
  </defs>
  <g
     inkscape:label="Layer 1"
     inkscape:groupmode="layer"
     id="layer1">
    <g
       id="g31028"
       transform="matrix(1.0666667,0,0,1.0666667,-17.066675,-17.066675)">
      <rect
         style="fill:none;stroke:#000000;stroke-width:6.50418;stroke-linecap:round;stroke-linejoin:round;stroke-opacity:1;paint-order:stroke fill markers"
         id="rect861"
         width="148.66666"
         height="139.375"
         x="227.33334"
         y="71.3125" />
      <rect
         style="fill:none;stroke:#000000;stroke-width:6.50418;stroke-linecap:round;stroke-linejoin:round;stroke-opacity:1;paint-order:stroke fill markers"
         id="rect2182"
         width="148.66666"
         height="139.375"
         x="177.33334"
         y="301.3125" />
      <path
         style="fill:none;stroke:#000000;stroke-width:5;stroke-linecap:butt;stroke-linejoin:miter;stroke-miterlimit:4;stroke-dasharray:none;stroke-opacity:1"
         d="M 376,140.6875 H 496"
         id="path2250" />
      <path
         style="fill:none;stroke:#000000;stroke-width:5;stroke-linecap:butt;stroke-linejoin:miter;stroke-miterlimit:4;stroke-dasharray:none;stroke-opacity:1"
         d="m 456,140.6875 v 230 H 326"
         id="path2252" />
      <circle
         style="fill:none;stroke:#000000;stroke-width:5;stroke-linecap:round;stroke-linejoin:round;stroke-miterlimit:4;stroke-dasharray:none;stroke-opacity:1;paint-order:stroke fill markers"
         id="path2280"
         cx="86"
         cy="140.6875"
         r="30" />
      <path
         style="fill:none;stroke:#000000;stroke-width:5;stroke-linecap:butt;stroke-linejoin:miter;stroke-miterlimit:4;stroke-dasharray:none;stroke-opacity:1"
         d="M 176,370.6875 H 86 v -200"
         id="path2475" />
      <path
         style="fill:none;stroke:#000000;stroke-width:5;stroke-linecap:butt;stroke-linejoin:miter;stroke-miterlimit:4;stroke-dasharray:none;stroke-opacity:1"
         d="M 116,140.6875 H 226"
         id="path2477" />
      <path
         style="fill:none;stroke:#000000;stroke-width:5;stroke-linecap:butt;stroke-linejoin:miter;stroke-miterlimit:4;stroke-dasharray:none;stroke-opacity:1"
         d="M 56,140.6875 H 16"
         id="path2672" />
      <text
         xml:space="preserve"
         id="text8626"
         style="font-style:normal;font-weight:normal;font-size:32.4076px;line-height:1.25;font-family:sans-serif;white-space:pre;shape-inside:url(#rect8628);fill:#000000;fill-opacity:1;stroke:none"
         transform="matrix(1.6457057,0,0,1.6457057,-179.34469,-53.356137)"><tspan
           x="260"
           y="128.67313"
           id="tspan31240">C(s)</tspan></text>
      <text
         xml:space="preserve"
         id="text28916"
         style="font-style:normal;font-weight:normal;font-size:32.4076px;line-height:1.25;font-family:sans-serif;white-space:pre;shape-inside:url(#rect28918);fill:#000000;fill-opacity:1;stroke:none"
         transform="matrix(1.6457057,0,0,1.6457057,-229.15084,174.32416)"><tspan
           x="260"
           y="128.67313"
           id="tspan31242">H(s)</tspan></text>
    </g>
    <path
       style="fill:#000000;stroke:#000000;stroke-width:1px;stroke-linecap:butt;stroke-linejoin:miter;stroke-opacity:1;fill-opacity:1"
       d="M 75,165 55,185 H 95 Z"
       id="path31087" />
    <path
       style="fill:#000000;fill-opacity:1;stroke:#000000;stroke-width:1px;stroke-linecap:butt;stroke-linejoin:miter;stroke-opacity:1"
       d="m 42.561459,133.2222 -20,-20 v 40 z"
       id="path31136" />
  </g>
</svg>
