<?xml version="1.0" encoding="UTF-8" standalone="no"?>
<!-- Created with Inkscape (http://www.inkscape.org/) -->

<svg
   width="512"
   height="512"
   viewBox="0 0 135.46666 135.46667"
   version="1.1"
   id="svg5"
   inkscape:version="1.1 (ce6663b3b7, 2021-05-25)"
   sodipodi:docname="logo.svg"
   xmlns:inkscape="http://www.inkscape.org/namespaces/inkscape"
   xmlns:sodipodi="http://sodipodi.sourceforge.net/DTD/sodipodi-0.dtd"
   xmlns="http://www.w3.org/2000/svg"
   xmlns:svg="http://www.w3.org/2000/svg">
  <sodipodi:namedview
     id="namedview7"
     pagecolor="#ffffff"
     bordercolor="#999999"
     borderopacity="1"
     inkscape:pageshadow="0"
     inkscape:pageopacity="0"
     inkscape:pagecheckerboard="0"
     inkscape:document-units="px"
     showgrid="true"
     units="px"
     width="512px"
     inkscape:zoom="1.0368618"
     inkscape:cx="184.69193"
     inkscape:cy="268.59896"
     inkscape:window-width="1920"
     inkscape:window-height="1004"
     inkscape:window-x="0"
     inkscape:window-y="0"
     inkscape:window-maximized="1"
     inkscape:current-layer="layer1" />
  <defs
     id="defs2" />
  <g
     inkscape:label="Layer 1"
     inkscape:groupmode="layer"
     id="layer1">
    <path
       id="path2334"
       style="fill:#0088aa;fill-opacity:1;stroke:none;stroke-width:0.236046px;stroke-linecap:butt;stroke-linejoin:miter;stroke-opacity:1"
       d="M 58.027255,11.824161 103.17348,90.019674 H 83.761407 51.70517 l -9.706035,16.811406 h 51.468302 19.412083 19.41207 L 122.58555,90.019674 77.439321,11.824161 Z" />
    <path
       id="path2227"
       style="fill:#80e5ff;stroke:none;stroke-width:0.236046px;stroke-linecap:butt;stroke-linejoin:miter;stroke-opacity:1"
       d="m 58.027255,11.824161 -9.706036,16.811406 -35.440187,61.384107 -9.706034,16.811406 9.706034,16.81141 9.706034,-16.81141 9.706034,-16.811406 25.734155,-44.5727 25.734152,44.5727 H 103.17348 L 67.733288,28.635567 Z" />
    <path
       id="path2378"
       style="fill:#00aad4;stroke:none;stroke-width:0.236046px;stroke-linecap:butt;stroke-linejoin:miter;stroke-opacity:1"
       d="m 12.881032,123.64249 19.412123,-3e-5 70.880295,4e-5 19.41212,-2e-5 9.7061,-16.81138 -19.41213,3e-5 -19.412123,3e-5 -51.468174,-8e-5 L 67.733259,62.258303 58.027224,45.446958 22.58712,106.83112 Z" />
  </g>
</svg>
