<?xml version="1.0" encoding="UTF-8" standalone="no"?>
<!-- Created with Inkscape (http://www.inkscape.org/) -->

<svg
   width="512"
   height="512"
   viewBox="0 0 135.46666 135.46666"
   version="1.1"
   id="svg1482"
   inkscape:version="1.1 (ce6663b3b7, 2021-05-25)"
   sodipodi:docname="sweep.svg"
   xmlns:inkscape="http://www.inkscape.org/namespaces/inkscape"
   xmlns:sodipodi="http://sodipodi.sourceforge.net/DTD/sodipodi-0.dtd"
   xmlns="http://www.w3.org/2000/svg"
   xmlns:svg="http://www.w3.org/2000/svg">
  <sodipodi:namedview
     id="namedview1484"
     pagecolor="#ffffff"
     bordercolor="#999999"
     borderopacity="1"
     inkscape:pageshadow="0"
     inkscape:pageopacity="0"
     inkscape:pagecheckerboard="0"
     inkscape:document-units="mm"
     showgrid="true"
     units="px"
     inkscape:zoom="1.0368618"
     inkscape:cx="298.49687"
     inkscape:cy="177.45856"
     inkscape:window-width="1920"
     inkscape:window-height="995"
     inkscape:window-x="0"
     inkscape:window-y="0"
     inkscape:window-maximized="1"
     inkscape:current-layer="layer1">
    <inkscape:grid
       type="xygrid"
       id="grid1543" />
  </sodipodi:namedview>
  <defs
     id="defs1479">
    <inkscape:path-effect
       effect="bspline"
       id="path-effect2249"
       is_visible="true"
       lpeversion="1"
       weight="33.333333"
       steps="2"
       helper_size="0"
       apply_no_weight="true"
       apply_with_weight="true"
       only_selected="false" />
    <inkscape:path-effect
       effect="bspline"
       id="path-effect2230"
       is_visible="true"
       lpeversion="1"
       weight="33.333333"
       steps="2"
       helper_size="0"
       apply_no_weight="true"
       apply_with_weight="true"
       only_selected="false" />
    <inkscape:path-effect
       effect="bspline"
       id="path-effect2195"
       is_visible="true"
       lpeversion="1"
       weight="33.333333"
       steps="2"
       helper_size="0"
       apply_no_weight="true"
       apply_with_weight="true"
       only_selected="false" />
    <inkscape:path-effect
       effect="bspline"
       id="path-effect1832"
       is_visible="true"
       lpeversion="1"
       weight="33.333333"
       steps="2"
       helper_size="0"
       apply_no_weight="true"
       apply_with_weight="true"
       only_selected="false" />
  </defs>
  <g
     inkscape:label="Layer 1"
     inkscape:groupmode="layer"
     id="layer1">
    <path
       style="fill:none;stroke:#000000;stroke-width:1.32291667;stroke-linecap:butt;stroke-linejoin:miter;stroke-opacity:1;stroke-miterlimit:4;stroke-dasharray:none"
       d="M 10.715239,0 V 135.46667"
       id="path1578" />
    <path
       style="fill:none;stroke:#000000;stroke-width:1.32292;stroke-linecap:butt;stroke-linejoin:miter;stroke-miterlimit:4;stroke-dasharray:none;stroke-opacity:1"
       d="M 10.583333,68.394792 H 135.46667"
       id="path1711" />
    <path
       style="fill:none;stroke:#000000;stroke-width:2.74181;stroke-linecap:butt;stroke-linejoin:miter;stroke-miterlimit:4;stroke-dasharray:none;stroke-opacity:1"
       d="m 13.229167,68.791667 c 4.873837,-18.381329 9.74774,-36.762907 14.621768,-36.762688 4.874028,2.2e-4 9.747834,18.381432 14.134378,36.763195 4.386543,18.381763 8.285587,36.762976 12.672084,36.762756 4.386496,-2.3e-4 9.260301,-18.381434 14.13427,-36.763263"
       id="path1830"
       inkscape:path-effect="#path-effect1832"
       inkscape:original-d="m 13.229167,68.791667 c 4.87405,-18.381272 9.747953,-36.762851 14.62171,-55.144737 4.874147,18.382253 9.747953,36.763465 14.62171,55.144737 3.899347,18.382253 7.798392,36.763463 11.697369,55.144743 4.874146,-18.38165 9.747953,-36.762858 14.621711,-55.144743" />
    <path
       style="fill:none;stroke:#000000;stroke-width:1.98438;stroke-linecap:butt;stroke-linejoin:miter;stroke-miterlimit:4;stroke-dasharray:none;stroke-opacity:1"
       d="M 68.791667,68.791667 C 71.344623,50.410379 73.89762,32.0288 76.450684,32.028994 c 2.553065,1.94e-4 5.106011,18.381406 7.403725,36.763168 2.297713,18.381762 4.34007,36.762968 6.637756,36.762778 2.297687,-2e-4 4.850631,-18.381404 7.403668,-36.763273"
       id="path1830-3"
       inkscape:path-effect="#path-effect2195"
       inkscape:original-d="m 68.791667,68.791667 c 2.553074,-18.381272 5.10607,-36.762851 7.65899,-55.144737 2.553125,18.382253 5.106071,36.763465 7.658992,55.144737 2.042512,18.382253 4.084871,36.763463 6.127194,55.144743 2.553126,-18.38165 5.106069,-36.762858 7.65899,-55.144743" />
    <path
       style="fill:none;stroke:#000000;stroke-width:1.33787;stroke-linecap:butt;stroke-linejoin:miter;stroke-miterlimit:4;stroke-dasharray:none;stroke-opacity:1"
       d="m 97.895833,68.791667 c 1.160433,-18.381276 2.320887,-36.762854 3.481367,-36.762669 1.16049,1.86e-4 2.32092,18.381398 3.36533,36.763161 1.04442,18.381762 1.97276,36.762971 3.01716,36.762781 1.04441,-1.8e-4 2.20484,-18.381391 3.36531,-36.763273"
       id="path1830-3-6"
       inkscape:path-effect="#path-effect2230"
       inkscape:original-d="m 97.895833,68.791667 c 1.16049,-18.381272 2.320937,-36.762851 3.481357,-55.144737 1.16051,18.382253 2.32094,36.763465 3.48136,55.144737 0.92842,18.382253 1.85676,36.763463 2.78509,55.144743 1.16051,-18.38165 2.32094,-36.762858 3.48136,-55.144743" />
    <path
       style="fill:none;stroke:#000000;stroke-width:1.03631;stroke-linecap:butt;stroke-linejoin:miter;stroke-miterlimit:4;stroke-dasharray:none;stroke-opacity:1"
       d="m 111.12501,68.791667 c 0.69626,-18.381273 1.39253,-36.762852 2.08882,-36.762668 0.69629,1.84e-4 1.39255,18.381396 2.0192,36.763159 0.62665,18.381762 1.18365,36.762972 1.81029,36.762782 0.62664,-1.8e-4 1.3229,-18.381389 2.01918,-36.763273"
       id="path1830-3-7"
       inkscape:path-effect="#path-effect2249"
       inkscape:original-d="m 111.12501,68.791667 c 0.69629,-18.381272 1.39256,-36.762851 2.08881,-55.144737 0.69631,18.382253 1.39257,36.763465 2.08882,55.144737 0.55704,18.382253 1.11405,36.763463 1.67105,55.144743 0.6963,-18.38165 1.39256,-36.762858 2.08881,-55.144743" />
  </g>
</svg>
