<?xml version="1.0" encoding="UTF-8" standalone="no"?>
<!-- Created with Inkscape (http://www.inkscape.org/) -->

<svg
   inkscape:version="1.1 (ce6663b3b7, 2021-05-25)"
   sodipodi:docname="history.svg"
   id="svg5"
   version="1.1"
   viewBox="0 0 238.12499 158.75"
   height="600"
   width="900"
   xmlns:inkscape="http://www.inkscape.org/namespaces/inkscape"
   xmlns:sodipodi="http://sodipodi.sourceforge.net/DTD/sodipodi-0.dtd"
   xmlns="http://www.w3.org/2000/svg"
   xmlns:svg="http://www.w3.org/2000/svg">
  <sodipodi:namedview
     id="namedview7"
     pagecolor="#ffffff"
     bordercolor="#999999"
     borderopacity="1"
     inkscape:pageshadow="0"
     inkscape:pageopacity="0"
     inkscape:pagecheckerboard="0"
     inkscape:document-units="px"
     showgrid="true"
     units="px"
     width="900px"
     inkscape:zoom="0.46551693"
     inkscape:cx="1045.0748"
     inkscape:cy="132.1112"
     inkscape:window-width="1920"
     inkscape:window-height="1004"
     inkscape:window-x="0"
     inkscape:window-y="0"
     inkscape:window-maximized="1"
     inkscape:current-layer="layer1" />
  <defs
     id="defs2" />
  <g
     inkscape:label="Layer 1"
     inkscape:groupmode="layer"
     id="layer1">
    <g
       id="g3651"
       transform="matrix(9.0950519,0,0,9.0950519,7.3577504,-29.765624)">
      <path
         d="M 10,4 H 4 A 2,2 0 0 0 2,6 v 13 a 1,1 0 0 0 1,1 h 15 a 2,2 0 0 0 2,-2 V 8 A 2,2 0 0 0 18,6 h -6 z"
         style="fill:#bae9ff"
         id="path3640" />
      <path
         d="M 19.20721,20 H 3.96078 A 1.35882,1.35882 0 0 1 2.68848,18.16407 L 4.64741,12.94025 A 1.449,1.449 0 0 1 6.00419,12 h 15.6136 a 0.946,0.946 0 0 1 0.88189,1.28848 l -2.30741,5.9424 A 1.01539,1.01539 0 0 1 19.20721,20 Z"
         style="fill:#52c1ff"
         id="path3642" />
    </g>
  </g>
</svg>
