<?xml version="1.0" encoding="UTF-8" standalone="no"?>
<!-- Created with Inkscape (http://www.inkscape.org/) -->

<svg
   width="512mm"
   height="512mm"
   viewBox="0 0 512 512"
   version="1.1"
   id="svg5"
   inkscape:version="1.1 (ce6663b3b7, 2021-05-25)"
   sodipodi:docname="testbed.svg"
   xmlns:inkscape="http://www.inkscape.org/namespaces/inkscape"
   xmlns:sodipodi="http://sodipodi.sourceforge.net/DTD/sodipodi-0.dtd"
   xmlns="http://www.w3.org/2000/svg"
   xmlns:svg="http://www.w3.org/2000/svg">
  <sodipodi:namedview
     id="namedview7"
     pagecolor="#ffffff"
     bordercolor="#999999"
     borderopacity="1"
     inkscape:pageshadow="0"
     inkscape:pageopacity="0"
     inkscape:pagecheckerboard="0"
     inkscape:document-units="px"
     showgrid="true"
     inkscape:zoom="0.183293"
     inkscape:cx="1530.3367"
     inkscape:cy="630.13862"
     inkscape:window-width="1920"
     inkscape:window-height="1004"
     inkscape:window-x="0"
     inkscape:window-y="0"
     inkscape:window-maximized="1"
     inkscape:current-layer="layer1">
    <inkscape:grid
       type="xygrid"
       id="grid824" />
  </sodipodi:namedview>
  <defs
     id="defs2">
    <inkscape:path-effect
       effect="fillet_chamfer"
       id="path-effect7024"
       is_visible="true"
       lpeversion="1"
       satellites_param="F,0,0,1,0,3.96875,0,1 @ F,0,0,1,0,3.96875,0,1 @ F,0,0,1,0,3.96875,0,1 @ F,0,0,1,0,3.96875,0,1"
       unit="px"
       method="auto"
       mode="F"
       radius="15"
       chamfer_steps="1"
       flexible="false"
       use_knot_distance="true"
       apply_no_radius="true"
       apply_with_radius="true"
       only_selected="false"
       hide_knots="false" />
    <inkscape:path-effect
       effect="fillet_chamfer"
       id="path-effect6908"
       is_visible="true"
       lpeversion="1"
       satellites_param="F,0,0,1,0,3.96875,0,1 @ F,0,0,1,0,3.96875,0,1 @ F,0,0,1,0,3.96875,0,1 @ F,0,0,1,0,3.96875,0,1"
       unit="px"
       method="auto"
       mode="F"
       radius="10"
       chamfer_steps="1"
       flexible="false"
       use_knot_distance="true"
       apply_no_radius="true"
       apply_with_radius="true"
       only_selected="false"
       hide_knots="false" />
    <inkscape:path-effect
       effect="fillet_chamfer"
       id="path-effect6868"
       is_visible="true"
       lpeversion="1"
       satellites_param="F,0,0,1,0,3.96875,0,1 @ F,0,0,1,0,3.96875,0,1 @ F,0,0,1,0,3.96875,0,1 @ F,0,0,1,0,3.96875,0,1"
       unit="px"
       method="auto"
       mode="F"
       radius="15"
       chamfer_steps="1"
       flexible="false"
       use_knot_distance="true"
       apply_no_radius="true"
       apply_with_radius="true"
       only_selected="false"
       hide_knots="false" />
  </defs>
  <g
     inkscape:label="Layer 1"
     inkscape:groupmode="layer"
     id="layer1">
    <g
       id="g1194"
       transform="matrix(0,-2.4890581,1.9062588,0,12.000002,336.47746)">
      <path
         style="fill:#808080;stroke:#000000;stroke-width:0.842579px;stroke-linecap:butt;stroke-linejoin:miter;stroke-opacity:1"
         d="M 0.42128955,209.1272 V 46.871605 a 3.9687499,3.9687499 135 0 1 3.96874995,-3.96875 l 55.8849195,2e-6 a 3.9687501,3.9687501 45.000001 0 1 3.96875,3.96875 V 209.1272 a 3.96875,3.96875 135 0 1 -3.96875,3.96875 H 4.3900395 A 3.96875,3.96875 45 0 1 0.42128955,209.1272 Z"
         id="path898"
         sodipodi:nodetypes="ccccc"
         inkscape:path-effect="#path-effect6868"
         inkscape:original-d="M 0.42128955,213.09595 V 42.902855 l 63.82241945,2e-6 V 213.09595 Z" />
      <path
         style="fill:#4d4d4d;fill-opacity:1;stroke:#000000;stroke-width:0.709137px;stroke-linecap:butt;stroke-linejoin:miter;stroke-opacity:1"
         d="m 25.664181,255.64424 h 13.33664 a 3.96875,3.96875 135 0 0 3.96875,-3.96875 v -55.88491 a 3.96875,3.96875 45 0 0 -3.96875,-3.96875 h -13.33664 a 3.96875,3.96875 135 0 0 -3.96875,3.96875 v 55.88491 a 3.96875,3.96875 45 0 0 3.96875,3.96875 z"
         id="path896"
         inkscape:path-effect="#path-effect6908"
         inkscape:original-d="m 21.695431,255.64424 h 21.27414 v -63.82241 h -21.27414 z" />
      <path
         style="fill:#4d4d4d;stroke:#000000;stroke-width:0.709137px;stroke-linecap:butt;stroke-linejoin:miter;stroke-opacity:1"
         d="m 25.664181,64.176996 h 13.33664 a 3.96875,3.96875 135 0 0 3.96875,-3.96875 V 4.3233184 A 3.96875,3.96875 45 0 0 39.000821,0.35456836 H 25.664181 A 3.96875,3.96875 135 0 0 21.695431,4.3233184 V 60.208246 a 3.96875,3.96875 45 0 0 3.96875,3.96875 z"
         id="path896-3"
         inkscape:path-effect="#path-effect7024"
         inkscape:original-d="m 21.695431,64.176996 h 21.27414 V 0.35456836 h -21.27414 z" />
    </g>
  </g>
</svg>
