<?xml version="1.0" encoding="UTF-8" standalone="no"?>
<!-- Created with Inkscape (http://www.inkscape.org/) -->

<svg
   inkscape:version="1.1 (ce6663b3b7, 2021-05-25)"
   sodipodi:docname="editTask.svg"
   id="svg5"
   version="1.1"
   viewBox="0 0 238.12499 158.75"
   height="600"
   width="900"
   xmlns:inkscape="http://www.inkscape.org/namespaces/inkscape"
   xmlns:sodipodi="http://sodipodi.sourceforge.net/DTD/sodipodi-0.dtd"
   xmlns="http://www.w3.org/2000/svg"
   xmlns:svg="http://www.w3.org/2000/svg">
  <sodipodi:namedview
     id="namedview7"
     pagecolor="#ffffff"
     bordercolor="#999999"
     borderopacity="1"
     inkscape:pageshadow="0"
     inkscape:pageopacity="0"
     inkscape:pagecheckerboard="0"
     inkscape:document-units="px"
     showgrid="true"
     units="px"
     width="900px"
     inkscape:zoom="0.46551693"
     inkscape:cx="1045.0748"
     inkscape:cy="63.370413"
     inkscape:window-width="1920"
     inkscape:window-height="1004"
     inkscape:window-x="0"
     inkscape:window-y="0"
     inkscape:window-maximized="1"
     inkscape:current-layer="layer1" />
  <defs
     id="defs2" />
  <g
     inkscape:label="Layer 1"
     inkscape:groupmode="layer"
     id="layer1">
    <g
       id="g3440"
       transform="matrix(7.9374998,0,0,7.9374998,23.75412,-15.874999)">
      <path
         d="m 9.84314,2 h 7.17157 a 2,2 0 0 1 2,2 v 16 a 2,2 0 0 1 -2,2 h -12 a 2,2 0 0 1 -2,-2 V 8.82843 C 3.01471,8.298 9.3127,2 9.84314,2 Z"
         style="fill:#e3edf0"
         id="path3423" />
      <polygon
         points="18.001,7.013 10.015,15 10.015,17 12.056,17 20.028,9.04 "
         style="fill:#ffbe4d"
         id="polygon3425" />
      <polygon
         points="21,8.039 19,6 17.545,7.463 19.569,9.487 "
         style="fill:#fa6d62"
         id="polygon3427" />
      <path
         d="M 8.42889,2.58575 A 2.00014,2.00014 0 0 1 9.84314,2 h 0.17157 v 6 a 1,1 0 0 1 -1,1 h -6 V 8.82843 A 1.99983,1.99983 0 0 1 3.60053,7.41418 Z"
         style="fill:#c3cfd6"
         id="path3429" />
    </g>
  </g>
</svg>
