<?xml version="1.0" encoding="UTF-8" standalone="no"?>
<!-- Created with Inkscape (http://www.inkscape.org/) -->

<svg
   width="512"
   height="512"
   viewBox="0 0 135.46666 135.46667"
   version="1.1"
   id="svg2270"
   inkscape:version="1.1 (ce6663b3b7, 2021-05-25)"
   sodipodi:docname="constant.svg"
   xmlns:inkscape="http://www.inkscape.org/namespaces/inkscape"
   xmlns:sodipodi="http://sodipodi.sourceforge.net/DTD/sodipodi-0.dtd"
   xmlns="http://www.w3.org/2000/svg"
   xmlns:svg="http://www.w3.org/2000/svg">
  <sodipodi:namedview
     id="namedview2272"
     pagecolor="#ffffff"
     bordercolor="#999999"
     borderopacity="1"
     inkscape:pageshadow="0"
     inkscape:pageopacity="0"
     inkscape:pagecheckerboard="0"
     inkscape:document-units="px"
     showgrid="true"
     units="px"
     inkscape:zoom="1.0368618"
     inkscape:cx="270.52786"
     inkscape:cy="233.87881"
     inkscape:window-width="1920"
     inkscape:window-height="1004"
     inkscape:window-x="0"
     inkscape:window-y="0"
     inkscape:window-maximized="1"
     inkscape:current-layer="layer1">
    <inkscape:grid
       type="xygrid"
       id="grid2331" />
  </sodipodi:namedview>
  <defs
     id="defs2267" />
  <g
     inkscape:label="Layer 1"
     inkscape:groupmode="layer"
     id="layer1">
    <path
       d="m 105.10103,87.366978 c -0.43427,0 -0.55648,0.383246 -0.59623,0.507831 -0.58436,1.833766 -3.03452,7.816193 -10.030235,7.816193 -4.143917,0 -6.601791,-3.34954 -7.304212,-9.956079 -1.189483,-11.16218 0.169671,-32.899207 0.649621,-39.747795 10.188638,-0.237305 13.721496,-1.587563 16.344896,-6.19541 2.35345,-4.132052 1.31644,-9.335531 1.27135,-9.554443 -0.0534,-0.259848 -0.27527,-0.453846 -0.57131,-0.472236 -0.25629,0 -0.48351,0.15958 -0.56656,0.39689 -0.4669,1.348479 -1.56146,4.507588 -13.165616,4.611408 -2.479824,0.02314 -5.970562,-0.03204 -10.128719,-0.09671 l -0.307308,-0.0047 c -4.442327,-0.06881 -9.477913,-0.147135 -14.420953,-0.147135 -11.664668,0 -18.732168,0.437233 -22.241891,1.375767 -10.914194,2.921803 -14.225177,18.27358 -14.257211,18.429015 -0.05518,0.270526 0.08068,0.539866 0.329257,0.654958 0.246203,0.116866 0.551733,0.03975 0.716659,-0.173236 0.05043,-0.06464 5.158985,-6.51457 14.513498,-8.068316 1.341955,-0.22187 2.845868,-0.398671 4.588865,-0.539867 0.311461,17.1013 -1.16991,31.219689 -4.403768,41.966586 -3.337084,11.090389 -8.990253,16.442191 -9.041272,16.488461 -0.196959,0.16552 -0.262815,0.44614 -0.161958,0.68047 0.09195,0.21653 0.30197,0.35833 0.59326,0.35833 0.0029,0 0.0065,0 0.0095,0 0.147135,-0.0148 14.759704,-1.61545 19.282714,-14.56927 3.035115,-8.690659 4.30825,-24.353896 3.684141,-45.31079 0.870903,-0.009 1.772659,-0.01255 2.71179,-0.01255 3.626001,0 7.380146,0.05933 11.011489,0.115677 l 0.06348,0.0012 c 1.42679,0.02314 2.822136,0.04449 4.18604,0.0629 -0.07948,0.887516 -0.176801,1.928687 -0.290104,3.151395 -0.956334,10.239069 -2.736112,29.297529 -1.268389,38.828837 2.017082,13.095611 6.479581,17.737271 17.053246,17.737271 11.05598,0 12.33446,-10.106178 12.33327,-17.681504 0.0148,-0.166711 -0.0415,-0.338159 -0.15068,-0.457404 -0.11213,-0.123996 -0.27053,-0.19577 -0.43664,-0.19577 z"
       id="path1920"
       style="stroke-width:0.593259" />
  </g>
</svg>
