versioninfo
{
	"editorversion" "400"
	"editorbuild" "8163"
	"mapversion" "26"
	"formatversion" "100"
	"prefab" "0"
}
visgroups
{
}
viewsettings
{
	"bSnapToGrid" "1"
	"bShowGrid" "1"
	"bShowLogicalGrid" "0"
	"nGridSpacing" "16"
	"bShow3DGrid" "0"
}
world
{
	"id" "1"
	"mapversion" "26"
	"classname" "worldspawn"
	"detailmaterial" "detail/detailsprites"
	"detailvbsp" "detail.vbsp"
	"maxpropscreenwidth" "-1"
	"skyname" "sky_day01_01"
	solid
	{
		"id" "2"
		side
		{
			"id" "1"
			"plane" "(-512 -1024 1024) (-512 512 1024) (2496 512 1024)"
			"material" "TOOLS/TOOLSSKYBOX"
			"uaxis" "[1 0 0 0] 0.25"
			"vaxis" "[0 -1 0 0] 0.25"
			"rotation" "0"
			"lightmapscale" "16"
			"smoothing_groups" "0"
		}
		side
		{
			"id" "2"
			"plane" "(-512 512 960) (-512 -1024 960) (2496 -1024 960)"
			"material" "TOOLS/TOOLSSKYBOX"
			"uaxis" "[1 0 0 0] 0.25"
			"vaxis" "[0 -1 0 0] 0.25"
			"rotation" "0"
			"lightmapscale" "16"
			"smoothing_groups" "0"
		}
		side
		{
			"id" "3"
			"plane" "(-512 -1024 960) (-512 512 960) (-512 512 1024)"
			"material" "TOOLS/TOOLSSKYBOX"
			"uaxis" "[0 1 0 0] 0.25"
			"vaxis" "[0 0 -1 0] 0.25"
			"rotation" "0"
			"lightmapscale" "16"
			"smoothing_groups" "0"
		}
		side
		{
			"id" "4"
			"plane" "(2496 512 960) (2496 -1024 960) (2496 -1024 1024)"
			"material" "TOOLS/TOOLSSKYBOX"
			"uaxis" "[0 1 0 0] 0.25"
			"vaxis" "[0 0 -1 0] 0.25"
			"rotation" "0"
			"lightmapscale" "16"
			"smoothing_groups" "0"
		}
		side
		{
			"id" "5"
			"plane" "(-512 512 960) (2496 512 960) (2496 512 1024)"
			"material" "TOOLS/TOOLSSKYBOX"
			"uaxis" "[1 0 0 0] 0.25"
			"vaxis" "[0 0 -1 0] 0.25"
			"rotation" "0"
			"lightmapscale" "16"
			"smoothing_groups" "0"
		}
		side
		{
			"id" "6"
			"plane" "(2496 -1024 960) (-512 -1024 960) (-512 -1024 1024)"
			"material" "TOOLS/TOOLSSKYBOX"
			"uaxis" "[1 0 0 0] 0.25"
			"vaxis" "[0 0 -1 0] 0.25"
			"rotation" "0"
			"lightmapscale" "16"
			"smoothing_groups" "0"
		}
		editor
		{
			"color" "0 206 123"
			"visgroupshown" "1"
			"visgroupautoshown" "1"
		}
	}
	solid
	{
		"id" "4"
		side
		{
			"id" "18"
			"plane" "(-512 -1024 64) (-512 512 64) (2496 512 64)"
			"material" "DEV/DEV_MEASUREGENERIC01B"
			"uaxis" "[1 0 0 0] 0.25"
			"vaxis" "[0 -1 0 0] 0.25"
			"rotation" "0"
			"lightmapscale" "16"
			"smoothing_groups" "0"
		}
		side
		{
			"id" "17"
			"plane" "(-512 512 0) (-512 -1024 0) (2496 -1024 0)"
			"material" "DEV/DEV_MEASUREGENERIC01B"
			"uaxis" "[1 0 0 0] 0.25"
			"vaxis" "[0 -1 0 0] 0.25"
			"rotation" "0"
			"lightmapscale" "16"
			"smoothing_groups" "0"
		}
		side
		{
			"id" "16"
			"plane" "(-512 -1024 0) (-512 512 0) (-512 512 64)"
			"material" "DEV/DEV_MEASUREGENERIC01B"
			"uaxis" "[0 1 0 0] 0.25"
			"vaxis" "[0 0 -1 0] 0.25"
			"rotation" "0"
			"lightmapscale" "16"
			"smoothing_groups" "0"
		}
		side
		{
			"id" "15"
			"plane" "(2496 512 0) (2496 -1024 0) (2496 -1024 64)"
			"material" "DEV/DEV_MEASUREGENERIC01B"
			"uaxis" "[0 1 0 0] 0.25"
			"vaxis" "[0 0 -1 0] 0.25"
			"rotation" "0"
			"lightmapscale" "16"
			"smoothing_groups" "0"
		}
		side
		{
			"id" "14"
			"plane" "(-512 512 0) (2496 512 0) (2496 512 64)"
			"material" "DEV/DEV_MEASUREGENERIC01B"
			"uaxis" "[1 0 0 0] 0.25"
			"vaxis" "[0 0 -1 0] 0.25"
			"rotation" "0"
			"lightmapscale" "16"
			"smoothing_groups" "0"
		}
		side
		{
			"id" "13"
			"plane" "(2496 -1024 0) (-512 -1024 0) (-512 -1024 64)"
			"material" "DEV/DEV_MEASUREGENERIC01B"
			"uaxis" "[1 0 0 0] 0.25"
			"vaxis" "[0 0 -1 0] 0.25"
			"rotation" "0"
			"lightmapscale" "16"
			"smoothing_groups" "0"
		}
		editor
		{
			"color" "0 206 123"
			"visgroupshown" "1"
			"visgroupautoshown" "1"
		}
	}
	solid
	{
		"id" "5"
		side
		{
			"id" "30"
			"plane" "(-576 -1024 192) (-576 512 192) (-512 512 192)"
			"material" "DEV/DEV_MEASUREGENERIC01"
			"uaxis" "[1 0 0 0] 0.25"
			"vaxis" "[0 -1 0 0] 0.25"
			"rotation" "0"
			"lightmapscale" "16"
			"smoothing_groups" "0"
		}
		side
		{
			"id" "29"
			"plane" "(-576 512 64) (-576 -1024 64) (-512 -1024 64)"
			"material" "DEV/DEV_MEASUREGENERIC01"
			"uaxis" "[1 0 0 0] 0.25"
			"vaxis" "[0 -1 0 0] 0.25"
			"rotation" "0"
			"lightmapscale" "16"
			"smoothing_groups" "0"
		}
		side
		{
			"id" "28"
			"plane" "(-576 -1024 64) (-576 512 64) (-576 512 192)"
			"material" "DEV/DEV_MEASUREGENERIC01"
			"uaxis" "[0 1 0 0] 0.25"
			"vaxis" "[0 0 -1 0] 0.25"
			"rotation" "0"
			"lightmapscale" "16"
			"smoothing_groups" "0"
		}
		side
		{
			"id" "27"
			"plane" "(-512 512 64) (-512 -1024 64) (-512 -1024 192)"
			"material" "DEV/DEV_MEASUREGENERIC01"
			"uaxis" "[0 1 0 0] 0.25"
			"vaxis" "[0 0 -1 0] 0.25"
			"rotation" "0"
			"lightmapscale" "16"
			"smoothing_groups" "0"
		}
		side
		{
			"id" "26"
			"plane" "(-576 512 64) (-512 512 64) (-512 512 192)"
			"material" "DEV/DEV_MEASUREGENERIC01"
			"uaxis" "[1 0 0 0] 0.25"
			"vaxis" "[0 0 -1 0] 0.25"
			"rotation" "0"
			"lightmapscale" "16"
			"smoothing_groups" "0"
		}
		side
		{
			"id" "25"
			"plane" "(-512 -1024 64) (-576 -1024 64) (-576 -1024 192)"
			"material" "DEV/DEV_MEASUREGENERIC01"
			"uaxis" "[1 0 0 0] 0.25"
			"vaxis" "[0 0 -1 0] 0.25"
			"rotation" "0"
			"lightmapscale" "16"
			"smoothing_groups" "0"
		}
		editor
		{
			"color" "0 206 123"
			"visgroupshown" "1"
			"visgroupautoshown" "1"
		}
	}
	solid
	{
		"id" "8"
		side
		{
			"id" "42"
			"plane" "(2496 -1024 192) (2496 512 192) (2560 512 192)"
			"material" "DEV/DEV_MEASUREGENERIC01"
			"uaxis" "[1 0 0 0] 0.25"
			"vaxis" "[0 -1 0 0] 0.25"
			"rotation" "0"
			"lightmapscale" "16"
			"smoothing_groups" "0"
		}
		side
		{
			"id" "41"
			"plane" "(2496 512 64) (2496 -1024 64) (2560 -1024 64)"
			"material" "DEV/DEV_MEASUREGENERIC01"
			"uaxis" "[1 0 0 0] 0.25"
			"vaxis" "[0 -1 0 0] 0.25"
			"rotation" "0"
			"lightmapscale" "16"
			"smoothing_groups" "0"
		}
		side
		{
			"id" "40"
			"plane" "(2496 -1024 64) (2496 512 64) (2496 512 192)"
			"material" "DEV/DEV_MEASUREGENERIC01"
			"uaxis" "[0 1 0 0] 0.25"
			"vaxis" "[0 0 -1 0] 0.25"
			"rotation" "0"
			"lightmapscale" "16"
			"smoothing_groups" "0"
		}
		side
		{
			"id" "39"
			"plane" "(2560 512 64) (2560 -1024 64) (2560 -1024 192)"
			"material" "DEV/DEV_MEASUREGENERIC01"
			"uaxis" "[0 1 0 0] 0.25"
			"vaxis" "[0 0 -1 0] 0.25"
			"rotation" "0"
			"lightmapscale" "16"
			"smoothing_groups" "0"
		}
		side
		{
			"id" "38"
			"plane" "(2496 512 64) (2560 512 64) (2560 512 192)"
			"material" "DEV/DEV_MEASUREGENERIC01"
			"uaxis" "[1 0 0 0] 0.25"
			"vaxis" "[0 0 -1 0] 0.25"
			"rotation" "0"
			"lightmapscale" "16"
			"smoothing_groups" "0"
		}
		side
		{
			"id" "37"
			"plane" "(2560 -1024 64) (2496 -1024 64) (2496 -1024 192)"
			"material" "DEV/DEV_MEASUREGENERIC01"
			"uaxis" "[1 0 0 0] 0.25"
			"vaxis" "[0 0 -1 0] 0.25"
			"rotation" "0"
			"lightmapscale" "16"
			"smoothing_groups" "0"
		}
		editor
		{
			"color" "0 206 123"
			"visgroupshown" "1"
			"visgroupautoshown" "1"
		}
	}
	solid
	{
		"id" "9"
		side
		{
			"id" "54"
			"plane" "(-512 512 192) (-512 576 192) (2496 576 192)"
			"material" "DEV/DEV_MEASUREGENERIC01"
			"uaxis" "[1 0 0 0] 0.25"
			"vaxis" "[0 -1 0 0] 0.25"
			"rotation" "0"
			"lightmapscale" "16"
			"smoothing_groups" "0"
		}
		side
		{
			"id" "53"
			"plane" "(-512 576 64) (-512 512 64) (2496 512 64)"
			"material" "DEV/DEV_MEASUREGENERIC01"
			"uaxis" "[1 0 0 0] 0.25"
			"vaxis" "[0 -1 0 0] 0.25"
			"rotation" "0"
			"lightmapscale" "16"
			"smoothing_groups" "0"
		}
		side
		{
			"id" "52"
			"plane" "(-512 512 64) (-512 576 64) (-512 576 192)"
			"material" "DEV/DEV_MEASUREGENERIC01"
			"uaxis" "[0 1 0 0] 0.25"
			"vaxis" "[0 0 -1 0] 0.25"
			"rotation" "0"
			"lightmapscale" "16"
			"smoothing_groups" "0"
		}
		side
		{
			"id" "51"
			"plane" "(2496 576 64) (2496 512 64) (2496 512 192)"
			"material" "DEV/DEV_MEASUREGENERIC01"
			"uaxis" "[0 1 0 0] 0.25"
			"vaxis" "[0 0 -1 0] 0.25"
			"rotation" "0"
			"lightmapscale" "16"
			"smoothing_groups" "0"
		}
		side
		{
			"id" "50"
			"plane" "(-512 576 64) (2496 576 64) (2496 576 192)"
			"material" "DEV/DEV_MEASUREGENERIC01"
			"uaxis" "[1 0 0 0] 0.25"
			"vaxis" "[0 0 -1 0] 0.25"
			"rotation" "0"
			"lightmapscale" "16"
			"smoothing_groups" "0"
		}
		side
		{
			"id" "49"
			"plane" "(2496 512 64) (-512 512 64) (-512 512 192)"
			"material" "DEV/DEV_MEASUREGENERIC01"
			"uaxis" "[1 0 0 0] 0.25"
			"vaxis" "[0 0 -1 0] 0.25"
			"rotation" "0"
			"lightmapscale" "16"
			"smoothing_groups" "0"
		}
		editor
		{
			"color" "0 206 123"
			"visgroupshown" "1"
			"visgroupautoshown" "1"
		}
	}
	solid
	{
		"id" "11"
		side
		{
			"id" "66"
			"plane" "(-512 -1088 192) (-512 -1024 192) (2496 -1024 192)"
			"material" "DEV/DEV_MEASUREGENERIC01"
			"uaxis" "[1 0 0 0] 0.25"
			"vaxis" "[0 -1 0 0] 0.25"
			"rotation" "0"
			"lightmapscale" "16"
			"smoothing_groups" "0"
		}
		side
		{
			"id" "65"
			"plane" "(-512 -1024 64) (-512 -1088 64) (2496 -1088 64)"
			"material" "DEV/DEV_MEASUREGENERIC01"
			"uaxis" "[1 0 0 0] 0.25"
			"vaxis" "[0 -1 0 0] 0.25"
			"rotation" "0"
			"lightmapscale" "16"
			"smoothing_groups" "0"
		}
		side
		{
			"id" "64"
			"plane" "(-512 -1088 64) (-512 -1024 64) (-512 -1024 192)"
			"material" "DEV/DEV_MEASUREGENERIC01"
			"uaxis" "[0 1 0 0] 0.25"
			"vaxis" "[0 0 -1 0] 0.25"
			"rotation" "0"
			"lightmapscale" "16"
			"smoothing_groups" "0"
		}
		side
		{
			"id" "63"
			"plane" "(2496 -1024 64) (2496 -1088 64) (2496 -1088 192)"
			"material" "DEV/DEV_MEASUREGENERIC01"
			"uaxis" "[0 1 0 0] 0.25"
			"vaxis" "[0 0 -1 0] 0.25"
			"rotation" "0"
			"lightmapscale" "16"
			"smoothing_groups" "0"
		}
		side
		{
			"id" "62"
			"plane" "(-512 -1024 64) (2496 -1024 64) (2496 -1024 192)"
			"material" "DEV/DEV_MEASUREGENERIC01"
			"uaxis" "[1 0 0 0] 0.25"
			"vaxis" "[0 0 -1 0] 0.25"
			"rotation" "0"
			"lightmapscale" "16"
			"smoothing_groups" "0"
		}
		side
		{
			"id" "61"
			"plane" "(2496 -1088 64) (-512 -1088 64) (-512 -1088 192)"
			"material" "DEV/DEV_MEASUREGENERIC01"
			"uaxis" "[1 0 0 0] 0.25"
			"vaxis" "[0 0 -1 0] 0.25"
			"rotation" "0"
			"lightmapscale" "16"
			"smoothing_groups" "0"
		}
		editor
		{
			"color" "0 206 123"
			"visgroupshown" "1"
			"visgroupautoshown" "1"
		}
	}
	solid
	{
		"id" "12"
		side
		{
			"id" "96"
			"plane" "(-512 -1088 960) (-512 -1024 960) (2496 -1024 960)"
			"material" "TOOLS/TOOLSSKYBOX"
			"uaxis" "[1 0 0 0] 0.25"
			"vaxis" "[0 -1 0 0] 0.25"
			"rotation" "0"
			"lightmapscale" "16"
			"smoothing_groups" "0"
		}
		side
		{
			"id" "95"
			"plane" "(-512 -1024 192) (-512 -1088 192) (2496 -1088 192)"
			"material" "TOOLS/TOOLSSKYBOX"
			"uaxis" "[1 0 0 0] 0.25"
			"vaxis" "[0 -1 0 0] 0.25"
			"rotation" "0"
			"lightmapscale" "16"
			"smoothing_groups" "0"
		}
		side
		{
			"id" "94"
			"plane" "(-512 -1088 192) (-512 -1024 192) (-512 -1024 960)"
			"material" "TOOLS/TOOLSSKYBOX"
			"uaxis" "[0 1 0 0] 0.25"
			"vaxis" "[0 0 -1 0] 0.25"
			"rotation" "0"
			"lightmapscale" "16"
			"smoothing_groups" "0"
		}
		side
		{
			"id" "93"
			"plane" "(2496 -1024 192) (2496 -1088 192) (2496 -1088 960)"
			"material" "TOOLS/TOOLSSKYBOX"
			"uaxis" "[0 1 0 0] 0.25"
			"vaxis" "[0 0 -1 0] 0.25"
			"rotation" "0"
			"lightmapscale" "16"
			"smoothing_groups" "0"
		}
		side
		{
			"id" "92"
			"plane" "(-512 -1024 192) (2496 -1024 192) (2496 -1024 960)"
			"material" "TOOLS/TOOLSSKYBOX"
			"uaxis" "[1 0 0 0] 0.25"
			"vaxis" "[0 0 -1 0] 0.25"
			"rotation" "0"
			"lightmapscale" "16"
			"smoothing_groups" "0"
		}
		side
		{
			"id" "91"
			"plane" "(2496 -1088 192) (-512 -1088 192) (-512 -1088 960)"
			"material" "TOOLS/TOOLSSKYBOX"
			"uaxis" "[1 0 0 0] 0.25"
			"vaxis" "[0 0 -1 0] 0.25"
			"rotation" "0"
			"lightmapscale" "16"
			"smoothing_groups" "0"
		}
		editor
		{
			"color" "0 206 123"
			"visgroupshown" "1"
			"visgroupautoshown" "1"
		}
	}
	solid
	{
		"id" "13"
		side
		{
			"id" "102"
			"plane" "(-512 512 960) (-512 576 960) (2496 576 960)"
			"material" "TOOLS/TOOLSSKYBOX"
			"uaxis" "[1 0 0 0] 0.25"
			"vaxis" "[0 -1 0 0] 0.25"
			"rotation" "0"
			"lightmapscale" "16"
			"smoothing_groups" "0"
		}
		side
		{
			"id" "101"
			"plane" "(-512 576 192) (-512 512 192) (2496 512 192)"
			"material" "TOOLS/TOOLSSKYBOX"
			"uaxis" "[1 0 0 0] 0.25"
			"vaxis" "[0 -1 0 0] 0.25"
			"rotation" "0"
			"lightmapscale" "16"
			"smoothing_groups" "0"
		}
		side
		{
			"id" "100"
			"plane" "(-512 512 192) (-512 576 192) (-512 576 960)"
			"material" "TOOLS/TOOLSSKYBOX"
			"uaxis" "[0 1 0 0] 0.25"
			"vaxis" "[0 0 -1 0] 0.25"
			"rotation" "0"
			"lightmapscale" "16"
			"smoothing_groups" "0"
		}
		side
		{
			"id" "99"
			"plane" "(2496 576 192) (2496 512 192) (2496 512 960)"
			"material" "TOOLS/TOOLSSKYBOX"
			"uaxis" "[0 1 0 0] 0.25"
			"vaxis" "[0 0 -1 0] 0.25"
			"rotation" "0"
			"lightmapscale" "16"
			"smoothing_groups" "0"
		}
		side
		{
			"id" "98"
			"plane" "(-512 576 192) (2496 576 192) (2496 576 960)"
			"material" "TOOLS/TOOLSSKYBOX"
			"uaxis" "[1 0 0 0] 0.25"
			"vaxis" "[0 0 -1 0] 0.25"
			"rotation" "0"
			"lightmapscale" "16"
			"smoothing_groups" "0"
		}
		side
		{
			"id" "97"
			"plane" "(2496 512 192) (-512 512 192) (-512 512 960)"
			"material" "TOOLS/TOOLSSKYBOX"
			"uaxis" "[1 0 0 0] 0.25"
			"vaxis" "[0 0 -1 0] 0.25"
			"rotation" "0"
			"lightmapscale" "16"
			"smoothing_groups" "0"
		}
		editor
		{
			"color" "0 206 123"
			"visgroupshown" "1"
			"visgroupautoshown" "1"
		}
	}
	solid
	{
		"id" "14"
		side
		{
			"id" "108"
			"plane" "(2496 -1024 960) (2496 512 960) (2560 512 960)"
			"material" "TOOLS/TOOLSSKYBOX"
			"uaxis" "[1 0 0 0] 0.25"
			"vaxis" "[0 -1 0 0] 0.25"
			"rotation" "0"
			"lightmapscale" "16"
			"smoothing_groups" "0"
		}
		side
		{
			"id" "107"
			"plane" "(2496 512 192) (2496 -1024 192) (2560 -1024 192)"
			"material" "TOOLS/TOOLSSKYBOX"
			"uaxis" "[1 0 0 0] 0.25"
			"vaxis" "[0 -1 0 0] 0.25"
			"rotation" "0"
			"lightmapscale" "16"
			"smoothing_groups" "0"
		}
		side
		{
			"id" "106"
			"plane" "(2496 -1024 192) (2496 512 192) (2496 512 960)"
			"material" "TOOLS/TOOLSSKYBOX"
			"uaxis" "[0 1 0 0] 0.25"
			"vaxis" "[0 0 -1 0] 0.25"
			"rotation" "0"
			"lightmapscale" "16"
			"smoothing_groups" "0"
		}
		side
		{
			"id" "105"
			"plane" "(2560 512 192) (2560 -1024 192) (2560 -1024 960)"
			"material" "TOOLS/TOOLSSKYBOX"
			"uaxis" "[0 1 0 0] 0.25"
			"vaxis" "[0 0 -1 0] 0.25"
			"rotation" "0"
			"lightmapscale" "16"
			"smoothing_groups" "0"
		}
		side
		{
			"id" "104"
			"plane" "(2496 512 192) (2560 512 192) (2560 512 960)"
			"material" "TOOLS/TOOLSSKYBOX"
			"uaxis" "[1 0 0 0] 0.25"
			"vaxis" "[0 0 -1 0] 0.25"
			"rotation" "0"
			"lightmapscale" "16"
			"smoothing_groups" "0"
		}
		side
		{
			"id" "103"
			"plane" "(2560 -1024 192) (2496 -1024 192) (2496 -1024 960)"
			"material" "TOOLS/TOOLSSKYBOX"
			"uaxis" "[1 0 0 0] 0.25"
			"vaxis" "[0 0 -1 0] 0.25"
			"rotation" "0"
			"lightmapscale" "16"
			"smoothing_groups" "0"
		}
		editor
		{
			"color" "0 206 123"
			"visgroupshown" "1"
			"visgroupautoshown" "1"
		}
	}
	solid
	{
		"id" "15"
		side
		{
			"id" "114"
			"plane" "(-576 -1024 960) (-576 512 960) (-512 512 960)"
			"material" "TOOLS/TOOLSSKYBOX"
			"uaxis" "[1 0 0 0] 0.25"
			"vaxis" "[0 -1 0 0] 0.25"
			"rotation" "0"
			"lightmapscale" "16"
			"smoothing_groups" "0"
		}
		side
		{
			"id" "113"
			"plane" "(-576 512 192) (-576 -1024 192) (-512 -1024 192)"
			"material" "TOOLS/TOOLSSKYBOX"
			"uaxis" "[1 0 0 0] 0.25"
			"vaxis" "[0 -1 0 0] 0.25"
			"rotation" "0"
			"lightmapscale" "16"
			"smoothing_groups" "0"
		}
		side
		{
			"id" "112"
			"plane" "(-576 -1024 192) (-576 512 192) (-576 512 960)"
			"material" "TOOLS/TOOLSSKYBOX"
			"uaxis" "[0 1 0 0] 0.25"
			"vaxis" "[0 0 -1 0] 0.25"
			"rotation" "0"
			"lightmapscale" "16"
			"smoothing_groups" "0"
		}
		side
		{
			"id" "111"
			"plane" "(-512 512 192) (-512 -1024 192) (-512 -1024 960)"
			"material" "TOOLS/TOOLSSKYBOX"
			"uaxis" "[0 1 0 0] 0.25"
			"vaxis" "[0 0 -1 0] 0.25"
			"rotation" "0"
			"lightmapscale" "16"
			"smoothing_groups" "0"
		}
		side
		{
			"id" "110"
			"plane" "(-576 512 192) (-512 512 192) (-512 512 960)"
			"material" "TOOLS/TOOLSSKYBOX"
			"uaxis" "[1 0 0 0] 0.25"
			"vaxis" "[0 0 -1 0] 0.25"
			"rotation" "0"
			"lightmapscale" "16"
			"smoothing_groups" "0"
		}
		side
		{
			"id" "109"
			"plane" "(-512 -1024 192) (-576 -1024 192) (-576 -1024 960)"
			"material" "TOOLS/TOOLSSKYBOX"
			"uaxis" "[1 0 0 0] 0.25"
			"vaxis" "[0 0 -1 0] 0.25"
			"rotation" "0"
			"lightmapscale" "16"
			"smoothing_groups" "0"
		}
		editor
		{
			"color" "0 206 123"
			"visgroupshown" "1"
			"visgroupautoshown" "1"
		}
	}
	solid
	{
		"id" "128"
		side
		{
			"id" "121"
			"plane" "(256 0 96) (256 512 96) (288 512 96)"
			"material" "BRICK/BRICKFLOOR001A"
			"uaxis" "[1 0 0 0] 0.25"
			"vaxis" "[0 -1 0 0] 0.25"
			"rotation" "0"
			"lightmapscale" "16"
			"smoothing_groups" "0"
		}
		side
		{
			"id" "122"
			"plane" "(256 512 64) (256 0 64) (288 0 64)"
			"material" "BRICK/BRICKFLOOR001A"
			"uaxis" "[1 0 0 0] 0.25"
			"vaxis" "[0 -1 0 0] 0.25"
			"rotation" "0"
			"lightmapscale" "16"
			"smoothing_groups" "0"
		}
		side
		{
			"id" "123"
			"plane" "(256 0 64) (256 512 64) (256 512 96)"
			"material" "BRICK/BRICKFLOOR001A"
			"uaxis" "[0 1 0 0] 0.25"
			"vaxis" "[0 0 -1 0] 0.25"
			"rotation" "0"
			"lightmapscale" "16"
			"smoothing_groups" "0"
		}
		side
		{
			"id" "124"
			"plane" "(288 512 64) (288 0 64) (288 0 96)"
			"material" "BRICK/BRICKFLOOR001A"
			"uaxis" "[0 1 0 0] 0.25"
			"vaxis" "[0 0 -1 0] 0.25"
			"rotation" "0"
			"lightmapscale" "16"
			"smoothing_groups" "0"
		}
		side
		{
			"id" "125"
			"plane" "(256 512 64) (288 512 64) (288 512 96)"
			"material" "BRICK/BRICKFLOOR001A"
			"uaxis" "[1 0 0 0] 0.25"
			"vaxis" "[0 0 -1 0] 0.25"
			"rotation" "0"
			"lightmapscale" "16"
			"smoothing_groups" "0"
		}
		side
		{
			"id" "126"
			"plane" "(288 0 64) (256 0 64) (256 0 96)"
			"material" "BRICK/BRICKFLOOR001A"
			"uaxis" "[1 0 0 0] 0.25"
			"vaxis" "[0 0 -1 0] 0.25"
			"rotation" "0"
			"lightmapscale" "16"
			"smoothing_groups" "0"
		}
		editor
		{
			"color" "0 201 114"
			"visgroupshown" "1"
			"visgroupautoshown" "1"
		}
	}
	solid
	{
		"id" "606"
		side
		{
			"id" "151"
			"plane" "(288 416 96) (288 448 96) (736 448 96)"
			"material" "BRICK/BRICKFLOOR001A"
			"uaxis" "[1 0 0 0] 0.25"
			"vaxis" "[0 -1 0 0] 0.25"
			"rotation" "0"
			"lightmapscale" "16"
			"smoothing_groups" "0"
		}
		side
		{
			"id" "152"
			"plane" "(288 448 64.1189) (288 416 64.1189) (736 416 64.1189)"
			"material" "BRICK/BRICKFLOOR001A"
			"uaxis" "[1 0 0 0] 0.25"
			"vaxis" "[0 -1 0 0] 0.25"
			"rotation" "0"
			"lightmapscale" "16"
			"smoothing_groups" "0"
		}
		side
		{
			"id" "153"
			"plane" "(288 416 64.118) (288 448 64.118) (288 448 96)"
			"material" "BRICK/BRICKFLOOR001A"
			"uaxis" "[0 1 0 0] 0.25"
			"vaxis" "[0 0 -1 0] 0.25"
			"rotation" "0"
			"lightmapscale" "16"
			"smoothing_groups" "0"
		}
		side
		{
			"id" "154"
			"plane" "(736 448 64.118) (736 416 64.118) (736 416 96)"
			"material" "BRICK/BRICKFLOOR001A"
			"uaxis" "[0 1 0 0] 0.25"
			"vaxis" "[0 0 -1 0] 0.25"
			"rotation" "0"
			"lightmapscale" "16"
			"smoothing_groups" "0"
		}
		side
		{
			"id" "155"
			"plane" "(288 448 64.118) (736 448 64.118) (736 448 96)"
			"material" "BRICK/BRICKFLOOR001A"
			"uaxis" "[1 0 0 0] 0.25"
			"vaxis" "[0 0 -1 0] 0.25"
			"rotation" "0"
			"lightmapscale" "16"
			"smoothing_groups" "0"
		}
		side
		{
			"id" "156"
			"plane" "(736 416 64.1181) (288 416 64.118) (288 416 96)"
			"material" "BRICK/BRICKFLOOR001A"
			"uaxis" "[1 0 0 0] 0.25"
			"vaxis" "[0 0 -1 0] 0.25"
			"rotation" "0"
			"lightmapscale" "16"
			"smoothing_groups" "0"
		}
		editor
		{
			"color" "0 141 130"
			"visgroupshown" "1"
			"visgroupautoshown" "1"
		}
	}
	solid
	{
		"id" "607"
		side
		{
			"id" "157"
			"plane" "(704 416 96) (736 416 96) (736 128 96)"
			"material" "BRICK/BRICKFLOOR001A"
			"uaxis" "[1 0 0 0] 0.25"
			"vaxis" "[0 -1 0 0] 0.25"
			"rotation" "0"
			"lightmapscale" "16"
			"smoothing_groups" "0"
		}
		side
		{
			"id" "158"
			"plane" "(704 128 64.1189) (736 128 64.1189) (736 416 64.1189)"
			"material" "BRICK/BRICKFLOOR001A"
			"uaxis" "[1 0 0 0] 0.25"
			"vaxis" "[0 -1 0 0] 0.25"
			"rotation" "0"
			"lightmapscale" "16"
			"smoothing_groups" "0"
		}
		side
		{
			"id" "159"
			"plane" "(704 416 96) (704 128 96) (704 128 64.1189)"
			"material" "BRICK/BRICKFLOOR001A"
			"uaxis" "[0 1 0 0] 0.25"
			"vaxis" "[0 0 -1 0] 0.25"
			"rotation" "0"
			"lightmapscale" "16"
			"smoothing_groups" "0"
		}
		side
		{
			"id" "160"
			"plane" "(736 416 64.1189) (736 128 64.1189) (736 128 96)"
			"material" "BRICK/BRICKFLOOR001A"
			"uaxis" "[0 1 0 0] 0.25"
			"vaxis" "[0 0 -1 0] 0.25"
			"rotation" "0"
			"lightmapscale" "16"
			"smoothing_groups" "0"
		}
		side
		{
			"id" "161"
			"plane" "(736 416 96) (704 416 96) (704 416 64.1189)"
			"material" "BRICK/BRICKFLOOR001A"
			"uaxis" "[1 0 0 0] 0.25"
			"vaxis" "[0 0 -1 0] 0.25"
			"rotation" "0"
			"lightmapscale" "16"
			"smoothing_groups" "0"
		}
		side
		{
			"id" "162"
			"plane" "(736 128 64.1189) (704 128 64.1189) (704 128 96)"
			"material" "BRICK/BRICKFLOOR001A"
			"uaxis" "[1 0 0 0] 0.25"
			"vaxis" "[0 0 -1 0] 0.25"
			"rotation" "0"
			"lightmapscale" "16"
			"smoothing_groups" "0"
		}
		editor
		{
			"color" "0 159 152"
			"visgroupshown" "1"
			"visgroupautoshown" "1"
		}
	}
	solid
	{
		"id" "608"
		side
		{
			"id" "163"
			"plane" "(704 128 96) (800 128 96) (800 96 96)"
			"material" "BRICK/BRICKFLOOR001A"
			"uaxis" "[1 0 0 0] 0.25"
			"vaxis" "[0 -1 0 0] 0.25"
			"rotation" "0"
			"lightmapscale" "16"
			"smoothing_groups" "0"
		}
		side
		{
			"id" "164"
			"plane" "(704 96 64.1189) (800 96 64.1189) (800 128 64.1189)"
			"material" "BRICK/BRICKFLOOR001A"
			"uaxis" "[1 0 0 0] 0.25"
			"vaxis" "[0 -1 0 0] 0.25"
			"rotation" "0"
			"lightmapscale" "16"
			"smoothing_groups" "0"
		}
		side
		{
			"id" "165"
			"plane" "(704 128 96) (704 96 96) (704 96 64.1189)"
			"material" "BRICK/BRICKFLOOR001A"
			"uaxis" "[0 1 0 0] 0.25"
			"vaxis" "[0 0 -1 0] 0.25"
			"rotation" "0"
			"lightmapscale" "16"
			"smoothing_groups" "0"
		}
		side
		{
			"id" "166"
			"plane" "(800 128 64.1189) (800 96 64.1189) (800 96 96)"
			"material" "BRICK/BRICKFLOOR001A"
			"uaxis" "[0 1 0 0] 0.25"
			"vaxis" "[0 0 -1 0] 0.25"
			"rotation" "0"
			"lightmapscale" "16"
			"smoothing_groups" "0"
		}
		side
		{
			"id" "167"
			"plane" "(800 128 96) (704 128 96) (704 128 64.1189)"
			"material" "BRICK/BRICKFLOOR001A"
			"uaxis" "[1 0 0 0] 0.25"
			"vaxis" "[0 0 -1 0] 0.25"
			"rotation" "0"
			"lightmapscale" "16"
			"smoothing_groups" "0"
		}
		side
		{
			"id" "168"
			"plane" "(800 96 64.1189) (704 96 64.1189) (704 96 96)"
			"material" "BRICK/BRICKFLOOR001A"
			"uaxis" "[1 0 0 0] 0.25"
			"vaxis" "[0 0 -1 0] 0.25"
			"rotation" "0"
			"lightmapscale" "16"
			"smoothing_groups" "0"
		}
		editor
		{
			"color" "0 145 174"
			"visgroupshown" "1"
			"visgroupautoshown" "1"
		}
	}
	solid
	{
		"id" "674"
		side
		{
			"id" "180"
			"plane" "(1344 96 240) (1344 512 240) (1376 512 240)"
			"material" "DEV/DEV_MEASUREGENERIC01"
			"uaxis" "[1 0 0 0] 0.25"
			"vaxis" "[0 -1 0 0] 0.25"
			"rotation" "0"
			"lightmapscale" "16"
			"smoothing_groups" "0"
		}
		side
		{
			"id" "179"
			"plane" "(1344 512 64) (1344 96 64) (1376 96 64)"
			"material" "DEV/DEV_MEASUREGENERIC01"
			"uaxis" "[1 0 0 0] 0.25"
			"vaxis" "[0 -1 0 0] 0.25"
			"rotation" "0"
			"lightmapscale" "16"
			"smoothing_groups" "0"
		}
		side
		{
			"id" "178"
			"plane" "(1344 96 64) (1344 512 64) (1344 512 240)"
			"material" "DEV/DEV_MEASUREGENERIC01"
			"uaxis" "[0 1 0 0] 0.25"
			"vaxis" "[0 0 -1 0] 0.25"
			"rotation" "0"
			"lightmapscale" "16"
			"smoothing_groups" "0"
		}
		side
		{
			"id" "177"
			"plane" "(1376 512 64) (1376 96 64) (1376 96 240)"
			"material" "DEV/DEV_MEASUREGENERIC01"
			"uaxis" "[0 1 0 0] 0.25"
			"vaxis" "[0 0 -1 0] 0.25"
			"rotation" "0"
			"lightmapscale" "16"
			"smoothing_groups" "0"
		}
		side
		{
			"id" "176"
			"plane" "(1344 512 64) (1376 512 64) (1376 512 240)"
			"material" "DEV/DEV_MEASUREGENERIC01"
			"uaxis" "[1 0 0 0] 0.25"
			"vaxis" "[0 0 -1 0] 0.25"
			"rotation" "0"
			"lightmapscale" "16"
			"smoothing_groups" "0"
		}
		side
		{
			"id" "175"
			"plane" "(1376 96 64) (1344 96 64) (1344 96 240)"
			"material" "DEV/DEV_MEASUREGENERIC01"
			"uaxis" "[1 0 0 0] 0.25"
			"vaxis" "[0 0 -1 0] 0.25"
			"rotation" "0"
			"lightmapscale" "16"
			"smoothing_groups" "0"
		}
		editor
		{
			"color" "0 138 211"
			"visgroupshown" "1"
			"visgroupautoshown" "1"
		}
	}
	solid
	{
		"id" "728"
		side
		{
			"id" "199"
			"plane" "(832 448 96) (1344 448 96) (1344 416 96)"
			"material" "BRICK/BRICKFLOOR001A"
			"uaxis" "[1 0 0 0] 0.25"
			"vaxis" "[0 -1 0 0] 0.25"
			"rotation" "0"
			"lightmapscale" "16"
			"smoothing_groups" "0"
		}
		side
		{
			"id" "200"
			"plane" "(832 416 59.716) (1344 416 59.716) (1344 448 59.716)"
			"material" "BRICK/BRICKFLOOR001A"
			"uaxis" "[1 0 0 0] 0.25"
			"vaxis" "[0 -1 0 0] 0.25"
			"rotation" "0"
			"lightmapscale" "16"
			"smoothing_groups" "0"
		}
		side
		{
			"id" "201"
			"plane" "(832 448 96) (832 416 96) (832 416 59.716)"
			"material" "BRICK/BRICKFLOOR001A"
			"uaxis" "[0 1 0 0] 0.25"
			"vaxis" "[0 0 -1 0] 0.25"
			"rotation" "0"
			"lightmapscale" "16"
			"smoothing_groups" "0"
		}
		side
		{
			"id" "202"
			"plane" "(1344 448 59.716) (1344 416 59.716) (1344 416 96)"
			"material" "BRICK/BRICKFLOOR001A"
			"uaxis" "[0 1 0 0] 0.25"
			"vaxis" "[0 0 -1 0] 0.25"
			"rotation" "0"
			"lightmapscale" "16"
			"smoothing_groups" "0"
		}
		side
		{
			"id" "203"
			"plane" "(1344 448 96) (832 448 96) (832 448 59.716)"
			"material" "BRICK/BRICKFLOOR001A"
			"uaxis" "[1 0 0 0] 0.25"
			"vaxis" "[0 0 -1 0] 0.25"
			"rotation" "0"
			"lightmapscale" "16"
			"smoothing_groups" "0"
		}
		side
		{
			"id" "204"
			"plane" "(1344 416 59.716) (832 416 59.716) (832 416 96)"
			"material" "BRICK/BRICKFLOOR001A"
			"uaxis" "[1 0 0 0] 0.25"
			"vaxis" "[0 0 -1 0] 0.25"
			"rotation" "0"
			"lightmapscale" "16"
			"smoothing_groups" "0"
		}
		editor
		{
			"color" "0 165 114"
			"visgroupshown" "1"
			"visgroupautoshown" "1"
		}
	}
	solid
	{
		"id" "817"
		side
		{
			"id" "205"
			"plane" "(608 320 96) (640 320 96) (640 224 96)"
			"material" "BRICK/BRICKFLOOR001A"
			"uaxis" "[1 0 0 0] 0.25"
			"vaxis" "[0 -1 0 0] 0.25"
			"rotation" "0"
			"lightmapscale" "16"
			"smoothing_groups" "0"
		}
		side
		{
			"id" "206"
			"plane" "(608 224 72.8915) (640 224 72.8915) (640 320 72.8915)"
			"material" "BRICK/BRICKFLOOR001A"
			"uaxis" "[1 0 0 0] 0.25"
			"vaxis" "[0 -1 0 0] 0.25"
			"rotation" "0"
			"lightmapscale" "16"
			"smoothing_groups" "0"
		}
		side
		{
			"id" "207"
			"plane" "(608 320 96) (608 224 96) (608 224 72.8915)"
			"material" "BRICK/BRICKFLOOR001A"
			"uaxis" "[0 1 0 0] 0.25"
			"vaxis" "[0 0 -1 0] 0.25"
			"rotation" "0"
			"lightmapscale" "16"
			"smoothing_groups" "0"
		}
		side
		{
			"id" "208"
			"plane" "(640 320 72.8915) (640 224 72.8915) (640 224 96)"
			"material" "BRICK/BRICKFLOOR001A"
			"uaxis" "[0 1 0 0] 0.25"
			"vaxis" "[0 0 -1 0] 0.25"
			"rotation" "0"
			"lightmapscale" "16"
			"smoothing_groups" "0"
		}
		side
		{
			"id" "209"
			"plane" "(640 320 96) (608 320 96) (608 320 72.8915)"
			"material" "BRICK/BRICKFLOOR001A"
			"uaxis" "[1 0 0 0] 0.25"
			"vaxis" "[0 0 -1 0] 0.25"
			"rotation" "0"
			"lightmapscale" "16"
			"smoothing_groups" "0"
		}
		side
		{
			"id" "210"
			"plane" "(640 224 72.8915) (608 224 72.8915) (608 224 96)"
			"material" "BRICK/BRICKFLOOR001A"
			"uaxis" "[1 0 0 0] 0.25"
			"vaxis" "[0 0 -1 0] 0.25"
			"rotation" "0"
			"lightmapscale" "16"
			"smoothing_groups" "0"
		}
		editor
		{
			"color" "0 209 150"
			"visgroupshown" "1"
			"visgroupautoshown" "1"
		}
	}
	solid
	{
		"id" "818"
		side
		{
			"id" "211"
			"plane" "(512 224 96) (608 224 96) (608 192 96)"
			"material" "BRICK/BRICKFLOOR001A"
			"uaxis" "[1 0 0 0] 0.25"
			"vaxis" "[0 -1 0 0] 0.25"
			"rotation" "0"
			"lightmapscale" "16"
			"smoothing_groups" "0"
		}
		side
		{
			"id" "212"
			"plane" "(512 192 72.8915) (608 192 72.8915) (608 224 72.8915)"
			"material" "BRICK/BRICKFLOOR001A"
			"uaxis" "[1 0 0 0] 0.25"
			"vaxis" "[0 -1 0 0] 0.25"
			"rotation" "0"
			"lightmapscale" "16"
			"smoothing_groups" "0"
		}
		side
		{
			"id" "213"
			"plane" "(512 224 96) (512 192 96) (512 192 72.8915)"
			"material" "BRICK/BRICKFLOOR001A"
			"uaxis" "[0 1 0 0] 0.25"
			"vaxis" "[0 0 -1 0] 0.25"
			"rotation" "0"
			"lightmapscale" "16"
			"smoothing_groups" "0"
		}
		side
		{
			"id" "214"
			"plane" "(608 224 72.8915) (608 192 72.8915) (608 192 96)"
			"material" "BRICK/BRICKFLOOR001A"
			"uaxis" "[0 1 0 0] 0.25"
			"vaxis" "[0 0 -1 0] 0.25"
			"rotation" "0"
			"lightmapscale" "16"
			"smoothing_groups" "0"
		}
		side
		{
			"id" "215"
			"plane" "(608 224 96) (512 224 96) (512 224 72.8915)"
			"material" "BRICK/BRICKFLOOR001A"
			"uaxis" "[1 0 0 0] 0.25"
			"vaxis" "[0 0 -1 0] 0.25"
			"rotation" "0"
			"lightmapscale" "16"
			"smoothing_groups" "0"
		}
		side
		{
			"id" "216"
			"plane" "(608 192 72.8915) (512 192 72.8915) (512 192 96)"
			"material" "BRICK/BRICKFLOOR001A"
			"uaxis" "[1 0 0 0] 0.25"
			"vaxis" "[0 0 -1 0] 0.25"
			"rotation" "0"
			"lightmapscale" "16"
			"smoothing_groups" "0"
		}
		editor
		{
			"color" "0 227 196"
			"visgroupshown" "1"
			"visgroupautoshown" "1"
		}
	}
	solid
	{
		"id" "819"
		side
		{
			"id" "217"
			"plane" "(512 352 96) (608 352 96) (608 320 96)"
			"material" "BRICK/BRICKFLOOR001A"
			"uaxis" "[1 0 0 0] 0.25"
			"vaxis" "[0 -1 0 0] 0.25"
			"rotation" "0"
			"lightmapscale" "16"
			"smoothing_groups" "0"
		}
		side
		{
			"id" "218"
			"plane" "(512 320 72.8915) (608 320 72.8915) (608 352 72.8915)"
			"material" "BRICK/BRICKFLOOR001A"
			"uaxis" "[1 0 0 0] 0.25"
			"vaxis" "[0 -1 0 0] 0.25"
			"rotation" "0"
			"lightmapscale" "16"
			"smoothing_groups" "0"
		}
		side
		{
			"id" "219"
			"plane" "(512 352 96) (512 320 96) (512 320 72.8915)"
			"material" "BRICK/BRICKFLOOR001A"
			"uaxis" "[0 1 0 0] 0.25"
			"vaxis" "[0 0 -1 0] 0.25"
			"rotation" "0"
			"lightmapscale" "16"
			"smoothing_groups" "0"
		}
		side
		{
			"id" "220"
			"plane" "(608 352 72.8915) (608 320 72.8915) (608 320 96)"
			"material" "BRICK/BRICKFLOOR001A"
			"uaxis" "[0 1 0 0] 0.25"
			"vaxis" "[0 0 -1 0] 0.25"
			"rotation" "0"
			"lightmapscale" "16"
			"smoothing_groups" "0"
		}
		side
		{
			"id" "221"
			"plane" "(608 352 96) (512 352 96) (512 352 72.8915)"
			"material" "BRICK/BRICKFLOOR001A"
			"uaxis" "[1 0 0 0] 0.25"
			"vaxis" "[0 0 -1 0] 0.25"
			"rotation" "0"
			"lightmapscale" "16"
			"smoothing_groups" "0"
		}
		side
		{
			"id" "222"
			"plane" "(608 320 72.8915) (512 320 72.8915) (512 320 96)"
			"material" "BRICK/BRICKFLOOR001A"
			"uaxis" "[1 0 0 0] 0.25"
			"vaxis" "[0 0 -1 0] 0.25"
			"rotation" "0"
			"lightmapscale" "16"
			"smoothing_groups" "0"
		}
		editor
		{
			"color" "0 113 254"
			"visgroupshown" "1"
			"visgroupautoshown" "1"
		}
	}
	solid
	{
		"id" "820"
		side
		{
			"id" "223"
			"plane" "(480 320 96) (512 320 96) (512 224 96)"
			"material" "BRICK/BRICKFLOOR001A"
			"uaxis" "[1 0 0 0] 0.25"
			"vaxis" "[0 -1 0 0] 0.25"
			"rotation" "0"
			"lightmapscale" "16"
			"smoothing_groups" "0"
		}
		side
		{
			"id" "224"
			"plane" "(480 224 72.8915) (512 224 72.8915) (512 320 72.8915)"
			"material" "BRICK/BRICKFLOOR001A"
			"uaxis" "[1 0 0 0] 0.25"
			"vaxis" "[0 -1 0 0] 0.25"
			"rotation" "0"
			"lightmapscale" "16"
			"smoothing_groups" "0"
		}
		side
		{
			"id" "225"
			"plane" "(480 320 96) (480 224 96) (480 224 72.8915)"
			"material" "BRICK/BRICKFLOOR001A"
			"uaxis" "[0 1 0 0] 0.25"
			"vaxis" "[0 0 -1 0] 0.25"
			"rotation" "0"
			"lightmapscale" "16"
			"smoothing_groups" "0"
		}
		side
		{
			"id" "226"
			"plane" "(512 320 72.8915) (512 224 72.8915) (512 224 96)"
			"material" "BRICK/BRICKFLOOR001A"
			"uaxis" "[0 1 0 0] 0.25"
			"vaxis" "[0 0 -1 0] 0.25"
			"rotation" "0"
			"lightmapscale" "16"
			"smoothing_groups" "0"
		}
		side
		{
			"id" "227"
			"plane" "(512 320 96) (480 320 96) (480 320 72.8915)"
			"material" "BRICK/BRICKFLOOR001A"
			"uaxis" "[1 0 0 0] 0.25"
			"vaxis" "[0 0 -1 0] 0.25"
			"rotation" "0"
			"lightmapscale" "16"
			"smoothing_groups" "0"
		}
		side
		{
			"id" "228"
			"plane" "(512 224 72.8915) (480 224 72.8915) (480 224 96)"
			"material" "BRICK/BRICKFLOOR001A"
			"uaxis" "[1 0 0 0] 0.25"
			"vaxis" "[0 0 -1 0] 0.25"
			"rotation" "0"
			"lightmapscale" "16"
			"smoothing_groups" "0"
		}
		editor
		{
			"color" "0 195 156"
			"visgroupshown" "1"
			"visgroupautoshown" "1"
		}
	}
	solid
	{
		"id" "943"
		side
		{
			"id" "229"
			"plane" "(1376 416 96) (1376 448 96) (2336 448 96)"
			"material" "BRICK/BRICKFLOOR001A"
			"uaxis" "[1 0 0 0] 0.25"
			"vaxis" "[0 -1 0 128] 0.25"
			"rotation" "0"
			"lightmapscale" "16"
			"smoothing_groups" "0"
		}
		side
		{
			"id" "230"
			"plane" "(1376 448 63.8915) (1376 416 63.8915) (2336 416 63.8915)"
			"material" "BRICK/BRICKFLOOR001A"
			"uaxis" "[1 0 0 0] 0.25"
			"vaxis" "[0 -1 0 128] 0.25"
			"rotation" "0"
			"lightmapscale" "16"
			"smoothing_groups" "0"
		}
		side
		{
			"id" "231"
			"plane" "(1376 416 63.8911) (1376 448 63.8911) (1376 448 96)"
			"material" "BRICK/BRICKFLOOR001A"
			"uaxis" "[0 1 0 -128] 0.25"
			"vaxis" "[0 0 -1 0] 0.25"
			"rotation" "0"
			"lightmapscale" "16"
			"smoothing_groups" "0"
		}
		side
		{
			"id" "232"
			"plane" "(2336 448 63.8911) (2336 416 63.8911) (2336 416 96)"
			"material" "BRICK/BRICKFLOOR001A"
			"uaxis" "[0 1 0 -128] 0.25"
			"vaxis" "[0 0 -1 0] 0.25"
			"rotation" "0"
			"lightmapscale" "16"
			"smoothing_groups" "0"
		}
		side
		{
			"id" "233"
			"plane" "(1376 448 63.8911) (2336 448 63.891) (2336 448 96)"
			"material" "BRICK/BRICKFLOOR001A"
			"uaxis" "[1 0 0 0] 0.25"
			"vaxis" "[0 0 -1 0] 0.25"
			"rotation" "0"
			"lightmapscale" "16"
			"smoothing_groups" "0"
		}
		side
		{
			"id" "234"
			"plane" "(2336 416 63.8911) (1376 416 63.8911) (1376 416 96)"
			"material" "BRICK/BRICKFLOOR001A"
			"uaxis" "[1 0 0 0] 0.25"
			"vaxis" "[0 0 -1 0] 0.25"
			"rotation" "0"
			"lightmapscale" "16"
			"smoothing_groups" "0"
		}
		editor
		{
			"color" "0 238 215"
			"visgroupshown" "1"
			"visgroupautoshown" "1"
		}
	}
	solid
	{
		"id" "1262"
		side
		{
			"id" "241"
			"plane" "(2336 512 95.9455) (2368 512 95.9455) (2368 0 95.9455)"
			"material" "BRICK/BRICKFLOOR001A"
			"uaxis" "[1 0 0 0] 0.25"
			"vaxis" "[0 -1 0 0] 0.25"
			"rotation" "0"
			"lightmapscale" "16"
			"smoothing_groups" "0"
		}
		side
		{
			"id" "242"
			"plane" "(2336 0 63.9455) (2368 0 63.9455) (2368 512 63.9455)"
			"material" "BRICK/BRICKFLOOR001A"
			"uaxis" "[1 0 0 0] 0.25"
			"vaxis" "[0 -1 0 0] 0.25"
			"rotation" "0"
			"lightmapscale" "16"
			"smoothing_groups" "0"
		}
		side
		{
			"id" "243"
			"plane" "(2336 512 95.9455) (2336 0 95.9455) (2336 0 63.9455)"
			"material" "BRICK/BRICKFLOOR001A"
			"uaxis" "[0 1 0 0] 0.25"
			"vaxis" "[0 0 -1 0] 0.25"
			"rotation" "0"
			"lightmapscale" "16"
			"smoothing_groups" "0"
		}
		side
		{
			"id" "244"
			"plane" "(2368 512 63.9455) (2368 0 63.9455) (2368 0 95.9455)"
			"material" "BRICK/BRICKFLOOR001A"
			"uaxis" "[0 1 0 0] 0.25"
			"vaxis" "[0 0 -1 0] 0.25"
			"rotation" "0"
			"lightmapscale" "16"
			"smoothing_groups" "0"
		}
		side
		{
			"id" "245"
			"plane" "(2368 512 95.9455) (2336 512 95.9455) (2336 512 63.9455)"
			"material" "BRICK/BRICKFLOOR001A"
			"uaxis" "[1 0 0 0] 0.25"
			"vaxis" "[0 0 -1 0] 0.25"
			"rotation" "0"
			"lightmapscale" "16"
			"smoothing_groups" "0"
		}
		side
		{
			"id" "246"
			"plane" "(2368 0 63.9455) (2336 0 63.9455) (2336 0 95.9455)"
			"material" "BRICK/BRICKFLOOR001A"
			"uaxis" "[1 0 0 0] 0.25"
			"vaxis" "[0 0 -1 0] 0.25"
			"rotation" "0"
			"lightmapscale" "16"
			"smoothing_groups" "0"
		}
		editor
		{
			"color" "0 129 242"
			"visgroupshown" "1"
			"visgroupautoshown" "1"
		}
	}
	solid
	{
		"id" "280"
		side
		{
			"id" "258"
			"plane" "(800 96 240) (800 512 240) (832 512 240)"
			"material" "DEV/DEV_MEASUREGENERIC01"
			"uaxis" "[1 0 0 0] 0.25"
			"vaxis" "[0 -1 0 0] 0.25"
			"rotation" "0"
			"lightmapscale" "16"
			"smoothing_groups" "0"
		}
		side
		{
			"id" "257"
			"plane" "(800 512 64) (800 96 64) (832 96 64)"
			"material" "DEV/DEV_MEASUREGENERIC01"
			"uaxis" "[1 0 0 0] 0.25"
			"vaxis" "[0 -1 0 0] 0.25"
			"rotation" "0"
			"lightmapscale" "16"
			"smoothing_groups" "0"
		}
		side
		{
			"id" "256"
			"plane" "(800 96 64) (800 512 64) (800 512 240)"
			"material" "DEV/DEV_MEASUREGENERIC01"
			"uaxis" "[0 1 0 0] 0.25"
			"vaxis" "[0 0 -1 0] 0.25"
			"rotation" "0"
			"lightmapscale" "16"
			"smoothing_groups" "0"
		}
		side
		{
			"id" "255"
			"plane" "(832 512 64) (832 96 64) (832 96 240)"
			"material" "DEV/DEV_MEASUREGENERIC01"
			"uaxis" "[0 1 0 0] 0.25"
			"vaxis" "[0 0 -1 0] 0.25"
			"rotation" "0"
			"lightmapscale" "16"
			"smoothing_groups" "0"
		}
		side
		{
			"id" "254"
			"plane" "(800 512 64) (832 512 64) (832 512 240)"
			"material" "DEV/DEV_MEASUREGENERIC01"
			"uaxis" "[1 0 0 0] 0.25"
			"vaxis" "[0 0 -1 0] 0.25"
			"rotation" "0"
			"lightmapscale" "16"
			"smoothing_groups" "0"
		}
		side
		{
			"id" "253"
			"plane" "(832 96 64) (800 96 64) (800 96 240)"
			"material" "DEV/DEV_MEASUREGENERIC01"
			"uaxis" "[1 0 0 0] 0.25"
			"vaxis" "[0 0 -1 0] 0.25"
			"rotation" "0"
			"lightmapscale" "16"
			"smoothing_groups" "0"
		}
		editor
		{
			"color" "0 138 211"
			"visgroupshown" "1"
			"visgroupautoshown" "1"
		}
	}
	solid
	{
		"id" "1385"
		side
		{
			"id" "270"
			"plane" "(-512 -32 96) (-512 1.90735e-006 96) (256 1.90735e-006 96)"
			"material" "BRICK/BRICKFLOOR001A"
			"uaxis" "[1 0 0 64] 0.25"
			"vaxis" "[0 -1 0 -455.183] 0.25"
			"rotation" "0"
			"lightmapscale" "16"
			"smoothing_groups" "0"
		}
		side
		{
			"id" "269"
			"plane" "(-512 1.90735e-006 64) (-512 -32 64) (256 -32 64)"
			"material" "BRICK/BRICKFLOOR001A"
			"uaxis" "[1 0 0 64] 0.25"
			"vaxis" "[0 -1 0 -455.183] 0.25"
			"rotation" "0"
			"lightmapscale" "16"
			"smoothing_groups" "0"
		}
		side
		{
			"id" "268"
			"plane" "(-512 -32 64) (-512 1.90735e-006 64) (-512 1.90735e-006 96)"
			"material" "BRICK/BRICKFLOOR001A"
			"uaxis" "[0 1 0 455.183] 0.25"
			"vaxis" "[0 0 -1 0] 0.25"
			"rotation" "0"
			"lightmapscale" "16"
			"smoothing_groups" "0"
		}
		side
		{
			"id" "267"
			"plane" "(256 1.90735e-006 64) (256 -32 64) (256 -32 96)"
			"material" "BRICK/BRICKFLOOR001A"
			"uaxis" "[0 1 0 455.183] 0.25"
			"vaxis" "[0 0 -1 0] 0.25"
			"rotation" "0"
			"lightmapscale" "16"
			"smoothing_groups" "0"
		}
		side
		{
			"id" "266"
			"plane" "(-512 1.90735e-006 64) (256 1.90735e-006 64) (256 1.90735e-006 96)"
			"material" "BRICK/BRICKFLOOR001A"
			"uaxis" "[1 0 0 64] 0.25"
			"vaxis" "[0 0 -1 0] 0.25"
			"rotation" "0"
			"lightmapscale" "16"
			"smoothing_groups" "0"
		}
		side
		{
			"id" "265"
			"plane" "(256 -32 64) (-512 -32 64) (-512 -32 96)"
			"material" "BRICK/BRICKFLOOR001A"
			"uaxis" "[1 0 0 64] 0.25"
			"vaxis" "[0 0 -1 0] 0.25"
			"rotation" "0"
			"lightmapscale" "16"
			"smoothing_groups" "0"
		}
		editor
		{
			"color" "0 201 114"
			"visgroupshown" "1"
			"visgroupautoshown" "1"
		}
	}
	solid
	{
		"id" "1402"
		side
		{
			"id" "282"
			"plane" "(2326.04 -32 240) (2326.04 1.69039e-005 240) (2496 1.69039e-005 240)"
			"material" "DEV/DEV_MEASUREGENERIC01"
			"uaxis" "[1 0 0 -88.1533] 0.25"
			"vaxis" "[0 -1 0 -35.2324] 0.25"
			"rotation" "0"
			"lightmapscale" "16"
			"smoothing_groups" "0"
		}
		side
		{
			"id" "281"
			"plane" "(2326.04 1.69039e-005 64) (2326.04 -32 64) (2496 -32 64)"
			"material" "DEV/DEV_MEASUREGENERIC01"
			"uaxis" "[1 0 0 -88.1533] 0.25"
			"vaxis" "[0 -1 0 -35.2324] 0.25"
			"rotation" "0"
			"lightmapscale" "16"
			"smoothing_groups" "0"
		}
		side
		{
			"id" "280"
			"plane" "(2326.04 -32 64) (2326.04 1.69039e-005 64) (2326.04 1.69039e-005 240)"
			"material" "DEV/DEV_MEASUREGENERIC01"
			"uaxis" "[0 1 0 35.2324] 0.25"
			"vaxis" "[0 0 -1 0] 0.25"
			"rotation" "0"
			"lightmapscale" "16"
			"smoothing_groups" "0"
		}
		side
		{
			"id" "279"
			"plane" "(2496 1.69039e-005 64) (2496 -32 64) (2496 -32 240)"
			"material" "DEV/DEV_MEASUREGENERIC01"
			"uaxis" "[0 1 0 35.2324] 0.25"
			"vaxis" "[0 0 -1 0] 0.25"
			"rotation" "0"
			"lightmapscale" "16"
			"smoothing_groups" "0"
		}
		side
		{
			"id" "278"
			"plane" "(2326.04 1.69039e-005 64) (2496 1.69039e-005 64) (2496 1.69039e-005 240)"
			"material" "DEV/DEV_MEASUREGENERIC01"
			"uaxis" "[1 0 0 -88.1533] 0.25"
			"vaxis" "[0 0 -1 0] 0.25"
			"rotation" "0"
			"lightmapscale" "16"
			"smoothing_groups" "0"
		}
		side
		{
			"id" "277"
			"plane" "(2496 -32 64) (2326.04 -32 64) (2326.04 -32 240)"
			"material" "DEV/DEV_MEASUREGENERIC01"
			"uaxis" "[1 0 0 -88.1533] 0.25"
			"vaxis" "[0 0 -1 0] 0.25"
			"rotation" "0"
			"lightmapscale" "16"
			"smoothing_groups" "0"
		}
		editor
		{
			"color" "0 138 211"
			"visgroupshown" "1"
			"visgroupautoshown" "1"
		}
	}
	solid
	{
		"id" "1422"
		side
		{
			"id" "283"
			"plane" "(2368 -32 96) (2400 -32 96) (2400 -624 96)"
			"material" "DEV/GRAYGRID"
			"uaxis" "[1 0 0 0] 0.25"
			"vaxis" "[0 -1 0 0] 0.25"
			"rotation" "0"
			"lightmapscale" "16"
			"smoothing_groups" "0"
		}
		side
		{
			"id" "284"
			"plane" "(2368 -624 64) (2400 -624 64) (2400 -32 64)"
			"material" "DEV/GRAYGRID"
			"uaxis" "[1 0 0 0] 0.25"
			"vaxis" "[0 -1 0 0] 0.25"
			"rotation" "0"
			"lightmapscale" "16"
			"smoothing_groups" "0"
		}
		side
		{
			"id" "285"
			"plane" "(2368 -32 96) (2368 -624 96) (2368 -624 64)"
			"material" "DEV/GRAYGRID"
			"uaxis" "[0 1 0 0] 0.25"
			"vaxis" "[0 0 -1 0] 0.25"
			"rotation" "0"
			"lightmapscale" "16"
			"smoothing_groups" "0"
		}
		side
		{
			"id" "286"
			"plane" "(2400 -32 64) (2400 -624 64) (2400 -624 96)"
			"material" "DEV/GRAYGRID"
			"uaxis" "[0 1 0 0] 0.25"
			"vaxis" "[0 0 -1 0] 0.25"
			"rotation" "0"
			"lightmapscale" "16"
			"smoothing_groups" "0"
		}
		side
		{
			"id" "287"
			"plane" "(2400 -32 96) (2368 -32 96) (2368 -32 64)"
			"material" "DEV/GRAYGRID"
			"uaxis" "[1 0 0 0] 0.25"
			"vaxis" "[0 0 -1 0] 0.25"
			"rotation" "0"
			"lightmapscale" "16"
			"smoothing_groups" "0"
		}
		side
		{
			"id" "288"
			"plane" "(2400 -624 64) (2368 -624 64) (2368 -624 96)"
			"material" "DEV/GRAYGRID"
			"uaxis" "[1 0 0 0] 0.25"
			"vaxis" "[0 0 -1 0] 0.25"
			"rotation" "0"
			"lightmapscale" "16"
			"smoothing_groups" "0"
		}
		editor
		{
			"color" "0 199 140"
			"visgroupshown" "1"
			"visgroupautoshown" "1"
		}
	}
	solid
	{
		"id" "1577"
		side
		{
			"id" "301"
			"plane" "(2240 -272 96) (2272 -272 96) (2272 -304 96)"
			"material" "CUSTOMDEV/DEV_MEASUREGENERIC01RED"
			"uaxis" "[1 0 0 0] 0.25"
			"vaxis" "[0 -1 0 0] 0.25"
			"rotation" "0"
			"lightmapscale" "16"
			"smoothing_groups" "0"
		}
		side
		{
			"id" "302"
			"plane" "(2240 -304 64) (2272 -304 64) (2272 -272 64)"
			"material" "CUSTOMDEV/DEV_MEASUREGENERIC01RED"
			"uaxis" "[1 0 0 0] 0.25"
			"vaxis" "[0 -1 0 0] 0.25"
			"rotation" "0"
			"lightmapscale" "16"
			"smoothing_groups" "0"
		}
		side
		{
			"id" "303"
			"plane" "(2240 -272 96) (2240 -304 96) (2240 -304 64)"
			"material" "CUSTOMDEV/DEV_MEASUREGENERIC01RED"
			"uaxis" "[0 1 0 0] 0.25"
			"vaxis" "[0 0 -1 0] 0.25"
			"rotation" "0"
			"lightmapscale" "16"
			"smoothing_groups" "0"
		}
		side
		{
			"id" "304"
			"plane" "(2272 -272 64) (2272 -304 64) (2272 -304 96)"
			"material" "CUSTOMDEV/DEV_MEASUREGENERIC01RED"
			"uaxis" "[0 1 0 0] 0.25"
			"vaxis" "[0 0 -1 0] 0.25"
			"rotation" "0"
			"lightmapscale" "16"
			"smoothing_groups" "0"
		}
		side
		{
			"id" "305"
			"plane" "(2272 -272 96) (2240 -272 96) (2240 -272 64)"
			"material" "CUSTOMDEV/DEV_MEASUREGENERIC01RED"
			"uaxis" "[1 0 0 0] 0.25"
			"vaxis" "[0 0 -1 0] 0.25"
			"rotation" "0"
			"lightmapscale" "16"
			"smoothing_groups" "0"
		}
		side
		{
			"id" "306"
			"plane" "(2272 -304 64) (2240 -304 64) (2240 -304 96)"
			"material" "CUSTOMDEV/DEV_MEASUREGENERIC01RED"
			"uaxis" "[1 0 0 0] 0.25"
			"vaxis" "[0 0 -1 0] 0.25"
			"rotation" "0"
			"lightmapscale" "16"
			"smoothing_groups" "0"
		}
		editor
		{
			"color" "0 165 210"
			"visgroupshown" "1"
			"visgroupautoshown" "1"
		}
	}
	solid
	{
		"id" "1666"
		side
		{
			"id" "330"
			"plane" "(-450.783 -1024 240) (-450.783 -608 240) (-418.783 -608 240)"
			"material" "DEV/DEV_MEASUREGENERIC01"
			"uaxis" "[1 0 0 11.1338] 0.25"
			"vaxis" "[0 -1 0 0] 0.25"
			"rotation" "0"
			"lightmapscale" "16"
			"smoothing_groups" "0"
		}
		side
		{
			"id" "329"
			"plane" "(-450.783 -608 64) (-450.783 -1024 64) (-418.783 -1024 64)"
			"material" "DEV/DEV_MEASUREGENERIC01"
			"uaxis" "[1 0 0 11.1338] 0.25"
			"vaxis" "[0 -1 0 0] 0.25"
			"rotation" "0"
			"lightmapscale" "16"
			"smoothing_groups" "0"
		}
		side
		{
			"id" "328"
			"plane" "(-450.783 -1024 64) (-450.783 -608 64) (-450.783 -608 240)"
			"material" "DEV/DEV_MEASUREGENERIC01"
			"uaxis" "[0 1 0 0] 0.25"
			"vaxis" "[0 0 -1 0] 0.25"
			"rotation" "0"
			"lightmapscale" "16"
			"smoothing_groups" "0"
		}
		side
		{
			"id" "327"
			"plane" "(-418.783 -608 64) (-418.783 -1024 64) (-418.783 -1024 240)"
			"material" "DEV/DEV_MEASUREGENERIC01"
			"uaxis" "[0 1 0 0] 0.25"
			"vaxis" "[0 0 -1 0] 0.25"
			"rotation" "0"
			"lightmapscale" "16"
			"smoothing_groups" "0"
		}
		side
		{
			"id" "326"
			"plane" "(-450.783 -608 64) (-418.783 -608 64) (-418.783 -608 240)"
			"material" "DEV/DEV_MEASUREGENERIC01"
			"uaxis" "[1 0 0 11.1338] 0.25"
			"vaxis" "[0 0 -1 0] 0.25"
			"rotation" "0"
			"lightmapscale" "16"
			"smoothing_groups" "0"
		}
		side
		{
			"id" "325"
			"plane" "(-418.783 -1024 64) (-450.783 -1024 64) (-450.783 -1024 240)"
			"material" "DEV/DEV_MEASUREGENERIC01"
			"uaxis" "[1 0 0 11.1338] 0.25"
			"vaxis" "[0 0 -1 0] 0.25"
			"rotation" "0"
			"lightmapscale" "16"
			"smoothing_groups" "0"
		}
		editor
		{
			"color" "0 138 211"
			"visgroupshown" "1"
			"visgroupautoshown" "1"
		}
	}
	solid
	{
		"id" "1667"
		side
		{
			"id" "336"
			"plane" "(93.2166 -1024 240) (93.2166 -608 240) (125.217 -608 240)"
			"material" "DEV/DEV_MEASUREGENERIC01"
			"uaxis" "[1 0 0 11.1338] 0.25"
			"vaxis" "[0 -1 0 0] 0.25"
			"rotation" "0"
			"lightmapscale" "16"
			"smoothing_groups" "0"
		}
		side
		{
			"id" "335"
			"plane" "(93.2166 -608 64) (93.2166 -1024 64) (125.217 -1024 64)"
			"material" "DEV/DEV_MEASUREGENERIC01"
			"uaxis" "[1 0 0 11.1338] 0.25"
			"vaxis" "[0 -1 0 0] 0.25"
			"rotation" "0"
			"lightmapscale" "16"
			"smoothing_groups" "0"
		}
		side
		{
			"id" "334"
			"plane" "(93.2166 -1024 64) (93.2166 -608 64) (93.2166 -608 240)"
			"material" "DEV/DEV_MEASUREGENERIC01"
			"uaxis" "[0 1 0 0] 0.25"
			"vaxis" "[0 0 -1 0] 0.25"
			"rotation" "0"
			"lightmapscale" "16"
			"smoothing_groups" "0"
		}
		side
		{
			"id" "333"
			"plane" "(125.217 -608 64) (125.217 -1024 64) (125.217 -1024 240)"
			"material" "DEV/DEV_MEASUREGENERIC01"
			"uaxis" "[0 1 0 0] 0.25"
			"vaxis" "[0 0 -1 0] 0.25"
			"rotation" "0"
			"lightmapscale" "16"
			"smoothing_groups" "0"
		}
		side
		{
			"id" "332"
			"plane" "(93.2166 -608 64) (125.217 -608 64) (125.217 -608 240)"
			"material" "DEV/DEV_MEASUREGENERIC01"
			"uaxis" "[1 0 0 11.1338] 0.25"
			"vaxis" "[0 0 -1 0] 0.25"
			"rotation" "0"
			"lightmapscale" "16"
			"smoothing_groups" "0"
		}
		side
		{
			"id" "331"
			"plane" "(125.217 -1024 64) (93.2166 -1024 64) (93.2166 -1024 240)"
			"material" "DEV/DEV_MEASUREGENERIC01"
			"uaxis" "[1 0 0 11.1338] 0.25"
			"vaxis" "[0 0 -1 0] 0.25"
			"rotation" "0"
			"lightmapscale" "16"
			"smoothing_groups" "0"
		}
		editor
		{
			"color" "0 138 211"
			"visgroupshown" "1"
			"visgroupautoshown" "1"
		}
	}
	solid
	{
		"id" "1668"
		side
		{
			"id" "342"
			"plane" "(-418.783 -704 96) (-418.783 -672 96) (93.2166 -672 96)"
			"material" "BRICK/BRICKFLOOR001A"
			"uaxis" "[1 0 0 395.134] 0.25"
			"vaxis" "[0 -1 0 128] 0.25"
			"rotation" "0"
			"lightmapscale" "16"
			"smoothing_groups" "0"
		}
		side
		{
			"id" "341"
			"plane" "(-418.783 -672 59.716) (-418.783 -704 59.716) (93.2166 -704 59.716)"
			"material" "BRICK/BRICKFLOOR001A"
			"uaxis" "[1 0 0 395.134] 0.25"
			"vaxis" "[0 -1 0 128] 0.25"
			"rotation" "0"
			"lightmapscale" "16"
			"smoothing_groups" "0"
		}
		side
		{
			"id" "340"
			"plane" "(-418.783 -704 59.716) (-418.783 -672 59.716) (-418.783 -672 96)"
			"material" "BRICK/BRICKFLOOR001A"
			"uaxis" "[0 1 0 -128] 0.25"
			"vaxis" "[0 0 -1 0] 0.25"
			"rotation" "0"
			"lightmapscale" "16"
			"smoothing_groups" "0"
		}
		side
		{
			"id" "339"
			"plane" "(93.2166 -672 59.716) (93.2166 -704 59.716) (93.2166 -704 96)"
			"material" "BRICK/BRICKFLOOR001A"
			"uaxis" "[0 1 0 -128] 0.25"
			"vaxis" "[0 0 -1 0] 0.25"
			"rotation" "0"
			"lightmapscale" "16"
			"smoothing_groups" "0"
		}
		side
		{
			"id" "338"
			"plane" "(-418.783 -672 59.716) (93.2166 -672 59.716) (93.2166 -672 96)"
			"material" "BRICK/BRICKFLOOR001A"
			"uaxis" "[1 0 0 395.134] 0.25"
			"vaxis" "[0 0 -1 0] 0.25"
			"rotation" "0"
			"lightmapscale" "16"
			"smoothing_groups" "0"
		}
		side
		{
			"id" "337"
			"plane" "(93.2166 -704 59.716) (-418.783 -704 59.716) (-418.783 -704 96)"
			"material" "BRICK/BRICKFLOOR001A"
			"uaxis" "[1 0 0 395.134] 0.25"
			"vaxis" "[0 0 -1 0] 0.25"
			"rotation" "0"
			"lightmapscale" "16"
			"smoothing_groups" "0"
		}
		editor
		{
			"color" "0 165 114"
			"visgroupshown" "1"
			"visgroupautoshown" "1"
		}
	}
	solid
	{
		"id" "1782"
		side
		{
			"id" "354"
			"plane" "(2240.31 -448.038 96) (2240.31 -416.038 96) (2272.31 -416.038 96)"
			"material" "CUSTOMDEV/DEV_MEASUREGENERIC01BLU"
			"uaxis" "[1 0 0 -1.22949] 0.25"
			"vaxis" "[0 -1 0 -64.1536] 0.25"
			"rotation" "0"
			"lightmapscale" "16"
			"smoothing_groups" "0"
		}
		side
		{
			"id" "353"
			"plane" "(2240.31 -416.038 64) (2240.31 -448.038 64) (2272.31 -448.038 64)"
			"material" "CUSTOMDEV/DEV_MEASUREGENERIC01BLU"
			"uaxis" "[1 0 0 -1.22949] 0.25"
			"vaxis" "[0 -1 0 -64.1536] 0.25"
			"rotation" "0"
			"lightmapscale" "16"
			"smoothing_groups" "0"
		}
		side
		{
			"id" "352"
			"plane" "(2240.31 -448.038 64) (2240.31 -416.038 64) (2240.31 -416.038 96)"
			"material" "CUSTOMDEV/DEV_MEASUREGENERIC01BLU"
			"uaxis" "[0 1 0 64.1536] 0.25"
			"vaxis" "[0 0 -1 0] 0.25"
			"rotation" "0"
			"lightmapscale" "16"
			"smoothing_groups" "0"
		}
		side
		{
			"id" "351"
			"plane" "(2272.31 -416.038 64) (2272.31 -448.038 64) (2272.31 -448.038 96)"
			"material" "CUSTOMDEV/DEV_MEASUREGENERIC01BLU"
			"uaxis" "[0 1 0 64.1536] 0.25"
			"vaxis" "[0 0 -1 0] 0.25"
			"rotation" "0"
			"lightmapscale" "16"
			"smoothing_groups" "0"
		}
		side
		{
			"id" "350"
			"plane" "(2240.31 -416.038 64) (2272.31 -416.038 64) (2272.31 -416.038 96)"
			"material" "CUSTOMDEV/DEV_MEASUREGENERIC01BLU"
			"uaxis" "[1 0 0 -1.22949] 0.25"
			"vaxis" "[0 0 -1 0] 0.25"
			"rotation" "0"
			"lightmapscale" "16"
			"smoothing_groups" "0"
		}
		side
		{
			"id" "349"
			"plane" "(2272.31 -448.038 64) (2240.31 -448.038 64) (2240.31 -448.038 96)"
			"material" "CUSTOMDEV/DEV_MEASUREGENERIC01BLU"
			"uaxis" "[1 0 0 -1.22949] 0.25"
			"vaxis" "[0 0 -1 0] 0.25"
			"rotation" "0"
			"lightmapscale" "16"
			"smoothing_groups" "0"
		}
		editor
		{
			"color" "0 165 210"
			"visgroupshown" "1"
			"visgroupautoshown" "1"
		}
	}
}
entity
{
	"id" "33"
	"classname" "prop_physics"
	"angles" "0 178.5 0"
	"damagetoenablemotion" "0"
	"Damagetype" "0"
	"disablereceiveshadows" "0"
	"disableshadows" "0"
	"ExplodeDamage" "0"
	"ExplodeRadius" "0"
	"fademaxdist" "0"
	"fademindist" "-1"
	"fadescale" "1"
	"forcetoenablemotion" "0"
	"inertiaScale" "1.0"
	"massScale" "0"
	"maxdxlevel" "0"
	"mindxlevel" "0"
	"minhealthdmg" "0"
	"model" "models/props_junk/wood_crate002a.mdl"
	"modelscale" "1.0"
	"nodamageforces" "0"
	"PerformanceMode" "0"
	"physdamagescale" "0.1"
	"pressuredelay" "0"
	"renderamt" "255"
	"rendercolor" "255 255 255"
	"renderfx" "0"
	"rendermode" "0"
	"shadowcastdist" "0"
	"skin" "0"
	"spawnflags" "256"
	"origin" "-439.638 108.589 87.0724"
	editor
	{
		"color" "220 30 220"
		"visgroupshown" "1"
		"visgroupautoshown" "1"
		"logicalpos" "[0 5500]"
	}
}
entity
{
	"id" "67"
	"classname" "prop_physics"
	"angles" "0 337 0"
	"damagetoenablemotion" "0"
	"Damagetype" "0"
	"disablereceiveshadows" "0"
	"disableshadows" "0"
	"ExplodeDamage" "0"
	"ExplodeRadius" "0"
	"fademaxdist" "0"
	"fademindist" "-1"
	"fadescale" "1"
	"forcetoenablemotion" "0"
	"inertiaScale" "1.0"
	"massScale" "0"
	"maxdxlevel" "0"
	"mindxlevel" "0"
	"minhealthdmg" "0"
	"model" "models/props_junk/wood_crate002a.mdl"
	"modelscale" "1.0"
	"nodamageforces" "0"
	"PerformanceMode" "0"
	"physdamagescale" "0.1"
	"pressuredelay" "0"
	"renderamt" "255"
	"rendercolor" "255 255 255"
	"renderfx" "0"
	"rendermode" "0"
	"shadowcastdist" "0"
	"skin" "0"
	"spawnflags" "256"
	"origin" "-395.494 69.828 88.1491"
	editor
	{
		"color" "220 30 220"
		"visgroupshown" "1"
		"visgroupautoshown" "1"
		"logicalpos" "[0 5500]"
	}
}
entity
{
	"id" "79"
	"classname" "prop_physics"
	"angles" "0 47 0"
	"damagetoenablemotion" "0"
	"Damagetype" "0"
	"disablereceiveshadows" "0"
	"disableshadows" "0"
	"ExplodeDamage" "0"
	"ExplodeRadius" "0"
	"fademaxdist" "0"
	"fademindist" "-1"
	"fadescale" "1"
	"forcetoenablemotion" "0"
	"inertiaScale" "1.0"
	"massScale" "0"
	"maxdxlevel" "0"
	"mindxlevel" "0"
	"minhealthdmg" "0"
	"model" "models/props_junk/wood_crate002a.mdl"
	"modelscale" "1.0"
	"nodamageforces" "0"
	"PerformanceMode" "0"
	"physdamagescale" "0.1"
	"pressuredelay" "0"
	"renderamt" "255"
	"rendercolor" "255 255 255"
	"renderfx" "0"
	"rendermode" "0"
	"shadowcastdist" "0"
	"skin" "0"
	"spawnflags" "256"
	"origin" "-418.643 71.4431 133.909"
	editor
	{
		"color" "220 30 220"
		"visgroupshown" "1"
		"visgroupautoshown" "1"
		"logicalpos" "[0 5500]"
	}
}
entity
{
	"id" "169"
	"classname" "npc_combine_s"
	"additionalequipment" "weapon_smg1"
	"angles" "0 270.5 0"
	"disablereceiveshadows" "0"
	"disableshadows" "0"
	"effects" "0"
	"hintlimiting" "0"
	"ignoreunseenenemies" "0"
	"model" "models/combine_soldier.mdl"
	"NumGrenades" "999999"
	"physdamagescale" "1.0"
	"renderamt" "255"
	"rendercolor" "255 255 255"
	"renderfx" "0"
	"rendermode" "0"
	"sleepstate" "0"
	"spawnflags" "16"
	"tacticalvariant" "0"
	"targetname" "combine_smg1"
	"TeamNum" "2"
	"usemarch" "0"
	"waitingtorappel" "No"
	"wakeradius" "0"
	"wakesquad" "0"
	"origin" "608 480 64"
	editor
	{
		"color" "0 200 200"
		"visgroupshown" "1"
		"visgroupautoshown" "1"
		"logicalpos" "[0 500]"
	}
}
entity
{
	"id" "210"
	"classname" "npc_combine_s"
	"additionalequipment" "weapon_shotgun"
	"angles" "0 270.5 0"
	"disablereceiveshadows" "0"
	"disableshadows" "0"
	"effects" "0"
	"hintlimiting" "0"
	"ignoreunseenenemies" "0"
	"model" "models/combine_soldier.mdl"
	"NumGrenades" "999999"
	"physdamagescale" "1.0"
	"renderamt" "255"
	"rendercolor" "255 255 255"
	"renderfx" "0"
	"rendermode" "0"
	"sleepstate" "0"
	"spawnflags" "16"
	"tacticalvariant" "0"
	"targetname" "shotgunner"
	"TeamNum" "2"
	"usemarch" "0"
	"waitingtorappel" "No"
	"wakeradius" "0"
	"wakesquad" "0"
	"origin" "672 480 64"
	editor
	{
		"color" "0 200 200"
		"visgroupshown" "1"
		"visgroupautoshown" "1"
		"logicalpos" "[0 500]"
	}
}
entity
{
	"id" "222"
	"classname" "npc_combine_s"
	"additionalequipment" "weapon_ar2"
	"angles" "0 270.5 0"
	"disablereceiveshadows" "0"
	"disableshadows" "0"
	"effects" "0"
	"hintlimiting" "0"
	"ignoreunseenenemies" "0"
	"model" "models/combine_super_soldier.mdl"
	"NumGrenades" "999999"
	"physdamagescale" "1.0"
	"renderamt" "255"
	"rendercolor" "255 255 255"
	"renderfx" "0"
	"rendermode" "0"
	"sleepstate" "0"
	"spawnflags" "16"
	"tacticalvariant" "0"
	"targetname" "elite"
	"TeamNum" "2"
	"usemarch" "2"
	"waitingtorappel" "No"
	"wakeradius" "0"
	"wakesquad" "0"
	"origin" "736 480 64"
	editor
	{
		"color" "0 200 200"
		"visgroupshown" "1"
		"visgroupautoshown" "1"
		"logicalpos" "[0 500]"
	}
}
entity
{
	"id" "290"
	"classname" "func_respawnroom"
	"AllowFlag" "1"
	"targetname" "redspawn"
	"TeamNum" "2"
	solid
	{
		"id" "121"
		side
		{
			"id" "144"
			"plane" "(-512 512 640) (256 512 640) (256 0 640)"
			"material" "TOOLS/TOOLSTRIGGER"
			"uaxis" "[1 0 0 0] 0.25"
			"vaxis" "[0 -1 0 0] 0.25"
			"rotation" "0"
			"lightmapscale" "16"
			"smoothing_groups" "0"
		}
		side
		{
			"id" "143"
			"plane" "(-512 0 64) (256 0 64) (256 512 64)"
			"material" "TOOLS/TOOLSTRIGGER"
			"uaxis" "[1 0 0 0] 0.25"
			"vaxis" "[0 -1 0 0] 0.25"
			"rotation" "0"
			"lightmapscale" "16"
			"smoothing_groups" "0"
		}
		side
		{
			"id" "142"
			"plane" "(-512 512 640) (-512 0 640) (-512 0 64)"
			"material" "TOOLS/TOOLSTRIGGER"
			"uaxis" "[0 1 0 0] 0.25"
			"vaxis" "[0 0 -1 0] 0.25"
			"rotation" "0"
			"lightmapscale" "16"
			"smoothing_groups" "0"
		}
		side
		{
			"id" "141"
			"plane" "(256 512 64) (256 0 64) (256 0 640)"
			"material" "TOOLS/TOOLSTRIGGER"
			"uaxis" "[0 1 0 0] 0.25"
			"vaxis" "[0 0 -1 0] 0.25"
			"rotation" "0"
			"lightmapscale" "16"
			"smoothing_groups" "0"
		}
		side
		{
			"id" "140"
			"plane" "(256 512 640) (-512 512 640) (-512 512 64)"
			"material" "TOOLS/TOOLSTRIGGER"
			"uaxis" "[1 0 0 0] 0.25"
			"vaxis" "[0 0 -1 0] 0.25"
			"rotation" "0"
			"lightmapscale" "16"
			"smoothing_groups" "0"
		}
		side
		{
			"id" "139"
			"plane" "(256 0 64) (-512 0 64) (-512 0 640)"
			"material" "TOOLS/TOOLSTRIGGER"
			"uaxis" "[1 0 0 0] 0.25"
			"vaxis" "[0 0 -1 0] 0.25"
			"rotation" "0"
			"lightmapscale" "16"
			"smoothing_groups" "0"
		}
		editor
		{
			"color" "220 30 220"
			"visgroupshown" "1"
			"visgroupautoshown" "1"
		}
	}
	editor
	{
		"color" "220 30 220"
		"visgroupshown" "1"
		"visgroupautoshown" "1"
		"logicalpos" "[0 3000]"
	}
}
entity
{
	"id" "299"
	"classname" "info_player_teamspawn"
	"angles" "0 0 0"
	"StartDisabled" "0"
	"targetname" "redstart"
	"TeamNum" "2"
	"origin" "-32 320 64"
	editor
	{
		"color" "220 30 220"
		"visgroupshown" "1"
		"visgroupautoshown" "1"
		"logicalpos" "[0 3500]"
	}
}
entity
{
	"id" "314"
	"classname" "info_player_teamspawn"
	"angles" "0 0 0"
	"StartDisabled" "0"
	"targetname" "bluestart"
	"TeamNum" "3"
	"origin" "-32 192 64"
	editor
	{
		"color" "220 30 220"
		"visgroupshown" "1"
		"visgroupautoshown" "1"
		"logicalpos" "[0 3500]"
	}
}
entity
{
	"id" "339"
	"classname" "npc_combine_s"
	"additionalequipment" "weapon_smg1"
	"angles" "0 180.5 0"
	"disablereceiveshadows" "0"
	"disableshadows" "0"
	"effects" "0"
	"hintlimiting" "0"
	"ignoreunseenenemies" "0"
	"model" "models/combine_soldier_prisonguard.mdl"
	"NumGrenades" "999999"
	"physdamagescale" "1.0"
	"renderamt" "255"
	"rendercolor" "255 255 255"
	"renderfx" "0"
	"rendermode" "0"
	"sleepstate" "0"
	"spawnflags" "16"
	"tacticalvariant" "0"
	"targetname" "prospekt_smg1"
	"TeamNum" "2"
	"usemarch" "0"
	"waitingtorappel" "No"
	"wakeradius" "0"
	"wakesquad" "0"
	"origin" "768 416 64"
	editor
	{
		"color" "0 200 200"
		"visgroupshown" "1"
		"visgroupautoshown" "1"
		"logicalpos" "[0 500]"
	}
}
entity
{
	"id" "343"
	"classname" "env_cubemap"
	"cubemapsize" "0"
	"sides" "18"
	"origin" "486.879 411.823 73"
	editor
	{
		"color" "0 0 255"
		"visgroupshown" "1"
		"visgroupautoshown" "1"
		"logicalpos" "[0 6000]"
	}
}
entity
{
	"id" "345"
	"classname" "ai_ally_manager"
	"maxallies" "5"
	"maxmedics" "1"
	"origin" "-128 320 0"
	editor
	{
		"color" "220 30 220"
		"visgroupshown" "1"
		"visgroupautoshown" "1"
		"logicalpos" "[0 6500]"
	}
}
entity
{
	"id" "371"
	"classname" "npc_combine_s"
	"additionalequipment" "weapon_shotgun"
	"angles" "0 180.5 0"
	"disablereceiveshadows" "0"
	"disableshadows" "0"
	"effects" "0"
	"hintlimiting" "0"
	"ignoreunseenenemies" "0"
	"model" "models/combine_soldier_prisonguard.mdl"
	"NumGrenades" "999999"
	"physdamagescale" "1.0"
	"renderamt" "255"
	"rendercolor" "255 255 255"
	"renderfx" "0"
	"rendermode" "0"
	"sleepstate" "0"
	"spawnflags" "16"
	"tacticalvariant" "0"
	"targetname" "prospekt_shotgun"
	"TeamNum" "2"
	"usemarch" "0"
	"waitingtorappel" "No"
	"wakeradius" "0"
	"wakesquad" "0"
	"origin" "768 352 64"
	editor
	{
		"color" "0 200 200"
		"visgroupshown" "1"
		"visgroupautoshown" "1"
		"logicalpos" "[0 500]"
	}
}
entity
{
	"id" "453"
	"classname" "weapon_physcannon"
	"angles" "0 0 0"
	"fademaxdist" "0"
	"fademindist" "-1"
	"fadescale" "1"
	"spawnflags" "0"
	"origin" "48 -32 105"
	editor
	{
		"color" "0 0 200"
		"visgroupshown" "1"
		"visgroupautoshown" "1"
		"logicalpos" "[0 0]"
	}
}
entity
{
	"id" "506"
	"classname" "npc_conscript"
	"additionalequipment" "weapon_oicw"
	"angles" "0 180.5 0"
	"disablereceiveshadows" "0"
	"disableshadows" "0"
	"effects" "0"
	"hintlimiting" "0"
	"ignoreunseenenemies" "0"
	"NumGrenades" "999999"
	"physdamagescale" "1.0"
	"renderamt" "255"
	"rendercolor" "255 255 255"
	"renderfx" "0"
	"rendermode" "0"
	"sleepstate" "0"
	"spawnflags" "16"
	"targetname" "conscript_oicw"
	"TeamNum" "2"
	"waitingtorappel" "No"
	"wakeradius" "0"
	"wakesquad" "0"
	"origin" "768 224 64"
	editor
	{
		"color" "0 200 200"
		"visgroupshown" "1"
		"visgroupautoshown" "1"
		"logicalpos" "[0 500]"
	}
}
entity
{
	"id" "522"
	"classname" "npc_conscript"
	"additionalequipment" "weapon_ar1"
	"angles" "0 180.5 0"
	"disablereceiveshadows" "0"
	"disableshadows" "0"
	"effects" "0"
	"hintlimiting" "0"
	"ignoreunseenenemies" "0"
	"NumGrenades" "999999"
	"physdamagescale" "1.0"
	"renderamt" "255"
	"rendercolor" "255 255 255"
	"renderfx" "0"
	"rendermode" "0"
	"sleepstate" "0"
	"spawnflags" "16"
	"targetname" "conscript_ar1"
	"TeamNum" "2"
	"waitingtorappel" "No"
	"wakeradius" "0"
	"wakesquad" "0"
	"origin" "768 160 64"
	editor
	{
		"color" "0 200 200"
		"visgroupshown" "1"
		"visgroupautoshown" "1"
		"logicalpos" "[0 500]"
	}
}
entity
{
	"id" "550"
	"classname" "prop_physics"
	"angles" "0 357 0"
	"damagetoenablemotion" "0"
	"Damagetype" "0"
	"disablereceiveshadows" "0"
	"disableshadows" "0"
	"ExplodeDamage" "0"
	"ExplodeRadius" "0"
	"fademaxdist" "0"
	"fademindist" "-1"
	"fadescale" "1"
	"forcetoenablemotion" "0"
	"inertiaScale" "1.0"
	"massScale" "0"
	"maxdxlevel" "0"
	"mindxlevel" "0"
	"minhealthdmg" "0"
	"model" "models/props_junk/wood_crate001a.mdl"
	"modelscale" "1.0"
	"nodamageforces" "0"
	"PerformanceMode" "0"
	"physdamagescale" "0.1"
	"pressuredelay" "0"
	"renderamt" "255"
	"rendercolor" "255 255 255"
	"renderfx" "0"
	"rendermode" "0"
	"shadowcastdist" "0"
	"skin" "0"
	"spawnflags" "256"
	"origin" "-224 224 83.747"
	editor
	{
		"color" "220 30 220"
		"visgroupshown" "1"
		"visgroupautoshown" "1"
		"logicalpos" "[0 5500]"
	}
}
entity
{
	"id" "593"
	"classname" "prop_physics"
	"angles" "0 357 0"
	"damagetoenablemotion" "0"
	"Damagetype" "0"
	"disablereceiveshadows" "0"
	"disableshadows" "0"
	"ExplodeDamage" "0"
	"ExplodeRadius" "0"
	"fademaxdist" "0"
	"fademindist" "-1"
	"fadescale" "1"
	"forcetoenablemotion" "0"
	"inertiaScale" "1.0"
	"massScale" "0"
	"maxdxlevel" "0"
	"mindxlevel" "0"
	"minhealthdmg" "0"
	"model" "models/props_junk/wood_crate001a.mdl"
	"modelscale" "1.0"
	"nodamageforces" "0"
	"PerformanceMode" "0"
	"physdamagescale" "0.1"
	"pressuredelay" "0"
	"renderamt" "255"
	"rendercolor" "255 255 255"
	"renderfx" "0"
	"rendermode" "0"
	"shadowcastdist" "0"
	"skin" "0"
	"spawnflags" "256"
	"origin" "-259.788 305.485 84.2271"
	editor
	{
		"color" "220 30 220"
		"visgroupshown" "1"
		"visgroupautoshown" "1"
		"logicalpos" "[0 5500]"
	}
}
entity
{
	"id" "597"
	"classname" "prop_physics"
	"angles" "0 357 0"
	"damagetoenablemotion" "0"
	"Damagetype" "0"
	"disablereceiveshadows" "0"
	"disableshadows" "0"
	"ExplodeDamage" "0"
	"ExplodeRadius" "0"
	"fademaxdist" "0"
	"fademindist" "-1"
	"fadescale" "1"
	"forcetoenablemotion" "0"
	"inertiaScale" "1.0"
	"massScale" "0"
	"maxdxlevel" "0"
	"mindxlevel" "0"
	"minhealthdmg" "0"
	"model" "models/props_junk/wood_crate001a.mdl"
	"modelscale" "1.0"
	"nodamageforces" "0"
	"PerformanceMode" "0"
	"physdamagescale" "0.1"
	"pressuredelay" "0"
	"renderamt" "255"
	"rendercolor" "255 255 255"
	"renderfx" "0"
	"rendermode" "0"
	"shadowcastdist" "0"
	"skin" "0"
	"spawnflags" "256"
	"origin" "-128 64 84.227"
	editor
	{
		"color" "220 30 220"
		"visgroupshown" "1"
		"visgroupautoshown" "1"
		"logicalpos" "[0 5500]"
	}
}
entity
{
	"id" "601"
	"classname" "prop_physics"
	"angles" "0 357 0"
	"damagetoenablemotion" "0"
	"Damagetype" "0"
	"disablereceiveshadows" "0"
	"disableshadows" "0"
	"ExplodeDamage" "0"
	"ExplodeRadius" "0"
	"fademaxdist" "0"
	"fademindist" "-1"
	"fadescale" "1"
	"forcetoenablemotion" "0"
	"inertiaScale" "1.0"
	"massScale" "0"
	"maxdxlevel" "0"
	"mindxlevel" "0"
	"minhealthdmg" "0"
	"model" "models/props_junk/wood_crate001a.mdl"
	"modelscale" "1.0"
	"nodamageforces" "0"
	"PerformanceMode" "0"
	"physdamagescale" "0.1"
	"pressuredelay" "0"
	"renderamt" "255"
	"rendercolor" "255 255 255"
	"renderfx" "0"
	"rendermode" "0"
	"shadowcastdist" "0"
	"skin" "0"
	"spawnflags" "256"
	"origin" "-140.272 412.202 84.2271"
	editor
	{
		"color" "220 30 220"
		"visgroupshown" "1"
		"visgroupautoshown" "1"
		"logicalpos" "[0 5500]"
	}
}
entity
{
	"id" "696"
	"classname" "npc_custom_combine"
	"additionalequipment" "weapon_stunstick"
	"angles" "0 270.5 0"
	"bloodcolor" "Don't Bleed"
	"boss_npc" "0"
	"disablereceiveshadows" "0"
	"disableshadows" "0"
	"effects" "0"
	"fieldofview" "5"
	"health" "100"
	"hintlimiting" "0"
	"hullname" "Human"
	"ignoreunseenenemies" "0"
	"maxhealth" "100"
	"model" "models/police.mdl"
	"NumGrenades" "999999"
	"physdamagescale" "1.0"
	"renderamt" "255"
	"rendercolor" "255 255 255"
	"renderfx" "0"
	"rendermode" "0"
	"shouldpatrol" "No"
	"sleepstate" "0"
	"spawnflags" "16"
	"start_disabled" "0"
	"tacticalvariant" "0"
	"targetname" "custom_stunstick"
	"TeamNum" "2"
	"usemarch" "0"
	"waitingtorappel" "No"
	"wakeradius" "0"
	"wakesquad" "0"
	"origin" "544 480 64"
	editor
	{
		"color" "0 200 200"
		"visgroupshown" "1"
		"visgroupautoshown" "1"
		"logicalpos" "[0 500]"
	}
}
entity
{
	"id" "733"
	"classname" "npc_zombie"
	"angles" "0 270 0"
	"disablereceiveshadows" "0"
	"disableshadows" "0"
	"hintlimiting" "0"
	"ignoreunseenenemies" "0"
	"noheadcrab" "0"
	"physdamagescale" "1.0"
	"renderamt" "255"
	"rendercolor" "255 255 255"
	"renderfx" "0"
	"rendermode" "0"
	"sleepstate" "0"
	"spawnflags" "16"
	"targetname" "zombie"
	"TeamNum" "2"
	"wakeradius" "0"
	"wakesquad" "0"
	"origin" "912 480 64"
	editor
	{
		"color" "0 200 200"
		"visgroupshown" "1"
		"visgroupautoshown" "1"
		"logicalpos" "[0 4500]"
	}
}
entity
{
	"id" "755"
	"classname" "npc_zombine"
	"angles" "0 270 0"
	"disablereceiveshadows" "0"
	"disableshadows" "0"
	"hintlimiting" "0"
	"ignoreunseenenemies" "0"
	"noheadcrab" "0"
	"physdamagescale" "1.0"
	"renderamt" "255"
	"rendercolor" "255 255 255"
	"renderfx" "0"
	"rendermode" "0"
	"sleepstate" "0"
	"spawnflags" "16"
	"targetname" "zombine"
	"TeamNum" "2"
	"wakeradius" "0"
	"wakesquad" "0"
	"origin" "1024 482.873 64"
	editor
	{
		"color" "0 200 200"
		"visgroupshown" "1"
		"visgroupautoshown" "1"
		"logicalpos" "[0 4500]"
	}
}
entity
{
	"id" "772"
	"classname" "npc_combine_s"
	"additionalequipment" "weapon_csmg1"
	"angles" "0 270.5 0"
	"disablereceiveshadows" "0"
	"disableshadows" "0"
	"effects" "0"
	"hintlimiting" "0"
	"ignoreunseenenemies" "0"
	"model" "models/combine_soldier.mdl"
	"NumGrenades" "999999"
	"physdamagescale" "1.0"
	"renderamt" "255"
	"rendercolor" "255 255 255"
	"renderfx" "0"
	"rendermode" "0"
	"sleepstate" "0"
	"spawnflags" "16"
	"tacticalvariant" "0"
	"targetname" "combine_csmg1"
	"TeamNum" "2"
	"usemarch" "0"
	"waitingtorappel" "No"
	"wakeradius" "0"
	"wakesquad" "0"
	"origin" "480 483.465 64"
	editor
	{
		"color" "0 200 200"
		"visgroupshown" "1"
		"visgroupautoshown" "1"
		"logicalpos" "[0 500]"
	}
}
entity
{
	"id" "782"
	"classname" "npc_poisonzombie"
	"angles" "0 270 0"
	"crabcount" "3"
	"disablereceiveshadows" "0"
	"disableshadows" "0"
	"hintlimiting" "0"
	"ignoreunseenenemies" "0"
	"physdamagescale" "1.0"
	"renderamt" "255"
	"rendercolor" "255 255 255"
	"renderfx" "0"
	"rendermode" "0"
	"sleepstate" "0"
	"spawnflags" "16"
	"targetname" "poisonzombie"
	"TeamNum" "2"
	"wakeradius" "0"
	"wakesquad" "0"
	"origin" "1152 480 64"
	editor
	{
		"color" "0 200 200"
		"visgroupshown" "1"
		"visgroupautoshown" "1"
		"logicalpos" "[0 4500]"
	}
}
entity
{
	"id" "797"
	"classname" "npc_fastzombie"
	"angles" "0 270 0"
	"disablereceiveshadows" "0"
	"disableshadows" "0"
	"hintlimiting" "0"
	"ignoreunseenenemies" "0"
	"noheadcrab" "0"
	"physdamagescale" "1.0"
	"renderamt" "255"
	"rendercolor" "255 255 255"
	"renderfx" "0"
	"rendermode" "0"
	"sleepstate" "0"
	"spawnflags" "16"
	"targetname" "fastzombie"
	"TeamNum" "2"
	"wakeradius" "0"
	"wakesquad" "0"
	"origin" "1248 480 64"
	editor
	{
		"color" "0 200 200"
		"visgroupshown" "1"
		"visgroupautoshown" "1"
		"logicalpos" "[0 4500]"
	}
}
entity
{
	"id" "808"
	"classname" "npc_hunter"
	"angles" "0 0 0"
	"disablereceiveshadows" "0"
	"disableshadows" "0"
	"hintlimiting" "0"
	"ignoreunseenenemies" "0"
	"physdamagescale" "1.0"
	"renderamt" "255"
	"rendercolor" "255 255 255"
	"renderfx" "0"
	"rendermode" "0"
	"sleepstate" "0"
	"spawnflags" "16"
	"targetname" "hunter"
	"TeamNum" "2"
	"wakeradius" "0"
	"wakesquad" "0"
	"origin" "555.459 276.285 73"
	editor
	{
		"color" "0 200 200"
		"visgroupshown" "1"
		"visgroupautoshown" "1"
		"logicalpos" "[0 5000]"
	}
}
entity
{
	"id" "832"
	"classname" "light_environment"
	"_ambient" "196 174 210 250"
	"_ambientHDR" "-1 -1 -1 1"
	"_AmbientScaleHDR" "1"
	"_light" "253 199 172 435"
	"_lightHDR" "-1 -1 -1 1"
	"_lightscaleHDR" "1"
	"angles" "0 29 0"
	"pitch" "-36"
	"SunSpreadAngle" "4"
	"origin" "768 122.603 544"
	editor
	{
		"color" "220 30 220"
		"visgroupshown" "1"
		"visgroupautoshown" "1"
		"logicalpos" "[0 5500]"
	}
}
entity
{
	"id" "838"
	"classname" "light"
	"_light" "255 255 255 200"
	"_lightHDR" "-1 -1 -1 1"
	"_lightscaleHDR" "1"
	"_quadratic_attn" "1"
	"origin" "371.693 270.613 72"
	editor
	{
		"color" "220 30 220"
		"visgroupshown" "1"
		"visgroupautoshown" "1"
		"logicalpos" "[0 -14768]"
	}
}
entity
{
	"id" "894"
	"classname" "npc_custom_combine"
	"additionalequipment" "weapon_pistol"
	"angles" "0 270.5 0"
	"bloodcolor" "Don't Bleed"
	"boss_npc" "0"
	"disablereceiveshadows" "0"
	"disableshadows" "0"
	"effects" "0"
	"fieldofview" "5"
	"health" "100"
	"hintlimiting" "0"
	"hullname" "Human"
	"ignoreunseenenemies" "0"
	"maxhealth" "100"
	"model" "models/police.mdl"
	"NumGrenades" "999999"
	"physdamagescale" "1.0"
	"renderamt" "255"
	"rendercolor" "255 255 255"
	"renderfx" "0"
	"rendermode" "0"
	"shouldpatrol" "No"
	"sleepstate" "0"
	"spawnflags" "16"
	"start_disabled" "0"
	"tacticalvariant" "0"
	"targetname" "custom_pistol"
	"TeamNum" "2"
	"usemarch" "0"
	"waitingtorappel" "No"
	"wakeradius" "0"
	"wakesquad" "0"
	"origin" "421.183 481.652 66.6843"
	editor
	{
		"color" "0 200 200"
		"visgroupshown" "1"
		"visgroupautoshown" "1"
		"logicalpos" "[0 500]"
	}
}
entity
{
	"id" "904"
	"classname" "weapon_crossbow"
	"angles" "0 0 0"
	"fademaxdist" "0"
	"fademindist" "-1"
	"fadescale" "1"
	"spawnflags" "2"
	"origin" "192 -16 105"
	editor
	{
		"color" "0 0 200"
		"visgroupshown" "1"
		"visgroupautoshown" "1"
		"logicalpos" "[0 0]"
	}
}
entity
{
	"id" "917"
	"classname" "weapon_357"
	"angles" "0 0 0"
	"fademaxdist" "0"
	"fademindist" "-1"
	"fadescale" "1"
	"spawnflags" "2"
	"origin" "128 -16 99.7761"
	editor
	{
		"color" "0 0 200"
		"visgroupshown" "1"
		"visgroupautoshown" "1"
		"logicalpos" "[0 0]"
	}
}
entity
{
	"id" "924"
	"classname" "item_ammopack_full"
	"angles" "0 0 0"
	"StartDisabled" "0"
	"TeamNum" "0"
	"origin" "426.633 56.5391 73"
	editor
	{
		"color" "0 0 200"
		"visgroupshown" "1"
		"visgroupautoshown" "1"
		"logicalpos" "[0 500]"
	}
}
entity
{
	"id" "936"
	"classname" "item_healthkit_full"
	"angles" "0 0 0"
	"StartDisabled" "0"
	"TeamNum" "0"
	"origin" "378.779 156.61 64"
	editor
	{
		"color" "0 0 200"
		"visgroupshown" "1"
		"visgroupautoshown" "1"
		"logicalpos" "[0 500]"
	}
}
entity
{
	"id" "948"
	"classname" "npc_mossman"
	"angles" "0 270 0"
	"disablereceiveshadows" "0"
	"disableshadows" "0"
	"DontUseSpeechSemaphore" "0"
	"hintlimiting" "0"
	"ignoreunseenenemies" "0"
	"physdamagescale" "1.0"
	"renderamt" "255"
	"rendercolor" "255 255 255"
	"renderfx" "0"
	"rendermode" "0"
	"sleepstate" "0"
	"spawnflags" "16"
	"targetname" "mossman"
	"TeamNum" "0"
	"wakeradius" "0"
	"wakesquad" "0"
	"origin" "1439.67 480 64"
	editor
	{
		"color" "0 200 200"
		"visgroupshown" "1"
		"visgroupautoshown" "1"
		"logicalpos" "[0 2000]"
	}
}
entity
{
	"id" "963"
	"classname" "npc_eli"
	"angles" "0 270 0"
	"disablereceiveshadows" "0"
	"disableshadows" "0"
	"DontUseSpeechSemaphore" "0"
	"hintlimiting" "0"
	"ignoreunseenenemies" "0"
	"model" "models/eli.mdl"
	"physdamagescale" "1.0"
	"renderamt" "255"
	"rendercolor" "255 255 255"
	"renderfx" "0"
	"rendermode" "0"
	"sleepstate" "0"
	"spawnflags" "16"
	"targetname" "eli"
	"TeamNum" "0"
	"wakeradius" "0"
	"wakesquad" "0"
	"origin" "1502.8 480 64"
	editor
	{
		"color" "0 200 200"
		"visgroupshown" "1"
		"visgroupautoshown" "1"
		"logicalpos" "[0 2000]"
	}
}
entity
{
	"id" "973"
	"classname" "npc_magnusson"
	"angles" "0 270 0"
	"disablereceiveshadows" "0"
	"disableshadows" "0"
	"DontUseSpeechSemaphore" "0"
	"hintlimiting" "0"
	"ignoreunseenenemies" "0"
	"model" "models/magnusson.mdl"
	"physdamagescale" "1.0"
	"renderamt" "255"
	"rendercolor" "255 255 255"
	"renderfx" "0"
	"rendermode" "0"
	"sleepstate" "0"
	"spawnflags" "16"
	"targetname" "magnusson"
	"TeamNum" "0"
	"wakeradius" "0"
	"wakesquad" "0"
	"origin" "1568 480 64"
	editor
	{
		"color" "0 200 200"
		"visgroupshown" "1"
		"visgroupautoshown" "1"
		"logicalpos" "[0 2000]"
	}
}
entity
{
	"id" "975"
	"classname" "npc_monk"
	"additionalequipment" "weapon_annabelle"
	"angles" "0 270 0"
	"disablereceiveshadows" "0"
	"disableshadows" "0"
	"DontUseSpeechSemaphore" "0"
	"HasGun" "1"
	"hintlimiting" "0"
	"ignoreunseenenemies" "0"
	"physdamagescale" "1.0"
	"renderamt" "255"
	"rendercolor" "255 255 255"
	"renderfx" "0"
	"rendermode" "0"
	"sleepstate" "0"
	"spawnflags" "16"
	"targetname" "monk"
	"TeamNum" "0"
	"wakeradius" "0"
	"wakesquad" "0"
	"origin" "1632 480 64"
	editor
	{
		"color" "0 200 200"
		"visgroupshown" "1"
		"visgroupautoshown" "1"
		"logicalpos" "[0 2000]"
	}
}
entity
{
	"id" "977"
	"classname" "npc_breen"
	"angles" "0 270 0"
	"disablereceiveshadows" "0"
	"disableshadows" "0"
	"DontUseSpeechSemaphore" "0"
	"hintlimiting" "0"
	"ignoreunseenenemies" "0"
	"model" "models/breen.mdl"
	"physdamagescale" "1.0"
	"renderamt" "255"
	"rendercolor" "255 255 255"
	"renderfx" "0"
	"rendermode" "0"
	"sleepstate" "0"
	"spawnflags" "16"
	"targetname" "breen"
	"TeamNum" "2"
	"wakeradius" "0"
	"wakesquad" "0"
	"origin" "1696 480 64"
	editor
	{
		"color" "0 200 200"
		"visgroupshown" "1"
		"visgroupautoshown" "1"
		"logicalpos" "[0 2000]"
	}
}
entity
{
	"id" "1038"
	"classname" "npc_kleiner"
	"angles" "0 270 0"
	"disablereceiveshadows" "0"
	"disableshadows" "0"
	"DontUseSpeechSemaphore" "0"
	"hintlimiting" "0"
	"ignoreunseenenemies" "0"
	"model" "models/kleiner.mdl"
	"physdamagescale" "1.0"
	"renderamt" "255"
	"rendercolor" "255 255 255"
	"renderfx" "0"
	"rendermode" "0"
	"sleepstate" "0"
	"spawnflags" "16"
	"targetname" "kleiner"
	"TeamNum" "2"
	"wakeradius" "0"
	"wakesquad" "0"
	"origin" "1760 482.215 64"
	editor
	{
		"color" "0 200 200"
		"visgroupshown" "1"
		"visgroupautoshown" "1"
		"logicalpos" "[0 2000]"
	}
}
entity
{
	"id" "1050"
	"classname" "npc_gman"
	"angles" "0 270 0"
	"disablereceiveshadows" "0"
	"disableshadows" "0"
	"DontUseSpeechSemaphore" "0"
	"hintlimiting" "0"
	"ignoreunseenenemies" "0"
	"physdamagescale" "1.0"
	"renderamt" "255"
	"rendercolor" "255 255 255"
	"renderfx" "0"
	"rendermode" "0"
	"sleepstate" "0"
	"spawnflags" "16"
	"targetname" "gman"
	"TeamNum" "2"
	"wakeradius" "0"
	"wakesquad" "0"
	"origin" "1824 480 64"
	editor
	{
		"color" "0 200 200"
		"visgroupshown" "1"
		"visgroupautoshown" "1"
		"logicalpos" "[0 2000]"
	}
}
entity
{
	"id" "1115"
	"classname" "npc_cremator"
	"additionalequipment" "weapon_pistol"
	"angles" "0 270.5 0"
	"disablereceiveshadows" "0"
	"disableshadows" "0"
	"effects" "0"
	"hintlimiting" "0"
	"ignoreunseenenemies" "0"
	"NumGrenades" "999999"
	"physdamagescale" "1.0"
	"renderamt" "255"
	"rendercolor" "255 255 255"
	"renderfx" "0"
	"rendermode" "0"
	"sleepstate" "0"
	"spawnflags" "16"
	"targetname" "cremator"
	"TeamNum" "2"
	"waitingtorappel" "No"
	"wakeradius" "0"
	"wakesquad" "0"
	"origin" "352 480 64"
	editor
	{
		"color" "0 200 200"
		"visgroupshown" "1"
		"visgroupautoshown" "1"
		"logicalpos" "[0 500]"
	}
}
entity
{
	"id" "1129"
	"classname" "npc_combineguard"
	"additionalequipment" "weapon_pistol"
	"angles" "0 180 0"
	"disablereceiveshadows" "0"
	"disableshadows" "0"
	"effects" "0"
	"hintlimiting" "0"
	"ignoreunseenenemies" "0"
	"NumGrenades" "999999"
	"physdamagescale" "1.0"
	"renderamt" "255"
	"rendercolor" "255 255 255"
	"renderfx" "0"
	"rendermode" "0"
	"sleepstate" "0"
	"spawnflags" "16"
	"targetname" "combineguard"
	"TeamNum" "2"
	"waitingtorappel" "No"
	"wakeradius" "0"
	"wakesquad" "0"
	"origin" "768 288 64"
	editor
	{
		"color" "0 200 200"
		"visgroupshown" "1"
		"visgroupautoshown" "1"
		"logicalpos" "[0 500]"
	}
}
entity
{
	"id" "1163"
	"classname" "npc_fisherman"
	"angles" "0 270 0"
	"disablereceiveshadows" "0"
	"disableshadows" "0"
	"hintlimiting" "0"
	"ignoreunseenenemies" "0"
	"physdamagescale" "1.0"
	"renderamt" "255"
	"rendercolor" "255 255 255"
	"renderfx" "0"
	"rendermode" "0"
	"sleepstate" "0"
	"spawnflags" "16"
	"targetname" "fisherman"
	"TeamNum" "2"
	"wakeradius" "0"
	"wakesquad" "0"
	"origin" "1888 481.953 64"
	editor
	{
		"color" "0 200 200"
		"visgroupshown" "1"
		"visgroupautoshown" "1"
		"logicalpos" "[0 2000]"
	}
}
entity
{
	"id" "1184"
	"classname" "npc_barney"
	"additionalequipment" "weapon_ar2"
	"AlwaysTransition" "No"
	"angles" "0 270 0"
	"disablereceiveshadows" "0"
	"disableshadows" "0"
	"DontPickupWeapons" "No"
	"DontUseSpeechSemaphore" "0"
	"GameEndAlly" "No"
	"hintlimiting" "0"
	"ignoreunseenenemies" "0"
	"physdamagescale" "1.0"
	"renderamt" "255"
	"rendercolor" "255 255 255"
	"renderfx" "0"
	"rendermode" "0"
	"sleepstate" "0"
	"spawnflags" "16"
	"targetname" "barney"
	"TeamNum" "2"
	"wakeradius" "0"
	"wakesquad" "0"
	"origin" "1952 480 64"
	editor
	{
		"color" "0 200 200"
		"visgroupshown" "1"
		"visgroupautoshown" "1"
		"logicalpos" "[0 2000]"
	}
}
entity
{
	"id" "1199"
	"classname" "npc_alyx"
	"additionalequipment" "weapon_alyxgun"
	"AlwaysTransition" "No"
	"angles" "0 270 0"
	"disablereceiveshadows" "0"
	"disableshadows" "0"
	"DontPickupWeapons" "1"
	"DontUseSpeechSemaphore" "0"
	"GameEndAlly" "No"
	"hintlimiting" "0"
	"ignoreunseenenemies" "0"
	"model" "models/alyx.mdl"
	"physdamagescale" "1.0"
	"renderamt" "255"
	"rendercolor" "255 255 255"
	"renderfx" "0"
	"rendermode" "0"
	"ShouldHaveEMP" "1"
	"sleepstate" "0"
	"spawnflags" "16"
	"targetname" "alyx"
	"TeamNum" "2"
	"wakeradius" "0"
	"wakesquad" "0"
	"origin" "2016 483.473 64"
	editor
	{
		"color" "0 200 200"
		"visgroupshown" "1"
		"visgroupautoshown" "1"
		"logicalpos" "[0 2000]"
	}
}
entity
{
	"id" "1211"
	"classname" "npc_dog"
	"angles" "0 270 0"
	"disablereceiveshadows" "0"
	"disableshadows" "0"
	"hintlimiting" "0"
	"ignoreunseenenemies" "0"
	"physdamagescale" "1.0"
	"renderamt" "255"
	"rendercolor" "255 255 255"
	"renderfx" "0"
	"rendermode" "0"
	"sleepstate" "0"
	"spawnflags" "16"
	"targetname" "dog"
	"TeamNum" "2"
	"wakeradius" "0"
	"wakesquad" "0"
	"origin" "2080 480 64"
	editor
	{
		"color" "0 200 200"
		"visgroupshown" "1"
		"visgroupautoshown" "1"
		"logicalpos" "[0 2000]"
	}
}
entity
{
	"id" "1226"
	"classname" "npc_citizen"
	"additionalequipment" "weapon_crowbar"
	"AlwaysTransition" "No"
	"ammoamount" "1"
	"ammosupply" "SMG1"
	"angles" "0 270 0"
	"citizentype" "Default"
	"disablereceiveshadows" "0"
	"disableshadows" "0"
	"DontPickupWeapons" "No"
	"DontUseSpeechSemaphore" "0"
	"expressiontype" "Random"
	"GameEndAlly" "No"
	"hintlimiting" "0"
	"ignoreunseenenemies" "0"
	"model" "models/humans/group01/male_01.mdl"
	"neverleaveplayersquad" "0"
	"notifynavfailblocked" "0"
	"physdamagescale" "1.0"
	"renderamt" "255"
	"rendercolor" "255 255 255"
	"renderfx" "0"
	"rendermode" "0"
	"sleepstate" "0"
	"spawnflags" "16"
	"targetname" "matt"
	"TeamNum" "2"
	"wakeradius" "0"
	"wakesquad" "0"
	"origin" "2160 480 64"
	editor
	{
		"color" "0 200 200"
		"visgroupshown" "1"
		"visgroupautoshown" "1"
		"logicalpos" "[0 2000]"
	}
}
entity
{
	"id" "1245"
	"classname" "npc_conscriptred"
	"additionalequipment" "weapon_rpg"
	"angles" "0 270 0"
	"disablereceiveshadows" "0"
	"disableshadows" "0"
	"hintlimiting" "0"
	"ignoreunseenenemies" "0"
	"NumGrenades" "5"
	"physdamagescale" "1.0"
	"renderamt" "255"
	"rendercolor" "255 255 255"
	"renderfx" "0"
	"rendermode" "0"
	"sleepstate" "0"
	"spawnflags" "16"
	"targetname" "conscriptred"
	"TeamNum" "2"
	"waitingtorappel" "No"
	"wakeradius" "0"
	"wakesquad" "0"
	"origin" "2224 483.247 64"
	editor
	{
		"color" "0 200 200"
		"visgroupshown" "1"
		"visgroupautoshown" "1"
		"logicalpos" "[0 2000]"
	}
}
entity
{
	"id" "1263"
	"classname" "npc_antlion"
	"angles" "0 180 0"
	"disablereceiveshadows" "0"
	"disableshadows" "0"
	"eludedist" "1024"
	"hintlimiting" "0"
	"ignorebugbait" "1"
	"ignoreunseenenemies" "0"
	"physdamagescale" "1.0"
	"radius" "125"
	"renderamt" "255"
	"rendercolor" "255 255 255"
	"renderfx" "0"
	"rendermode" "0"
	"sleepstate" "0"
	"spawnflags" "16"
	"startburrowed" "No"
	"targetname" "antlion"
	"TeamNum" "2"
	"unburroweffects" "No"
	"wakeradius" "0"
	"wakesquad" "0"
	"origin" "2432 451.825 64"
	editor
	{
		"color" "0 200 200"
		"visgroupshown" "1"
		"visgroupautoshown" "1"
		"logicalpos" "[0 2000]"
	}
}
entity
{
	"id" "1291"
	"classname" "npc_antlion"
	"angles" "0 180 0"
	"disablereceiveshadows" "0"
	"disableshadows" "0"
	"eludedist" "1024"
	"hintlimiting" "0"
	"ignorebugbait" "1"
	"ignoreunseenenemies" "0"
	"physdamagescale" "1.0"
	"radius" "125"
	"renderamt" "255"
	"rendercolor" "255 255 255"
	"renderfx" "0"
	"rendermode" "0"
	"sleepstate" "0"
	"spawnflags" "262160"
	"startburrowed" "No"
	"targetname" "antlionworker"
	"TeamNum" "2"
	"unburroweffects" "No"
	"wakeradius" "0"
	"wakesquad" "0"
	"origin" "2432 336 64"
	editor
	{
		"color" "0 200 200"
		"visgroupshown" "1"
		"visgroupautoshown" "1"
		"logicalpos" "[0 2000]"
	}
}
entity
{
	"id" "1309"
	"classname" "npc_antlionguard"
	"allowbark" "No"
	"angles" "0 180 0"
	"cavernbreed" "No"
	"disablereceiveshadows" "0"
	"disableshadows" "0"
	"hintlimiting" "0"
	"ignoreunseenenemies" "0"
	"incavern" "No"
	"physdamagescale" "1.0"
	"renderamt" "255"
	"rendercolor" "255 255 255"
	"renderfx" "0"
	"rendermode" "0"
	"sleepstate" "0"
	"spawnflags" "16"
	"startburrowed" "No"
	"targetname" "antlionguard"
	"TeamNum" "2"
	"wakeradius" "0"
	"wakesquad" "0"
	"origin" "2432 192 65.1532"
	editor
	{
		"color" "0 200 200"
		"visgroupshown" "1"
		"visgroupautoshown" "1"
		"logicalpos" "[0 2000]"
	}
}
entity
{
	"id" "1312"
	"classname" "npc_antlionguard"
	"allowbark" "No"
	"angles" "0 180 0"
	"cavernbreed" "1"
	"disablereceiveshadows" "0"
	"disableshadows" "0"
	"hintlimiting" "0"
	"ignoreunseenenemies" "0"
	"incavern" "1"
	"physdamagescale" "1.0"
	"renderamt" "255"
	"rendercolor" "255 255 255"
	"renderfx" "0"
	"rendermode" "0"
	"sleepstate" "0"
	"spawnflags" "131088"
	"startburrowed" "No"
	"targetname" "antlionguardian"
	"TeamNum" "2"
	"wakeradius" "0"
	"wakesquad" "0"
	"origin" "2432 64 65.1532"
	editor
	{
		"color" "0 200 200"
		"visgroupshown" "1"
		"visgroupautoshown" "1"
		"logicalpos" "[0 2000]"
	}
}
entity
{
	"id" "1425"
	"classname" "npc_stalker"
	"angles" "0 180 0"
	"BeamPower" "2"
	"disablereceiveshadows" "0"
	"disableshadows" "0"
	"hintlimiting" "0"
	"ignoreunseenenemies" "0"
	"physdamagescale" "1.0"
	"renderamt" "255"
	"rendercolor" "255 255 255"
	"renderfx" "0"
	"rendermode" "0"
	"sleepstate" "0"
	"spawnflags" "16"
	"targetname" "stalker"
	"TeamNum" "2"
	"wakeradius" "0"
	"wakesquad" "0"
	"origin" "768 64 64"
	editor
	{
		"color" "0 200 200"
		"visgroupshown" "1"
		"visgroupautoshown" "1"
		"logicalpos" "[0 3000]"
	}
}
entity
{
	"id" "1445"
	"classname" "npc_vortigaunt"
	"AlwaysTransition" "No"
	"angles" "0 270 0"
	"ArmorRechargeEnabled" "0"
	"disablereceiveshadows" "0"
	"disableshadows" "0"
	"DontPickupWeapons" "No"
	"DontUseSpeechSemaphore" "0"
	"GameEndAlly" "No"
	"HealthRegenerateEnabled" "1"
	"hintlimiting" "0"
	"ignoreunseenenemies" "0"
	"model" "models/vortigaunt.mdl"
	"physdamagescale" "1.0"
	"renderamt" "255"
	"rendercolor" "255 255 255"
	"renderfx" "0"
	"rendermode" "0"
	"sleepstate" "0"
	"spawnflags" "16"
	"targetname" "vortigaunt"
	"TeamNum" "2"
	"wakeradius" "0"
	"wakesquad" "0"
	"origin" "2288 480 64"
	editor
	{
		"color" "0 200 200"
		"visgroupshown" "1"
		"visgroupautoshown" "1"
		"logicalpos" "[0 2000]"
	}
}
entity
{
	"id" "1467"
	"classname" "item_teamflag"
	"angles" "0 0 0"
	"flag_icon" "../hud/objectives_flagpanel_carried"
	"flag_model" "models/flag/briefcase.mdl"
	"flag_paper" "player_intel_papertrail"
	"flag_trail" "flagtrail"
	"GameType" "0"
	"ReturnTime" "60"
	"StartDisabled" "0"
	"targetname" "redflag"
	"TeamNum" "2"
	"trail_effect" "1"
	"VisibleWhenDisabled" "0"
	"origin" "2384 -80 96"
	editor
	{
		"color" "220 30 220"
		"visgroupshown" "1"
		"visgroupautoshown" "1"
		"logicalpos" "[0 3500]"
	}
}
entity
{
	"id" "1480"
	"classname" "item_teamflag"
	"angles" "0 0 0"
	"flag_icon" "../hud/objectives_flagpanel_carried"
	"flag_model" "models/flag/briefcase.mdl"
	"flag_paper" "player_intel_papertrail"
	"flag_trail" "flagtrail"
	"GameType" "0"
	"ReturnTime" "60"
	"StartDisabled" "0"
	"targetname" "blueflag"
	"TeamNum" "3"
	"trail_effect" "1"
	"VisibleWhenDisabled" "0"
	"origin" "2384 -176 96"
	editor
	{
		"color" "220 30 220"
		"visgroupshown" "1"
		"visgroupautoshown" "1"
		"logicalpos" "[0 3500]"
	}
}
entity
{
	"id" "1499"
	"classname" "func_capturezone"
	"capturepoint" "1"
	"targetname" "capturezone"
	"TeamNum" "0"
	solid
	{
		"id" "1494"
		side
		{
			"id" "300"
			"plane" "(2272 -272 128) (2272 -304 128) (2240 -304 128)"
			"material" "DEV/GRAYGRID"
			"uaxis" "[1 0 0 320] 0.25"
			"vaxis" "[0 -1 0 -256] 0.25"
			"rotation" "0"
			"lightmapscale" "16"
			"smoothing_groups" "0"
		}
		side
		{
			"id" "299"
			"plane" "(2272 -304 96) (2272 -272 96) (2240 -272 96)"
			"material" "DEV/GRAYGRID"
			"uaxis" "[1 0 0 320] 0.25"
			"vaxis" "[0 -1 0 -256] 0.25"
			"rotation" "0"
			"lightmapscale" "16"
			"smoothing_groups" "0"
		}
		side
		{
			"id" "298"
			"plane" "(2240 -272 128) (2240 -304 128) (2240 -304 96)"
			"material" "DEV/GRAYGRID"
			"uaxis" "[0 1 0 256] 0.25"
			"vaxis" "[0 0 -1 -15.566] 0.25"
			"rotation" "0"
			"lightmapscale" "16"
			"smoothing_groups" "0"
		}
		side
		{
			"id" "297"
			"plane" "(2272 -304 128) (2272 -272 128) (2272 -272 96)"
			"material" "DEV/GRAYGRID"
			"uaxis" "[0 1 0 256] 0.25"
			"vaxis" "[0 0 -1 -15.566] 0.25"
			"rotation" "0"
			"lightmapscale" "16"
			"smoothing_groups" "0"
		}
		side
		{
			"id" "296"
			"plane" "(2272 -272 128) (2240 -272 128) (2240 -272 96)"
			"material" "DEV/GRAYGRID"
			"uaxis" "[1 0 0 320] 0.25"
			"vaxis" "[0 0 -1 -15.566] 0.25"
			"rotation" "0"
			"lightmapscale" "16"
			"smoothing_groups" "0"
		}
		side
		{
			"id" "295"
			"plane" "(2240 -304 128) (2272 -304 128) (2272 -304 96)"
			"material" "DEV/GRAYGRID"
			"uaxis" "[1 0 0 320] 0.25"
			"vaxis" "[0 0 -1 -15.566] 0.25"
			"rotation" "0"
			"lightmapscale" "16"
			"smoothing_groups" "0"
		}
		editor
		{
			"color" "220 30 220"
			"visgroupshown" "1"
			"visgroupautoshown" "1"
		}
	}
	editor
	{
		"color" "220 30 220"
		"visgroupshown" "1"
		"visgroupautoshown" "1"
		"logicalpos" "[0 4500]"
	}
}
entity
{
	"id" "1672"
	"classname" "npc_custom_zombie"
	"angles" "0 98 0"
	"bloodcolor" "BLOOD_COLOR_RED"
	"fieldofview" "0.5"
	"health" "5000"
	"hullname" "Human"
	"maxhealth" "5000"
	"model" "models/Zombie/Classic.mdl"
	"physdamagescale" "1.0"
	"renderamt" "255"
	"rendercolor" "255 255 255"
	"spawnflags" "516"
	"TeamNum" "4"
	"origin" "-0.714111 -854.173 65"
	editor
	{
		"color" "0 200 200"
		"visgroupshown" "1"
		"visgroupautoshown" "1"
		"logicalpos" "[0 1500]"
	}
}
entity
{
	"id" "1675"
	"classname" "npc_custom_zombie"
	"angles" "0 287 0"
	"bloodcolor" "BLOOD_COLOR_RED"
	"fieldofview" "0.5"
	"health" "5000"
	"hullname" "Human"
	"maxhealth" "5000"
	"model" "models/Zombie/Classic.mdl"
	"physdamagescale" "1.0"
	"renderamt" "255"
	"rendercolor" "255 255 255"
	"spawnflags" "516"
	"TeamNum" "4"
	"origin" "-139.835 -817.448 65"
	editor
	{
		"color" "0 200 200"
		"visgroupshown" "1"
		"visgroupautoshown" "1"
		"logicalpos" "[0 2000]"
	}
}
entity
{
	"id" "1678"
	"classname" "npc_custom_zombie"
	"angles" "0 264 0"
	"bloodcolor" "BLOOD_COLOR_RED"
	"fieldofview" "0.5"
	"health" "5000"
	"hullname" "Human"
	"maxhealth" "5000"
	"model" "models/Zombie/Classic.mdl"
	"physdamagescale" "1.0"
	"renderamt" "255"
	"rendercolor" "255 255 255"
	"spawnflags" "516"
	"TeamNum" "4"
	"origin" "-331.472 -815.237 65"
	editor
	{
		"color" "0 200 200"
		"visgroupshown" "1"
		"visgroupautoshown" "1"
		"logicalpos" "[0 2500]"
	}
}
entity
{
	"id" "1681"
	"classname" "npc_custom_zombie"
	"angles" "0 132 0"
	"bloodcolor" "BLOOD_COLOR_RED"
	"fieldofview" "0.5"
	"health" "5000"
	"hullname" "Human"
	"maxhealth" "5000"
	"model" "models/Zombie/Classic.mdl"
	"physdamagescale" "1.0"
	"renderamt" "255"
	"rendercolor" "255 255 255"
	"spawnflags" "516"
	"TeamNum" "4"
	"origin" "-307.152 -944.913 65"
	editor
	{
		"color" "0 200 200"
		"visgroupshown" "1"
		"visgroupautoshown" "1"
		"logicalpos" "[0 3000]"
	}
}
entity
{
	"id" "1684"
	"classname" "npc_custom_zombie"
	"angles" "0 242 0"
	"bloodcolor" "BLOOD_COLOR_RED"
	"fieldofview" "0.5"
	"health" "5000"
	"hullname" "Human"
	"maxhealth" "5000"
	"model" "models/Zombie/Classic.mdl"
	"physdamagescale" "1.0"
	"renderamt" "255"
	"rendercolor" "255 255 255"
	"spawnflags" "516"
	"TeamNum" "4"
	"origin" "-245.58 -841.908 65"
	editor
	{
		"color" "0 200 200"
		"visgroupshown" "1"
		"visgroupautoshown" "1"
		"logicalpos" "[0 3500]"
	}
}
entity
{
	"id" "1687"
	"classname" "npc_custom_zombie"
	"angles" "0 159 0"
	"bloodcolor" "BLOOD_COLOR_RED"
	"fieldofview" "0.5"
	"health" "5000"
	"hullname" "Human"
	"maxhealth" "5000"
	"model" "models/Zombie/Classic.mdl"
	"physdamagescale" "1.0"
	"renderamt" "255"
	"rendercolor" "255 255 255"
	"spawnflags" "516"
	"TeamNum" "4"
	"origin" "-89.3998 -969.026 65"
	editor
	{
		"color" "0 200 200"
		"visgroupshown" "1"
		"visgroupautoshown" "1"
		"logicalpos" "[0 4000]"
	}
}
entity
{
	"id" "1690"
	"classname" "npc_custom_zombie"
	"angles" "0 205 0"
	"bloodcolor" "BLOOD_COLOR_RED"
	"fieldofview" "0.5"
	"health" "5000"
	"hullname" "Human"
	"maxhealth" "5000"
	"model" "models/Zombie/Classic.mdl"
	"physdamagescale" "1.0"
	"renderamt" "255"
	"rendercolor" "255 255 255"
	"spawnflags" "516"
	"TeamNum" "4"
	"origin" "-63.9996 -804.158 65"
	editor
	{
		"color" "0 200 200"
		"visgroupshown" "1"
		"visgroupautoshown" "1"
		"logicalpos" "[0 4500]"
	}
}
entity
{
	"id" "1693"
	"classname" "npc_custom_zombie"
	"angles" "0 168 0"
	"bloodcolor" "BLOOD_COLOR_RED"
	"fieldofview" "0.5"
	"health" "5000"
	"hullname" "Human"
	"maxhealth" "5000"
	"model" "models/Zombie/Classic.mdl"
	"physdamagescale" "1.0"
	"renderamt" "255"
	"rendercolor" "255 255 255"
	"spawnflags" "516"
	"TeamNum" "4"
	"origin" "-244.533 -957.41 65"
	editor
	{
		"color" "0 200 200"
		"visgroupshown" "1"
		"visgroupautoshown" "1"
		"logicalpos" "[0 5000]"
	}
}
entity
{
	"id" "1788"
	"classname" "trigger_multiple"
	"origin" "2256 -432.07 136"
	"spawnflags" "1"
	"wait" "1"
	connections
	{
		"OnStartTouch" "hint_hud_test,ShowHudHint,,0,-1"
		"OnEndTouch" "hint_hud_test,HideHudHint,,0,-1"
	}
	solid
	{
		"id" "1789"
		side
		{
			"id" "366"
			"plane" "(2272 -416.066 176) (2272 -448.066 176) (2240 -448.066 176)"
			"material" "TOOLS/TOOLSTRIGGER"
			"uaxis" "[1 0 0 0] 0.25"
			"vaxis" "[0 -1 0 -0.264526] 0.25"
			"rotation" "0"
			"lightmapscale" "16"
			"smoothing_groups" "0"
		}
		side
		{
			"id" "365"
			"plane" "(2272 -448.066 96) (2272 -416.066 96) (2240 -416.066 96)"
			"material" "TOOLS/TOOLSTRIGGER"
			"uaxis" "[1 0 0 0] 0.25"
			"vaxis" "[0 -1 0 -0.264526] 0.25"
			"rotation" "0"
			"lightmapscale" "16"
			"smoothing_groups" "0"
		}
		side
		{
			"id" "364"
			"plane" "(2240 -416.066 176) (2240 -448.066 176) (2240 -448.066 96)"
			"material" "TOOLS/TOOLSTRIGGER"
			"uaxis" "[0 1 0 0.264526] 0.25"
			"vaxis" "[0 0 -1 -15.566] 0.25"
			"rotation" "0"
			"lightmapscale" "16"
			"smoothing_groups" "0"
		}
		side
		{
			"id" "363"
			"plane" "(2272 -448.066 176) (2272 -416.066 176) (2272 -416.066 96)"
			"material" "TOOLS/TOOLSTRIGGER"
			"uaxis" "[0 1 0 0.264526] 0.25"
			"vaxis" "[0 0 -1 -15.566] 0.25"
			"rotation" "0"
			"lightmapscale" "16"
			"smoothing_groups" "0"
		}
		side
		{
			"id" "362"
			"plane" "(2272 -416.066 176) (2240 -416.066 176) (2240 -416.066 96)"
			"material" "TOOLS/TOOLSTRIGGER"
			"uaxis" "[1 0 0 0] 0.25"
			"vaxis" "[0 0 -1 -15.566] 0.25"
			"rotation" "0"
			"lightmapscale" "16"
			"smoothing_groups" "0"
		}
		side
		{
			"id" "361"
			"plane" "(2240 -448.066 176) (2272 -448.066 176) (2272 -448.066 96)"
			"material" "TOOLS/TOOLSTRIGGER"
			"uaxis" "[1 0 0 0] 0.25"
			"vaxis" "[0 0 -1 -15.566] 0.25"
			"rotation" "0"
			"lightmapscale" "16"
			"smoothing_groups" "0"
		}
		editor
		{
			"color" "220 30 220"
			"visgroupshown" "1"
			"visgroupautoshown" "1"
		}
	}
	editor
	{
		"color" "220 30 220"
		"visgroupshown" "1"
		"visgroupautoshown" "1"
		"logicalpos" "[0 4500]"
	}
}
entity
{
	"id" "1797"
	"classname" "env_hudhint"
	"message" "Hint_ClassMenu"
	"spawnflags" "0"
	"targetname" "hint_hud_test"
	"origin" "2225.17 -433.163 73"
	editor
	{
		"color" "220 30 220"
		"visgroupshown" "1"
		"visgroupautoshown" "1"
		"logicalpos" "[0 500]"
	}
}
cameras
{
	"activecamera" "0"
	camera
	{
		"position" "[1890.28 -442.58 193.84]"
		"look" "[1891.27 -442.611 193.693]"
	}
}
cordon
{
	"mins" "(-1024 -1024 -1024)"
	"maxs" "(1024 1024 1024)"
	"active" "0"
}
