  6
Minimum   1  Energy =      -15.5277815630  kJ/mol
F   -2.0000000   0.0000000   4.0000000
H   -1.2057675   0.0000000   3.5414497
C    0.0000000   0.0000000   0.0000000
O    0.0000000   0.0000000   1.2100008
H   -0.9596056   0.0000000  -0.5418138
H    0.9596056   0.0000000  -0.5418138
  6
Minimum   2  Energy =      -17.7868244628  kJ/mol
F   -1.9772647   0.0000000   3.9558565
H   -1.2327788   0.0000000   3.4203061
C   -0.0158411   0.0000000   0.0480382
O   -0.0245667   0.0000000   1.2580076
H   -0.9715146   0.0000000  -0.5006814
H    0.9476467   0.0000000  -0.4868415
  6
Minimum   3  Energy =      -19.6623440762  kJ/mol
F   -1.9540017   0.0000000   3.9047946
H   -1.2374519   0.0000000   3.3324049
C   -0.0723207   0.0000000   0.1016918
O   -0.0121981   0.0000000   1.3101980
H   -1.0576627   0.0000000  -0.3917718
H    0.8591779   0.0000000  -0.4871337
  6
Minimum   4  Energy =      -21.1763913606  kJ/mol
F   -1.9316985   0.0000000   3.8522155
H   -1.2205701   0.0000000   3.2731041
C   -0.1524371   0.0000000   0.1603017
O    0.0231880   0.0000000   1.3574892
H   -1.1805223   0.0000000  -0.2364929
H    0.7183654   0.0000000  -0.5150561
  6
Minimum   5  Energy =      -22.3422922784  kJ/mol
F   -1.9089575   0.0000000   3.8001685
H   -1.1874904   0.0000000   3.2339894
C   -0.2353641   0.0000000   0.2235225
O    0.0589029   0.0000000   1.3971958
H   -1.2979265   0.0000000  -0.0686526
H    0.5636648   0.0000000  -0.5353965
  6
Minimum   6  Energy =      -23.1538716021  kJ/mol
F   -1.8859112   0.0000000   3.7496119
H   -1.1398210   0.0000000   3.2162986
C   -0.3178373   0.0000000   0.2901463
O    0.0921314   0.0000000   1.4285784
H   -1.4042602   0.0000000   0.1055101
H    0.4014342   0.0000000  -0.5447511
  6
Minimum   7  Energy =      -23.6745718015  kJ/mol
F   -1.8623687   0.0000000   3.7004478
H   -1.0803222   0.0000000   3.2214102
C   -0.3993176   0.0000000   0.3600195
O    0.1222565   0.0000000   1.4518356
H   -1.4987457   0.0000000   0.2847670
H    0.2330099   0.0000000  -0.5425142
  6
Minimum   8  Energy =      -23.9958349270  kJ/mol
F   -1.8373611   0.0000000   3.6510468
H   -1.0143441   0.0000000   3.2464276
C   -0.4798948   0.0000000   0.4346010
O    0.1480734   0.0000000   1.4688921
H   -1.5813431   0.0000000   0.4694842
H    0.0591707   0.0000000  -0.5265512
  6
Minimum   9  Energy =      -24.1294266100  kJ/mol
F   -1.8112999   0.0000000   3.6023126
H   -0.9520000   0.0000000   3.2818795
C   -0.5546116   0.0000000   0.5105870
O    0.1664719   0.0000000   1.4822559
H   -1.6480918   0.0000000   0.6473573
H   -0.1069044   0.0000000  -0.4963705
  6
Minimum  10  Energy =      -24.1313057592  kJ/mol
F   -1.8086328   0.0000000   3.5981389
H   -0.9468291   0.0000000   3.2845022
C   -0.5591894   0.0000000   0.5157478
O    0.1654428   0.0000000   1.4847731
H   -1.6521622   0.0000000   0.6565162
H   -0.1151679   0.0000000  -0.4928403
  6
Minimum  11  Energy =      -24.1313059836  kJ/mol
F   -1.8086647   0.0000000   3.5981958
H   -0.9468892   0.0000000   3.2844816
C   -0.5591170   0.0000000   0.5156656
O    0.1654374   0.0000000   1.4847491
H   -1.6521011   0.0000000   0.6563462
H   -0.1150145   0.0000000  -0.4928869
  6
Minimum  Converged. Energy =      -24.1313059836  kJ/mol
F   -1.8086647   0.0000000   3.5981958
H   -0.9468892   0.0000000   3.2844816
C   -0.5591170   0.0000000   0.5156656
O    0.1654374   0.0000000   1.4847491
H   -1.6521011   0.0000000   0.6563462
H   -0.1150145   0.0000000  -0.4928869
