    6
Iteration 0 energy   -20.411713
O   -0.0000000   0.0000000   0.0000000
H   -0.1055747  -0.0000000   0.9512598
H   -0.8944073  -0.0000000  -0.3407005
O    0.0000000   0.0000000   2.9224000
H    0.5299058  -0.7568716   3.1721728
H    0.5299058   0.7568716   3.1721728
    6
Iteration 1 energy   -20.411715
O    0.0000000  -0.0000000  -0.0000001
H   -0.1055745  -0.0000000   0.9512597
H   -0.8944073  -0.0000000  -0.3407006
O   -0.0000000  -0.0000000   2.9224001
H    0.5299058  -0.7568716   3.1721730
H    0.5299058   0.7568716   3.1721730
    6
Iteration 2 energy   -20.688727
O    0.0058445  -0.0000332  -0.0280626
H   -0.0618816  -0.0005752   0.9266385
H   -0.9013835  -0.0000749  -0.3329864
O   -0.0069835   0.0002047   2.9477201
H    0.5196041  -0.7579048   3.2007357
H    0.5215659   0.7558336   3.2040437
    6
Iteration 3 energy   -20.739648
O    0.0077342   0.0004009  -0.0339639
H   -0.0389825   0.0024074   0.9219936
H   -0.9059794   0.0003342  -0.3188651
O   -0.0091646  -0.0002145   2.9513764
H    0.5114324  -0.7597120   3.2124963
H    0.5160612   0.7540125   3.2184358
    6
Iteration 4 energy   -20.827038
O    0.0101347   0.0010194  -0.0412818
H    0.0179510   0.0034298   0.9157837
H   -0.9183249   0.0006652  -0.2736692
O   -0.0116473   0.0000383   2.9518037
H    0.4838091  -0.7671628   3.2381018
H    0.5004013   0.7462813   3.2632021
    6
Iteration 5 energy   -20.768839
O    0.0097731   0.0071629  -0.0378212
H    0.0546842   0.0449331   0.9174786
H   -0.9269556   0.0081904  -0.2342383
O   -0.0110102  -0.0087331   2.9434194
H    0.4670490  -0.7709215   3.2698692
H    0.4846865   0.7427182   3.2684530
    6
Iteration 6 energy   -20.869076
O    0.0092162   0.0030317  -0.0357397
H    0.0389567   0.0146182   0.9208284
H   -0.9243204   0.0029531  -0.2468101
O   -0.0102553  -0.0023529   2.9428222
H    0.4704804  -0.7708760   3.2499162
H    0.4912042   0.7425326   3.2740702
    6
Iteration 7 energy   -20.873233
O    0.0086900   0.0028148  -0.0329019
H    0.0357871   0.0124214   0.9237666
H   -0.9242609   0.0027403  -0.2465464
O   -0.0095845  -0.0019864   2.9400790
H    0.4707760  -0.7708471   3.2469148
H    0.4917239   0.7425371   3.2723681
    6
Iteration 8 energy   -20.873803
O    0.0084596   0.0029624  -0.0316149
H    0.0361879   0.0124202   0.9250371
H   -0.9246318   0.0030166  -0.2446448
O   -0.0092824  -0.0021560   2.9386058
H    0.4702301  -0.7708181   3.2472602
H    0.4911019   0.7425822   3.2718053
    6
Iteration 9 energy   -20.873882
O    0.0084295   0.0030153  -0.0315544
H    0.0365150   0.0118340   0.9250932
H   -0.9247414   0.0032029  -0.2442357
O   -0.0092468  -0.0022174   2.9384927
H    0.4702615  -0.7705611   3.2479453
H    0.4907660   0.7428601   3.2714913
    6
Iteration 10 energy   -20.874268
O    0.0081620   0.0036075  -0.0315598
H    0.0384732   0.0068401   0.9250551
H   -0.9255006   0.0052803  -0.2420656
O   -0.0089608  -0.0030156   2.9381896
H    0.4717592  -0.7675629   3.2550759
H    0.4877760   0.7460476   3.2671244
    6
Iteration 11 energy   -20.873189
O    0.0078411   0.0035899  -0.0317111
H    0.0388730  -0.0040099   0.9248560
H   -0.9259808   0.0071763  -0.2414846
O   -0.0086122  -0.0029199   2.9382055
H    0.4743443  -0.7637519   3.2605857
H    0.4848300   0.7499524   3.2633815
    6
Iteration 12 energy   -20.874417
O    0.0080729   0.0036708  -0.0317628
H    0.0385208   0.0035793   0.9248532
H   -0.9256197   0.0060963  -0.2421281
O   -0.0088765  -0.0031138   2.9383789
H    0.4729667  -0.7660879   3.2573442
H    0.4867147   0.7475717   3.2653375
    6
Iteration 13 energy   -20.874437
O    0.0080788   0.0036761  -0.0318188
H    0.0384343   0.0034414   0.9248001
H   -0.9255932   0.0062172  -0.2422739
O   -0.0088890  -0.0031408   2.9384554
H    0.4732260  -0.7659098   3.2575007
H    0.4866202   0.7477553   3.2650545
    6
Iteration 14 energy   -20.874508
O    0.0080487   0.0037038  -0.0319091
H    0.0376838   0.0019244   0.9247308
H   -0.9254629   0.0071666  -0.2430618
O   -0.0088858  -0.0033114   2.9386693
H    0.4751097  -0.7645092   3.2586186
H    0.4857854   0.7491905   3.2628336
    6
Iteration 15 energy   -20.874526
O    0.0079821   0.0036799  -0.0317552
H    0.0370941   0.0012252   0.9248992
H   -0.9254123   0.0077404  -0.2434147
O   -0.0088175  -0.0033711   2.9385737
H    0.4761547  -0.7637901   3.2588956
H    0.4852524   0.7499230   3.2618141
    6
Iteration 16 energy   -20.874516
O    0.0079727   0.0035770  -0.0318378
H    0.0368683   0.0003271   0.9248209
H   -0.9253727   0.0080940  -0.2437040
O   -0.0088129  -0.0032932   2.9386888
H    0.4768377  -0.7633226   3.2589074
H    0.4848324   0.7503970   3.2616542
    6
Iteration 17 energy   -20.874530
O    0.0079733   0.0036310  -0.0317678
H    0.0369924   0.0009245   0.9248888
H   -0.9253997   0.0079362  -0.2435165
O   -0.0088094  -0.0033426   2.9385980
H    0.4764863  -0.7635769   3.2588685
H    0.4850200   0.7501395   3.2617674
    6
Iteration 18 energy   -20.874531
O    0.0079748   0.0036259  -0.0317736
H    0.0370057   0.0009532   0.9248828
H   -0.9254006   0.0079841  -0.2435106
O   -0.0088116  -0.0033466   2.9386033
H    0.4765433  -0.7635437   3.2588724
H    0.4849613   0.7501733   3.2617711
    6
Iteration 19 energy   -20.874535
O    0.0079781   0.0035779  -0.0317910
H    0.0370636   0.0010130   0.9248640
H   -0.9254077   0.0083086  -0.2434743
O   -0.0088176  -0.0033532   2.9386179
H    0.4769411  -0.7633047   3.2588576
H    0.4845549   0.7504164   3.2618147
    6
Iteration 20 energy   -20.874537
O    0.0079716   0.0035390  -0.0317629
H    0.0371221   0.0010757   0.9248904
H   -0.9254275   0.0084825  -0.2433827
O   -0.0088082  -0.0033407   2.9385776
H    0.4771032  -0.7632146   3.2587697
H    0.4843101   0.7505081   3.2619776
    6
Iteration 21 energy   -20.874536
O    0.0079806   0.0034921  -0.0318406
H    0.0372372   0.0010067   0.9248094
H   -0.9254413   0.0085920  -0.2433564
O   -0.0088183  -0.0033037   2.9386441
H    0.4772041  -0.7631555   3.2587205
H    0.4841246   0.7505678   3.2622587
    6
Iteration 22 energy   -20.874537
O    0.0079731   0.0035192  -0.0317833
H    0.0371744   0.0010676   0.9248684
H   -0.9254369   0.0085247  -0.2433535
O   -0.0088092  -0.0033245   2.9385911
H    0.4771283  -0.7632021   3.2587350
H    0.4842330   0.7505206   3.2621157
    6
Iteration 23 energy   -20.874537
O    0.0079734   0.0035193  -0.0317844
H    0.0371786   0.0010750   0.9248672
H   -0.9254375   0.0085250  -0.2433508
O   -0.0088095  -0.0033250   2.9385917
H    0.4771262  -0.7632037   3.2587355
H    0.4842319   0.7505190   3.2621203
    6
Iteration 24 energy   -20.874537
O    0.0079740   0.0035193  -0.0317853
H    0.0371879   0.0010885   0.9248661
H   -0.9254388   0.0085235  -0.2433432
O   -0.0088100  -0.0033249   2.9385915
H    0.4771182  -0.7632095   3.2587330
H    0.4842312   0.7505132   3.2621339
    6
Iteration 25 energy   -20.874537
O    0.0079745   0.0035192  -0.0317848
H    0.0371999   0.0011053   0.9248663
H   -0.9254408   0.0085160  -0.2433317
O   -0.0088104  -0.0033238   2.9385893
H    0.4770997  -0.7632225   3.2587248
H    0.4842364   0.7505000   3.2621567
    6
Iteration 26 energy   -20.874537
O    0.0079774   0.0035173  -0.0317974
H    0.0372200   0.0011237   0.9248532
H   -0.9254419   0.0084964  -0.2433275
O   -0.0088134  -0.0033185   2.9386002
H    0.4770662  -0.7632480   3.2587087
H    0.4842533   0.7504741   3.2622099
    6
Iteration 27 energy   -20.874537
O    0.0079755   0.0035187  -0.0317866
H    0.0372091   0.0011201   0.9248643
H   -0.9254417   0.0085028  -0.2433255
O   -0.0088112  -0.0033212   2.9385900
H    0.4770768  -0.7632397   3.2587118
H    0.4842488   0.7504825   3.2621840
    6
Iteration 28 energy   -20.874537
O    0.0079755   0.0035188  -0.0317861
H    0.0372076   0.0011222   0.9248648
H   -0.9254414   0.0085011  -0.2433265
O   -0.0088112  -0.0033211   2.9385897
H    0.4770753  -0.7632414   3.2587095
H    0.4842513   0.7504808   3.2621839
    6
Iteration 29 energy   -20.874537
O    0.0079763   0.0035191  -0.0317839
H    0.0371966   0.0011427   0.9248674
H   -0.9254380   0.0084820  -0.2433360
O   -0.0088120  -0.0033190   2.9385889
H    0.4770566  -0.7632611   3.2586841
H    0.4842779   0.7504608   3.2621930
    6
Iteration 30 energy   -20.874537
O    0.0079775   0.0035202  -0.0317873
H    0.0371972   0.0011625   0.9248641
H   -0.9254367   0.0084747  -0.2433401
O   -0.0088135  -0.0033197   2.9385928
H    0.4770480  -0.7632702   3.2586790
H    0.4842885   0.7504516   3.2621983
    6
Iteration 31 energy   -20.874537
O    0.0079768   0.0035192  -0.0317848
H    0.0371952   0.0011490   0.9248666
H   -0.9254372   0.0084769  -0.2433386
O   -0.0088125  -0.0033185   2.9385901
H    0.4770512  -0.7632666   3.2586784
H    0.4842848   0.7504552   3.2621972
    6
Iteration 32 energy   -20.874537
O    0.0079768   0.0035191  -0.0317851
H    0.0371954   0.0011490   0.9248663
H   -0.9254372   0.0084764  -0.2433389
O   -0.0088126  -0.0033183   2.9385904
H    0.4770506  -0.7632671   3.2586779
H    0.4842853   0.7504547   3.2621981
    6
Iteration 33 energy   -20.874537
O    0.0079769   0.0035191  -0.0317853
H    0.0371956   0.0011494   0.9248662
H   -0.9254372   0.0084761  -0.2433389
O   -0.0088127  -0.0033182   2.9385906
H    0.4770501  -0.7632676   3.2586776
H    0.4842857   0.7504543   3.2621988
    6
Iteration 34 energy   -20.874537
O    0.0079769   0.0035191  -0.0317853
H    0.0371959   0.0011499   0.9248661
H   -0.9254372   0.0084757  -0.2433387
O   -0.0088127  -0.0033182   2.9385906
H    0.4770495  -0.7632680   3.2586773
H    0.4842860   0.7504538   3.2621996
    6
Iteration 35 energy   -20.874537
O    0.0079770   0.0035191  -0.0317853
H    0.0371966   0.0011509   0.9248661
H   -0.9254373   0.0084752  -0.2433380
O   -0.0088127  -0.0033181   2.9385905
H    0.4770483  -0.7632689   3.2586767
H    0.4842864   0.7504529   3.2622011
    6
Iteration 36 energy   -20.874537
O    0.0079770   0.0035192  -0.0317855
H    0.0371972   0.0011526   0.9248659
H   -0.9254373   0.0084749  -0.2433377
O   -0.0088128  -0.0033182   2.9385906
H    0.4770475  -0.7632695   3.2586765
H    0.4842867   0.7504523   3.2622019
    6
Iteration 37 energy   -20.874537
O    0.0079770   0.0035191  -0.0317853
H    0.0371968   0.0011514   0.9248661
H   -0.9254373   0.0084751  -0.2433378
O   -0.0088127  -0.0033181   2.9385904
H    0.4770480  -0.7632691   3.2586765
H    0.4842865   0.7504527   3.2622014
    6
Iteration 38 energy   -20.874537
O    0.0079770   0.0035191  -0.0317853
H    0.0371968   0.0011514   0.9248661
H   -0.9254373   0.0084751  -0.2433378
O   -0.0088127  -0.0033181   2.9385904
H    0.4770480  -0.7632691   3.2586765
H    0.4842864   0.7504527   3.2622014
    6
Iteration 39 energy   -20.874537
O    0.0079770   0.0035191  -0.0317852
H    0.0371968   0.0011514   0.9248661
H   -0.9254373   0.0084751  -0.2433378
O   -0.0088127  -0.0033181   2.9385904
H    0.4770480  -0.7632691   3.2586765
H    0.4842864   0.7504527   3.2622014
    6
Minimum  39  Converged.  Energy =      -20.8745373009  kJ/mol
O    0.0079770   0.0035191  -0.0317852
H    0.0371968   0.0011514   0.9248661
H   -0.9254373   0.0084751  -0.2433378
O   -0.0088127  -0.0033181   2.9385904
H    0.4770480  -0.7632691   3.2586765
H    0.4842864   0.7504527   3.2622014
