  6
Pathway -1   1  Energy =      -19.1110095241  kJ/mol
F   -1.9314799   0.0000000   3.9251920
H   -1.4696688   0.0000000   3.1328511
C    0.2546448   0.0000000   0.1744030
O   -0.3546578   0.0000000   1.2197987
H   -0.3015855   0.0000000  -0.7769188
H    1.3565418   0.0000000   0.1895107
  6
Pathway -1   2  Energy =      -19.1119689363  kJ/mol
F   -1.9308535   0.0000000   3.9255571
H   -1.4695661   0.0000000   3.1329112
C    0.2591842   0.0000000   0.1770826
O   -0.3603380   0.0000000   1.2164546
H   -0.2876927   0.0000000  -0.7796466
H    1.3608801   0.0000000   0.2029924
  6
Pathway -1   3  Energy =      -19.1148481117  kJ/mol
F   -1.9301950   0.0000000   3.9258675
H   -1.4694333   0.0000000   3.1329158
C    0.2636644   0.0000000   0.1798688
O   -0.3660233   0.0000000   1.2131139
H   -0.2738016   0.0000000  -0.7821787
H    1.3650531   0.0000000   0.2165840
  6
Pathway -1   4  Energy =      -19.1263658627  kJ/mol
F   -1.9288439   0.0000000   3.9264342
H   -1.4691443   0.0000000   3.1328663
C    0.2725154   0.0000000   0.1856556
O   -0.3773524   0.0000000   1.2063288
H   -0.2459440   0.0000000  -0.7867666
H    1.3729702   0.0000000   0.2440043
  6
Pathway -1   5  Energy =      -19.1724645790  kJ/mol
F   -1.9259321   0.0000000   3.9272390
H   -1.4684436   0.0000000   3.1323944
C    0.2897582   0.0000000   0.1982410
O   -0.3999647   0.0000000   1.1924162
H   -0.1898404   0.0000000  -0.7939235
H    1.3870446   0.0000000   0.3000626
  6
Pathway -1   6  Energy =      -19.3571614249  kJ/mol
F   -1.9191561   0.0000000   3.9274680
H   -1.4668178   0.0000000   3.1296812
C    0.3226573   0.0000000   0.2279464
O   -0.4454424   0.0000000   1.1628928
H   -0.0748737   0.0000000  -0.7998543
H    1.4080672   0.0000000   0.4184470
  6
Pathway -1   7  Energy =      -19.7282328682  kJ/mol
F   -1.9087117   0.0000000   3.9238466
H   -1.4660513   0.0000000   3.1206496
C    0.3577109   0.0000000   0.2727527
O   -0.4998904   0.0000000   1.1263463
H    0.0647747   0.0000000  -0.7896001
H    1.4186800   0.0000000   0.5706618
  6
Pathway -1   8  Energy =      -20.2238782011  kJ/mol
F   -1.8956455   0.0000000   3.9150694
H   -1.4700731   0.0000000   3.1026891
C    0.3862067   0.0000000   0.3271941
O   -0.5523273   0.0000000   1.0909060
H    0.2007923   0.0000000  -0.7590962
H    1.4121341   0.0000000   0.7295351
  6
Pathway -1   9  Energy =      -20.8096948637  kJ/mol
F   -1.8798965   0.0000000   3.9007566
H   -1.4819460   0.0000000   3.0744944
C    0.4078344   0.0000000   0.3912454
O   -0.6022549   0.0000000   1.0574449
H    0.3317943   0.0000000  -0.7081285
H    1.3884693   0.0000000   0.8939982
  6
Pathway -1  10  Energy =      -21.4475096706  kJ/mol
F   -1.8616687   0.0000000   3.8810905
H   -1.5038259   0.0000000   3.0366841
C    0.4225367   0.0000000   0.4642121
O   -0.6490152   0.0000000   1.0262427
H    0.4566308   0.0000000  -0.6372608
H    1.3480810   0.0000000   1.0623534
  6
Pathway -1  11  Energy =      -22.0898716295  kJ/mol
F   -1.8413577   0.0000000   3.8566954
H   -1.5367187   0.0000000   2.9916701
C    0.4304312   0.0000000   0.5448567
O   -0.6918769   0.0000000   0.9971028
H    0.5743188   0.0000000  -0.5477098
H    1.2916372   0.0000000   1.2324100
  6
Pathway -1  12  Energy =      -22.6919134511  kJ/mol
F   -1.8192350   0.0000000   3.8279457
H   -1.5815030   0.0000000   2.9421934
C    0.4315649   0.0000000   0.6321337
O   -0.7302857   0.0000000   0.9700766
H    0.6838083   0.0000000  -0.4406097
H    1.2198276   0.0000000   1.4022292
  6
Pathway -1  13  Energy =      -23.2185735036  kJ/mol
F   -1.7953403   0.0000000   3.7948364
H   -1.6376803   0.0000000   2.8913891
C    0.4257517   0.0000000   0.7253158
O   -0.7640324   0.0000000   0.9455788
H    0.7838305   0.0000000  -0.3168861
H    1.1331951   0.0000000   1.5702589
  6
Pathway -1  14  Energy =      -23.6473656735  kJ/mol
F   -1.7695470   0.0000000   3.7570987
H   -1.7028689   0.0000000   2.8424251
C    0.4125997   0.0000000   0.8237719
O   -0.7932076   0.0000000   0.9244231
H    0.8727131   0.0000000  -0.1775776
H    1.0323584   0.0000000   1.7349822
  6
Pathway -1  15  Energy =      -23.9455766534  kJ/mol
F   -1.7436704   0.0000000   3.7174865
H   -1.7686404   0.0000000   2.8007258
C    0.3934239   0.0000000   0.9196210
O   -0.8165273   0.0000000   0.9086563
H    0.9439111   0.0000000  -0.0350356
H    0.9265198   0.0000000   1.8840969
  6
Pathway -1  16  Energy =      -24.1122908508  kJ/mol
F   -1.7172995   0.0000000   3.6755583
H   -1.8336682   0.0000000   2.7658704
C    0.3688652   0.0000000   1.0141640
O   -0.8355339   0.0000000   0.8978682
H    1.0004004   0.0000000   0.1110757
H    0.8159410   0.0000000   2.0214020
  6
Pathway -1  17  Energy =      -24.1310863792  kJ/mol
F   -1.7056056   0.0000000   3.6559147
H   -1.8615132   0.0000000   2.7521634
C    0.3568588   0.0000000   1.0538052
O   -0.8429584   0.0000000   0.8971502
H    1.0183496   0.0000000   0.1724227
H    0.7698755   0.0000000   2.0754815
  6
Pathway -1  18  Energy =      -24.1313059314  kJ/mol
F   -1.7066672   0.0000000   3.6575675
H   -1.8590299   0.0000000   2.7532117
C    0.3580317   0.0000000   1.0499299
O   -0.8423619   0.0000000   0.8977549
H    1.0162278   0.0000000   0.1660843
H    0.7748594   0.0000000   2.0700573
  6
Pathway -1  19  Energy =      -24.1313059834  kJ/mol
F   -1.7066842   0.0000000   3.6575942
H   -1.8589910   0.0000000   2.7532290
C    0.3580504   0.0000000   1.0498686
O   -0.8423521   0.0000000   0.8977634
H    1.0161950   0.0000000   0.1659846
H    0.7749374   0.0000000   2.0699717
  6
Pathway -1  Converged. Energy =      -24.1313059834  kJ/mol
F   -1.7066842   0.0000000   3.6575942
H   -1.8589910   0.0000000   2.7532290
C    0.3580504   0.0000000   1.0498686
O   -0.8423521   0.0000000   0.8977634
H    1.0161950   0.0000000   0.1659846
H    0.7749374   0.0000000   2.0699717
