c.m. Alcohol1      3.3752755579E-01   -1.4076122173E-01   -2.1680639657E+00
           ux      7.3316804932E-01    6.7638435073E-01    7.0489868384E-02
           uy     -6.7948159159E-01    7.2438408333E-01    1.1650092924E-01
           uz      2.7737666687E-02   -1.3331132699E-01    9.9068598049E-01
Alcohol1           0.0000000000E+00    0.0000000000E+00    0.0000000000E+00
           ux      1.0000000000E+00    0.0000000000E+00    0.0000000000E+00
           uy      0.0000000000E+00    1.0000000000E+00    0.0000000000E+00
           uz      0.0000000000E+00    0.0000000000E+00    1.0000000000E+00
O                  0.0000000000E+00    0.0000000000E+00    0.0000000000E+00
C1                 1.0728053297E+00   -9.2581939726E-01   -2.2971314207E+00
C2                -5.6679213540E-02    5.2265968404E-01   -4.4536299737E+00
H1                 5.9317800228E-01   -7.6785503586E-01    1.1547474945E+00
H2                 6.8623119341E-01   -2.9359009172E+00   -2.5601835556E+00
H3                 3.1284960010E+00   -6.8524179918E-01   -2.3251764303E+00
H4                -2.1028434018E+00    2.9579064430E-01   -4.4223325079E+00
H5                 3.3930828868E-01    2.5328165650E+00   -4.1911280395E+00
H6                 6.7652697303E-01   -6.9844771492E-02   -6.3224224791E+00
c.m. Alcohol2     -3.9607764182E+00   -7.2177359332E+00   -2.1806310171E+00
           ux      7.2605469888E-01   -6.7788624641E-01   -1.1538982260E-01
           uy      6.8684661041E-01    7.2297970921E-01    7.4445106170E-02
           uz      3.2959186803E-02   -1.3330632767E-01    9.9052668566E-01
Alcohol2          -3.4890338102E+00   -7.0768731349E+00   -3.7004880414E-02
           ux      1.0000000000E+00    0.0000000000E+00    0.0000000000E+00
           uy      0.0000000000E+00    1.0000000000E+00    0.0000000000E+00
           uz      0.0000000000E+00    0.0000000000E+00    1.0000000000E+00
O                 -3.4890338102E+00   -7.0768731349E+00   -3.7004880414E-02
C1                -4.7075355226E+00   -8.0032358456E+00   -2.2640292343E+00
C2                -3.7060710264E+00   -6.5539714953E+00   -4.4867321601E+00
H1                -4.0179207838E+00   -7.8450652737E+00    1.1523290988E+00
H2                -4.3304141520E+00   -1.0012797796E+01   -2.5516616626E+00
H3                -6.7538259702E+00   -7.7624399495E+00   -2.1708358189E+00
H4                -1.6596674618E+00   -6.7811341942E+00   -4.5761229184E+00
H5                -4.0831923970E+00   -4.5444095452E+00   -4.1990997318E+00
H6                -4.5477338961E+00   -7.1466796127E+00   -6.3079282808E+00
c.m. Alcohol3     -9.0922051094E+00   -1.4076122173E-01   -2.1680639657E+00
           ux      7.3316804932E-01    6.7638435073E-01    7.0489868384E-02
           uy     -6.7948159159E-01    7.2438408333E-01    1.1650092924E-01
           uz      2.7737666687E-02   -1.3331132699E-01    9.9068598049E-01
Alcohol3          -9.4297326652E+00    0.0000000000E+00    0.0000000000E+00
           ux      1.0000000000E+00    0.0000000000E+00    0.0000000000E+00
           uy      0.0000000000E+00    1.0000000000E+00    0.0000000000E+00
           uz      0.0000000000E+00    0.0000000000E+00    1.0000000000E+00
O                 -9.4297326652E+00    0.0000000000E+00    0.0000000000E+00
C1                -8.3569273355E+00   -9.2581939726E-01   -2.2971314207E+00
C2                -9.4864118787E+00    5.2265968404E-01   -4.4536299737E+00
H1                -8.8365546629E+00   -7.6785503586E-01    1.1547474945E+00
H2                -8.7435014718E+00   -2.9359009172E+00   -2.5601835556E+00
H3                -6.3012366642E+00   -6.8524179918E-01   -2.3251764303E+00
H4                -1.1532576067E+01    2.9579064430E-01   -4.4223325079E+00
H5                -9.0904243765E+00    2.5328165650E+00   -4.1911280395E+00
H6                -8.7532056922E+00   -6.9844771492E-02   -6.3224224791E+00
c.m. Alcohol4     -3.9607436940E+00    6.9361610155E+00   -2.1795309304E+00
           ux      7.2605469888E-01   -6.7788624641E-01   -1.1538982260E-01
           uy      6.8684661041E-01    7.2297970921E-01    7.4445106170E-02
           uz      3.2959186803E-02   -1.3330632767E-01    9.9052668566E-01
Alcohol4          -3.4890010861E+00    7.0770238139E+00   -3.5904793715E-02
           ux      1.0000000000E+00    0.0000000000E+00    0.0000000000E+00
           uy      0.0000000000E+00    1.0000000000E+00    0.0000000000E+00
           uz      0.0000000000E+00    0.0000000000E+00    1.0000000000E+00
O                 -3.4890010861E+00    7.0770238139E+00   -3.5904793715E-02
C1                -4.7075027985E+00    6.1506611031E+00   -2.2629291476E+00
C2                -3.7060383023E+00    7.5999254534E+00   -4.4856320734E+00
H1                -4.0178880597E+00    6.3088316750E+00    1.1534291855E+00
H2                -4.3303814279E+00    4.1410991529E+00   -2.5505615759E+00
H3                -6.7537932460E+00    6.3914569992E+00   -2.1697357322E+00
H4                -1.6596347376E+00    7.3727627546E+00   -4.5750228317E+00
H5                -4.0831596729E+00    9.6094874036E+00   -4.1979996451E+00
H6                -4.5477011720E+00    7.0072173360E+00   -6.3068281941E+00
c.m. Water1        5.1753362698E+00    5.8167904067E+00    5.3075963199E+00
           ux     -5.0000000000E-01    8.6602540378E-01    2.7144692763E-14
           uy      5.3007619638E-01    3.0603963467E-01   -7.9079641377E-01
           uz     -6.8484978355E-01   -3.9539820689E-01   -6.1207926935E-01
Water1             5.0904871666E+00    5.7678027542E+00    5.2317630813E+00
           ux     -5.0000000000E-01    8.6602540378E-01   -4.8420715644E-17
           uy      5.3007619638E-01    3.0603963467E-01   -7.9079641377E-01
           uz     -6.8484978355E-01   -3.9539820689E-01   -6.1207926935E-01
O                  5.0904871666E+00    5.7678027542E+00    5.2317630813E+00
H2                 5.1335045470E+00    7.4441838669E+00    5.9093604291E+00
           ux     -8.4761638748E-01    2.1739671237E-01   -4.8403009114E-01
           uy     -5.3007619638E-01   -3.0603963467E-01    7.9079641377E-01
           uz      2.3784148240E-02    9.2686482912E-01    3.7464103196E-01
H1                 6.5637844869E+00    4.9668663420E+00    5.9093604291E+00
           ux     -2.3553711813E-01   -8.4275568040E-01   -4.8403009114E-01
           uy      5.3007619638E-01    3.0603963467E-01   -7.9079641377E-01
           uz      8.1458056201E-01   -4.4283473798E-01    3.7464103196E-01
CM                 5.1747180304E+00    5.8164334661E+00    5.3070437732E+00
c.m. Water2        2.1435121206E-01   -1.1048223421E+00    5.3338068193E+00
           ux     -5.0000000000E-01   -8.6602540378E-01   -2.5655805752E-15
           uy     -5.3007619638E-01    3.0603963467E-01   -7.9079641377E-01
           uz      6.8484978355E-01   -3.9539820689E-01   -6.1207926935E-01
Water2             2.9920031521E-01   -1.1538099947E+00    5.2579735807E+00
           ux     -5.0000000000E-01   -8.6602540378E-01   -4.8420715644E-17
           uy     -5.3007619638E-01    3.0603963467E-01   -7.9079641377E-01
           uz      6.8484978355E-01   -3.9539820689E-01   -6.1207926935E-01
O                  2.9920031521E-01   -1.1538099947E+00    5.2579735807E+00
H2                -1.1740970050E+00   -1.9547464068E+00    5.9355709285E+00
           ux      2.3553711813E-01   -8.4275568040E-01   -4.8403009114E-01
           uy      5.3007619638E-01   -3.0603963467E-01    7.9079641377E-01
           uz     -8.1458056201E-01   -4.4283473798E-01    3.7464103196E-01
H1                 2.5618293485E-01    5.2257111806E-01    5.9355709285E+00
           ux      8.4761638748E-01    2.1739671237E-01   -4.8403009114E-01
           uy     -5.3007619638E-01    3.0603963467E-01   -7.9079641377E-01
           uz     -2.3784148240E-02    9.2686482912E-01    3.7464103196E-01
CM                 2.1496945143E-01   -1.1051792828E+00    5.3332542726E+00
c.m. Water3        9.4929817939E+00   -1.4601653841E+00    4.9879491695E+00
           ux      1.0000000000E+00   -2.6204952261E-14    3.4523253827E-14
           uy      1.1261357285E-14   -6.1207926935E-01   -7.9079641377E-01
           uz      4.1853750249E-14    7.9079641377E-01   -6.1207926935E-01
Water3             9.4929817939E+00   -1.3621900790E+00    4.9121159309E+00
           ux      1.0000000000E+00   -9.8708125805E-17   -4.8420715644E-17
           uy     -9.8708125805E-17   -6.1207926935E-01   -7.9079641377E-01
           uz      4.8420715644E-17    7.9079641377E-01   -6.1207926935E-01
O                  9.4929817939E+00   -1.3621900790E+00    4.9121159309E+00
H2                 1.0923261734E+01   -2.2376347796E+00    5.5897132788E+00
           ux      6.1207926935E-01    6.2535896804E-01   -4.8403009114E-01
           uy      1.7366374203E-16    6.1207926935E-01    7.9079641377E-01
           uz      7.9079641377E-01   -4.8403009114E-01    3.7464103196E-01
H1                 8.0627018540E+00   -2.2376347796E+00    5.5897132788E+00
           ux     -6.1207926935E-01    6.2535896804E-01   -4.8403009114E-01
           uy     -9.8708125805E-17   -6.1207926935E-01   -7.9079641377E-01
           uz     -7.9079641377E-01   -4.8403009114E-01    3.7464103196E-01
CM                 9.4929817939E+00   -1.4594515028E+00    4.9873966228E+00
c.m. Water4        1.9840273758E-01    4.0006125571E+00    7.6349450485E+00
           ux      5.3007619638E-01    3.0603963467E-01   -7.9079641377E-01
           uy      5.0000000000E-01   -8.6602540378E-01   -2.4801249910E-14
           uz     -6.8484978355E-01   -3.9539820689E-01   -6.1207926935E-01
Water4             1.1355363444E-01    3.9516249045E+00    7.5591118099E+00
           ux      5.3007619638E-01    3.0603963467E-01   -7.9079641377E-01
           uy      5.0000000000E-01   -8.6602540378E-01    0.0000000000E+00
           uz     -6.8484978355E-01   -3.9539820689E-01   -6.1207926935E-01
O                  1.1355363444E-01    3.9516249045E+00    7.5591118099E+00
H2                 1.6298683350E+00    4.8270696051E+00    7.1056489106E+00
           ux     -2.1712810182E-01   -1.2535896804E-01   -9.6806018229E-01
           uy     -5.0000000000E-01    8.6602540378E-01   -1.1854926501E-16
           uz      8.3836471025E-01    4.8403009114E-01   -2.5071793607E-01
H1                 1.1355363444E-01    3.9516249045E+00    9.3677694049E+00
           ux     -8.6602540378E-01   -5.0000000000E-01    9.6493993351E-18
           uy      5.0000000000E-01   -8.6602540378E-01    0.0000000000E+00
           uz     -3.1170812459E-17    1.6710265983E-17    1.0000000000E+00
CM                 1.9778449822E-01    4.0002556164E+00    7.6343925018E+00
c.m. Water5        9.7958670748E+00    3.4950174020E+00    7.7869735040E+00
           ux     -3.8187976103E-14   -6.1207926935E-01   -7.9079641377E-01
           uy     -1.0000000000E+00    5.2770633946E-14    7.4458671433E-15
           uz      3.7173367156E-14    7.9079641377E-01   -6.1207926935E-01
Water5             9.7958670748E+00    3.5929927071E+00    7.7111402654E+00
           ux     -3.7477808114E-17   -6.1207926935E-01   -7.9079641377E-01
           uy     -1.0000000000E+00    6.1230317691E-17    0.0000000000E+00
           uz      4.8420715644E-17    7.9079641377E-01   -6.1207926935E-01
O                  9.7958670748E+00    3.5929927071E+00    7.7111402654E+00
H2                 9.7958670748E+00    1.8421033060E+00    7.2576773661E+00
           ux     -1.0710909651E-16    2.5071793607E-01   -9.6806018229E-01
           uy      1.0000000000E+00   -3.0527239938E-17   -1.1854926501E-16
           uz     -5.9274632506E-17   -9.6806018229E-01   -2.5071793607E-01
H1                 9.7958670748E+00    3.5929927071E+00    9.5197978604E+00
           ux      6.1230317691E-17    1.0000000000E+00    9.6493993351E-18
           uy     -1.0000000000E+00    6.1230317691E-17    0.0000000000E+00
           uz      5.5340393246E-33    9.6493993351E-18    1.0000000000E+00
CM                 9.7958670748E+00    3.4957312833E+00    7.7864209573E+00
c.m. Water6        4.8575402380E+00   -3.3063342174E+00    7.6937344239E+00
           ux     -5.3007619638E-01    3.0603963467E-01   -7.9079641377E-01
           uy      5.0000000000E-01    8.6602540378E-01   -2.5740906841E-14
           uz      6.8484978355E-01   -3.9539820689E-01   -6.1207926935E-01
Water6             4.9423893412E+00   -3.3553218699E+00    7.6179011853E+00
           ux     -5.3007619638E-01    3.0603963467E-01   -7.9079641377E-01
           uy      5.0000000000E-01    8.6602540378E-01    0.0000000000E+00
           uz      6.8484978355E-01   -3.9539820689E-01   -6.1207926935E-01
O                  4.9423893412E+00   -3.3553218699E+00    7.6179011853E+00
H2                 3.4260746406E+00   -2.4798771694E+00    7.1644382860E+00
           ux      2.1712810182E-01   -1.2535896804E-01   -9.6806018229E-01
           uy     -5.0000000000E-01   -8.6602540378E-01   -1.1854926501E-16
           uz     -8.3836471025E-01    4.8403009114E-01   -2.5071793607E-01
H1                 4.9423893412E+00   -3.3553218699E+00    9.4265587803E+00
           ux      8.6602540378E-01   -5.0000000000E-01    9.6493993351E-18
           uy      5.0000000000E-01    8.6602540378E-01    0.0000000000E+00
           uz      3.1170812459E-17   -4.8246996676E-18    1.0000000000E+00
CM                 4.8581584774E+00   -3.3066911581E+00    7.6931818772E+00
c.m. Water7        4.7636534965E+00    5.6858186674E+00    1.6005774839E+01
           ux     -5.3007619638E-01   -3.0603963467E-01   -7.9079641377E-01
           uy     -5.0000000000E-01    8.6602540378E-01   -4.7704921735E-14
           uz      6.8484978355E-01    3.9539820689E-01   -6.1207926935E-01
Water7             4.8485025997E+00    5.7348063199E+00    1.5929941601E+01
           ux     -5.3007619638E-01   -3.0603963467E-01   -7.9079641377E-01
           uy     -5.0000000000E-01    8.6602540378E-01    0.0000000000E+00
           uz      6.8484978355E-01    3.9539820689E-01   -6.1207926935E-01
O                  4.8485025997E+00    5.7348063199E+00    1.5929941601E+01
H2                 3.3321878991E+00    4.8593616194E+00    1.5476478701E+01
           ux      2.1712810182E-01    1.2535896804E-01   -9.6806018229E-01
           uy      5.0000000000E-01   -8.6602540378E-01   -1.1854926501E-16
           uz     -8.3836471025E-01   -4.8403009114E-01   -2.5071793607E-01
H1                 4.8485025997E+00    5.7348063199E+00    1.7738599196E+01
           ux      8.6602540378E-01    5.0000000000E-01    9.6493993351E-18
           uy     -5.0000000000E-01    8.6602540378E-01    0.0000000000E+00
           uz      3.1170812459E-17    4.8246996676E-18    1.0000000000E+00
CM                 4.7642717359E+00    5.6861756081E+00    1.6005222293E+01
c.m. Water8        4.4672364614E-01   -1.3227228043E+00    1.5991103485E+01
           ux      5.3007619638E-01   -3.0603963467E-01   -7.9079641377E-01
           uy     -5.0000000000E-01   -8.6602540378E-01   -1.8252948974E-14
           uz     -6.8484978355E-01    3.9539820689E-01   -6.1207926935E-01
Water8             3.6187454299E-01   -1.2737351518E+00    1.5915270246E+01
           ux      5.3007619638E-01   -3.0603963467E-01   -7.9079641377E-01
           uy     -5.0000000000E-01   -8.6602540378E-01    0.0000000000E+00
           uz     -6.8484978355E-01    3.9539820689E-01   -6.1207926935E-01
O                  3.6187454299E-01   -1.2737351518E+00    1.5915270246E+01
H2                 1.8781892436E+00   -2.1491798524E+00    1.5461807347E+01
           ux     -2.1712810182E-01    1.2535896804E-01   -9.6806018229E-01
           uy      5.0000000000E-01    8.6602540378E-01   -1.1854926501E-16
           uz      8.3836471025E-01   -4.8403009114E-01   -2.5071793607E-01
H1                 3.6187454299E-01   -1.2737351518E+00    1.7723927841E+01
           ux     -8.6602540378E-01    5.0000000000E-01    9.6493993351E-18
           uy     -5.0000000000E-01   -8.6602540378E-01    0.0000000000E+00
           uz     -3.1170812459E-17   -1.6710265983E-17    1.0000000000E+00
CM                 4.4610540677E-01   -1.3223658637E+00    1.5990550938E+01
c.m. Water9        9.6326126192E+00   -1.1862790036E+00    1.5872125026E+01
           ux      1.1586542230E-13    6.1207926935E-01   -7.9079641377E-01
           uy      1.0000000000E+00    5.6377450115E-14    1.9015373382E-13
           uz      1.6097224383E-13   -7.9079641377E-01   -6.1207926935E-01
Water9             9.6326126192E+00   -1.2842543087E+00    1.5796291787E+01
           ux     -3.7477808114E-17    6.1207926935E-01   -7.9079641377E-01
           uy      1.0000000000E+00    6.1230317691E-17    0.0000000000E+00
           uz      4.8420715644E-17   -7.9079641377E-01   -6.1207926935E-01
O                  9.6326126192E+00   -1.2842543087E+00    1.5796291787E+01
H2                 9.6326126192E+00    4.6663509239E-01    1.5342828888E+01
           ux      1.3781217426E-16   -2.5071793607E-01   -9.6806018229E-01
           uy     -1.0000000000E+00   -9.1933395444E-17   -1.1854926501E-16
           uz     -5.9274632506E-17    9.6806018229E-01   -2.5071793607E-01
H1                 9.6326126192E+00   -1.2842543087E+00    1.7604949382E+01
           ux      6.1230317691E-17   -1.0000000000E+00    9.6493993351E-18
           uy      1.0000000000E+00    6.1230317691E-17    0.0000000000E+00
           uz      5.5340393246E-33   -9.6493993351E-18    1.0000000000E+00
CM                 9.6326126192E+00   -1.1869928850E+00    1.5871572479E+01
c.m. Water10       1.1225001030E-01    3.6232504319E+00    1.3450144691E+01
           ux     -6.0181502315E-01    7.9863551005E-01    2.1639654116E-14
           uy      3.9931775502E-01    3.0090751158E-01    8.6602540378E-01
           uz      6.9163864007E-01    5.2118709843E-01   -5.0000000000E-01
Water10            1.9794021525E-01    3.6878226329E+00    1.3388197454E+01
           ux     -6.0181502315E-01    7.9863551005E-01    1.3926925804E-16
           uy      3.9931775502E-01    3.0090751158E-01    8.6602540378E-01
           uz      6.9163864007E-01    5.2118709843E-01   -5.0000000000E-01
O                  1.9794021525E-01    3.6878226329E+00    1.3388197454E+01
H2                -1.4284966382E+00    4.2531190686E+00    1.3941718364E+01
           ux      1.7858685654E-01    9.0098112781E-01   -3.9539820689E-01
           uy     -3.9931775502E-01   -3.0090751158E-01   -8.6602540378E-01
           uz     -8.9925083553E-01    3.1255027886E-01    3.0603963467E-01
H1                 2.9303127202E-01    1.9685743700E+00    1.3941718364E+01
           ux      9.1530385584E-01   -7.6675351121E-02   -3.9539820689E-01
           uy      3.9931775502E-01    3.0090751158E-01    8.6602540378E-01
           uz      5.2575488601E-02   -9.5056591566E-01    3.0603963467E-01
CM                 1.1287437822E-01    3.6237209269E+00    1.3449693322E+01
c.m. Water11       9.6997867894E+00    3.9173957415E+00    1.3642413482E+01
           ux      1.0000000000E+00   -5.6369401557E-15   -1.1311127724E-13
           uy      9.5138769470E-14   -5.0000000000E-01    8.6602540378E-01
           uz     -6.1437371996E-14   -8.6602540378E-01   -5.0000000000E-01
Water11            9.6997867894E+00    3.8100999803E+00    1.3580466245E+01
           ux      1.0000000000E+00   -1.9176825926E-17    1.3926925804E-16
           uy     -1.3019912839E-16   -5.0000000000E-01    8.6602540378E-01
           uz      5.3027010602E-17   -8.6602540378E-01   -5.0000000000E-01
O                  9.6997867894E+00    3.8100999803E+00    1.3580466245E+01
H2                 1.1130066729E+01    4.7688263188E+00    1.4133987155E+01
           ux      6.1207926935E-01   -6.8484978355E-01   -3.9539820689E-01
           uy      2.0515474462E-16    5.0000000000E-01   -8.6602540378E-01
           uz      7.9079641377E-01    5.3007619638E-01    3.0603963467E-01
H1                 8.2695068496E+00    4.7688263188E+00    1.4133987155E+01
           ux     -6.1207926935E-01   -6.8484978355E-01   -3.9539820689E-01
           uy     -1.3019912839E-16   -5.0000000000E-01    8.6602540378E-01
           uz     -7.9079641377E-01    5.3007619638E-01    3.0603963467E-01
CM                 9.6997867894E+00    3.9166139482E+00    1.3641962113E+01
c.m. Water12       5.0347118733E+00   -3.5115582749E+00    1.3493578748E+01
           ux     -6.0181502315E-01   -7.9863551005E-01   -6.6891826894E-14
           uy     -3.9931775502E-01    3.0090751158E-01    8.6602540378E-01
           uz     -6.9163864007E-01    5.2118709843E-01   -5.0000000000E-01
Water12            4.9490216684E+00   -3.4469860739E+00    1.3431631512E+01
           ux     -6.0181502315E-01   -7.9863551005E-01    1.3926925804E-16
           uy     -3.9931775502E-01    3.0090751158E-01    8.6602540378E-01
           uz     -6.9163864007E-01    5.2118709843E-01   -5.0000000000E-01
O                  4.9490216684E+00   -3.4469860739E+00    1.3431631512E+01
H2                 4.8539306116E+00   -5.1662343368E+00    1.3985152421E+01
           ux     -9.1530385584E-01   -7.6675351121E-02   -3.9539820689E-01
           uy      3.9931775502E-01   -3.0090751158E-01   -8.6602540378E-01
           uz     -5.2575488601E-02   -9.5056591566E-01    3.0603963467E-01
H1                 6.5754585218E+00   -2.8816896382E+00    1.3985152421E+01
           ux     -1.7858685654E-01    9.0098112781E-01   -3.9539820689E-01
           uy     -3.9931775502E-01    3.0090751158E-01    8.6602540378E-01
           uz      8.9925083553E-01    3.1255027886E-01    3.0603963467E-01
CM                 5.0340875054E+00   -3.5110877799E+00    1.3493127380E+01
