    6
Pathway 1   1  Energy =       -7.3018264688  kJ/mol
F   -1.8741564   0.0519367   3.8882248
H   -2.3223303   0.0779684   4.6879349
C   -0.3606270  -0.0359755   1.1875206
O    0.2306828  -0.0703213   0.1324020
H   -0.0427041  -0.6986541   2.0086096
H   -1.2081028   0.6574619   1.3113529
    6
Pathway 1   2  Energy =       -7.3018649259  kJ/mol
F   -1.8737894   0.0523519   3.8884188
H   -2.3267127   0.0730050   4.6856061
C   -0.3586304  -0.0337276   1.1885556
O    0.2284551  -0.0728301   0.1312460
H   -0.0388160  -0.6942763   2.0106257
H   -1.2042147   0.6618398   1.3133689
    6
Pathway 1   3  Energy =       -7.3019803327  kJ/mol
F   -1.8734091   0.0527663   3.8885892
H   -2.3310512   0.0680388   4.6831986
C   -0.3566391  -0.0314790   1.1896006
O    0.2262033  -0.0753378   0.1301323
H   -0.0349248  -0.6898979   2.0126374
H   -1.2003235   0.6662181   1.3153806
    6
Pathway 1   4  Energy =       -7.3024417476  kJ/mol
F   -1.8726390   0.0535937   3.8889115
H   -2.3396197   0.0581072   4.6782038
C   -0.3526441  -0.0269830   1.1916678
O    0.2216586  -0.0803496   0.1279807
H   -0.0271059  -0.6811445   2.0165937
H   -1.1925046   0.6749716   1.3193369
    6
Pathway 1   5  Energy =       -7.3042847653  kJ/mol
F   -1.8710331   0.0552398   3.8894287
H   -2.3562786   0.0382636   4.6674533
C   -0.3446350  -0.0179950   1.1957623
O    0.2123781  -0.0903544   0.1240336
H   -0.0113548  -0.6636519   2.0242891
H   -1.1767535   0.6924641   1.3270323
    6
Pathway 1   6  Energy =       -7.3116151255  kJ/mol
F   -1.8675748   0.0584767   3.8899443
H   -2.3875481  -0.0011635   4.6430342
C   -0.3285499  -0.0000463   1.2037866
O    0.1930808  -0.1102589   0.1175745
H    0.0205738  -0.6287534   2.0387987
H   -1.1448249   0.7273627   1.3415419
    6
Pathway 1   7  Energy =       -7.3403037700  kJ/mol
F   -1.8598033   0.0645845   3.8888339
H   -2.4410408  -0.0775701   4.5838366
C   -0.2962481   0.0355912   1.2191095
O    0.1518349  -0.1493647   0.1104549
H    0.0858089  -0.5596474   2.0641709
H   -1.0795898   0.7964687   1.3669141
    6
Pathway 1   8  Energy =       -7.3968243162  kJ/mol
F   -1.8487544   0.0706115   3.8820889
H   -2.4861648  -0.1594339   4.5000377
C   -0.2589962   0.0769953   1.2373748
O    0.0986694  -0.1934716   0.1135310
H    0.1635477  -0.4799531   2.0892376
H   -1.0018510   0.8761630   1.3919809
    6
Pathway 1   9  Energy =       -7.4868067902  kJ/mol
F   -1.8348275   0.0757247   3.8687562
H   -2.5156656  -0.2376117   4.3972952
C   -0.2196115   0.1207521   1.2566508
O    0.0363962  -0.2385477   0.1299451
H    0.2484528  -0.3964188   2.1097952
H   -0.9169459   0.9596972   1.4125384
    6
Pathway 1  10  Energy =       -7.6204871959  kJ/mol
F   -1.8179927   0.0800363   3.8490041
H   -2.5286450  -0.3103258   4.2775650
C   -0.1801827   0.1643111   1.2754686
O   -0.0330667  -0.2824620   0.1606356
H    0.3366411  -0.3136910   2.1232966
H   -0.8287576   1.0424250   1.4260398
    6
Pathway 1  11  Energy =       -7.8093005581  kJ/mol
F   -1.7989016   0.0837819   3.8243804
H   -2.5251585  -0.3758005   4.1443939
C   -0.1430036   0.2048374   1.2921482
O   -0.1062155  -0.3230351   0.2039849
H    0.4232227  -0.2368500   2.1280340
H   -0.7421759   1.1192660   1.4307772
    6
Pathway 1  12  Energy =       -8.0669906915  kJ/mol
F   -1.7785666   0.0871190   3.7968826
H   -2.5059062  -0.4324943   4.0019501
C   -0.1091300   0.2407784   1.3054343
O   -0.1800254  -0.3591838   0.2570445
H    0.5053149  -0.1686287   2.1235104
H   -0.6600838   1.1874873   1.4262536
    6
Pathway 1  13  Energy =       -8.4138679970  kJ/mol
F   -1.7579224   0.0900740   3.7681250
H   -2.4718015  -0.4791805   3.8541460
C   -0.0784410   0.2718208   1.3145159
O   -0.2527589  -0.3907713   0.3171760
H    0.5823144  -0.1095419   2.1097329
H   -0.5830843   1.2465742   1.4124761
    6
Pathway 1  14  Energy =       -8.8819769497  kJ/mol
F   -1.7376676   0.0925873   3.7391593
H   -2.4238121  -0.5149259   3.7044138
C   -0.0502739   0.2982213   1.3187844
O   -0.3236550  -0.4180324   0.3826512
H    0.6548400  -0.0591128   2.0865942
H   -0.5105587   1.2970033   1.3893374
    6
Pathway 1  15  Energy =       -9.5197336245  kJ/mol
F   -1.7182595   0.0945571   3.7105516
H   -2.3629496  -0.5390674   3.5557344
C   -0.0238870   0.3203362   1.3176931
O   -0.3924823  -0.4411935   0.4526428
H    0.7238618  -0.0167243   2.0536735
H   -0.4415369   1.3393917   1.3564167
    6
Pathway 1  16  Energy =      -10.3936638362  kJ/mol
F   -1.6999501   0.0958637   3.6824904
H   -2.2902952  -0.5512027   3.4106972
C    0.0012986   0.3383919   1.3107148
O   -0.4592285  -0.4602925   0.5270567
H    0.7902127   0.0179685   2.0102494
H   -0.3751860   1.3740845   1.3129926
    6
Pathway 1  17  Energy =      -11.5791870693  kJ/mol
F   -1.6828540   0.0963810   3.6549219
H   -2.2070498  -0.5511890   3.2715871
C    0.0256097   0.3523812   1.2972894
O   -0.5238804  -0.4750986   0.6063192
H    0.8543596   0.0448519   1.9553202
H   -0.3110391   1.4009679   1.2580634
    6
Pathway 1  18  Energy =      -13.1152837653  kJ/mol
F   -1.6670897   0.0959780   3.6277898
H   -2.1146550  -0.5391472   3.1405783
C    0.0492158   0.3620204   1.2765816
O   -0.5862369  -0.4850720   0.6911448
H    0.9164580   0.0632732   1.8873567
H   -0.2489407   1.4193892   1.1900999
    6
Pathway 1  19  Energy =      -14.8481114079  kJ/mol
F   -1.6534053   0.0945308   3.6021028
H   -2.0153908  -0.5154502   3.0207566
C    0.0728068   0.3666561   1.2461675
O   -0.6453391  -0.4892950   0.7817150
H    0.9770774   0.0718756   1.8027683
H   -0.1883213   1.4279916   1.1055115
    6
Pathway 1  20  Energy =      -16.0794841633  kJ/mol
F   -1.6474054   0.0922769   3.5876909
H   -1.9165731  -0.4803631   2.9238341
C    0.1016203   0.3646266   1.1940613
O   -0.6950483  -0.4865477   0.8701426
H    1.0410517   0.0677072   1.6877340
H   -0.1243470   1.4238232   0.9904772
    6
Pathway 1  21  Energy =      -16.3898910376  kJ/mol
F   -1.6677105   0.0912596   3.6196503
H   -1.8605820  -0.4442265   2.9005335
C    0.1475019   0.3551528   1.0989486
O   -0.7076672  -0.4788819   0.9061433
H    1.1131286   0.0505586   1.5339114
H   -0.0522701   1.4066746   0.8366546
    6
Pathway 1  22  Energy =      -16.4902857957  kJ/mol
F   -1.6919632   0.0901514   3.6580311
H   -1.8399959  -0.4210704   2.9111628
C    0.1875245   0.3446526   1.0116326
O   -0.7034940  -0.4687299   0.9189130
H    1.1692038   0.0308108   1.4017789
H    0.0038051   1.3869268   0.7045221
    6
Pathway 1  23  Energy =      -16.6202968796  kJ/mol
F   -1.7259873   0.0876253   3.7099861
H   -1.8048340  -0.3828546   2.9267201
C    0.2391923   0.3220683   0.8813498
O   -0.6938404  -0.4454642   0.9480281
H    1.2396847  -0.0123043   1.2001210
H    0.0742860   1.3438118   0.5028643
    6
Pathway 1  24  Energy =      -16.8546286171  kJ/mol
F   -1.7563200   0.0837295   3.7531072
H   -1.7803334  -0.3517155   2.9463330
C    0.2785094   0.2934231   0.7599221
O   -0.6778811  -0.4129123   0.9846649
H    1.2894610  -0.0683522   1.0079152
H    0.1240623   1.2877638   0.3106584
    6
Pathway 1  25  Energy =      -17.2091538889  kJ/mol
F   -1.7853216   0.0797081   3.7937593
H   -1.7522691  -0.3167462   2.9674390
C    0.3067660   0.2576017   0.6430237
O   -0.6538592  -0.3734133   1.0213374
H    1.3196138  -0.1379006   0.8222509
H    0.1542151   1.2182154   0.1249941
    6
Pathway 1  26  Energy =      -17.6470713324  kJ/mol
F   -1.8133268   0.0757592   3.8328869
H   -1.7175606  -0.2748637   2.9908856
C    0.3240818   0.2150178   0.5312593
O   -0.6215701  -0.3280595   1.0555793
H    1.3302249  -0.2198612   0.6451079
H    0.1648262   1.1362548  -0.0521489
    6
Pathway 1  27  Energy =      -18.1066506836  kJ/mol
F   -1.8399653   0.0718772   3.8698604
H   -1.6752545  -0.2246684   3.0178013
C    0.3302080   0.1664907   0.4266381
O   -0.5815621  -0.2777899   1.0864805
H    1.3211794  -0.3126275   0.4798024
H    0.1557807   1.0434886  -0.2174544
    6
Pathway 1  28  Energy =      -18.5197183023  kJ/mol
F   -1.8639852   0.0678915   3.9022557
H   -1.6266262  -0.1672577   3.0481835
C    0.3243606   0.1132310   0.3328250
O   -0.5352966  -0.2233695   1.1149961
H    1.2919969  -0.4141042   0.3312131
H    0.1265982   0.9420118  -0.3660437
    6
Pathway 1  29  Energy =      -18.8343346645  kJ/mol
F   -1.8839018   0.0636047   3.9272067
H   -1.5742600  -0.1055411   3.0806931
C    0.3057838   0.0566557   0.2538392
O   -0.4845714  -0.1655342   1.1426993
H    1.2423882  -0.5219103   0.2044541
H    0.0769895   0.8342058  -0.4928027
    6
Pathway 1  30  Energy =      -19.0287472609  kJ/mol
F   -1.8983210   0.0588782   3.9421143
H   -1.5202742  -0.0426647   3.1127511
C    0.2739575  -0.0017949   0.1933516
O   -0.4312924  -0.1051314   1.1711277
H    1.1724535  -0.6335809   0.1041517
H    0.0070548   0.7225352  -0.5931050
    6
Pathway 1  31  Energy =      -19.1064856390  kJ/mol
F   -1.9053719   0.0538142   3.9440502
H   -1.4667375   0.0170884   3.1394853
C    0.2299381  -0.0586537   0.1563395
O   -0.3798294  -0.0453517   1.2013795
H    1.0856790  -0.7426681   0.0370202
H   -0.0797197   0.6134480  -0.6602366
    6
Pathway 1  32  Energy =      -19.1109933777  kJ/mol
F   -1.9040713   0.0528609   3.9400222
H   -1.4565088   0.0261395   3.1399926
C    0.2200330  -0.0675130   0.1556641
O   -0.3735191  -0.0357011   1.2096023
H    1.0685130  -0.7598158   0.0323603
H   -0.0968857   0.5963003  -0.6648965
    6
Pathway 1  33  Energy =      -19.1110095236  kJ/mol
F   -1.9041467   0.0527723   3.9399758
H   -1.4556025   0.0271586   3.1404599
C    0.2191774  -0.0684766   0.1552200
O   -0.3726218  -0.0346834   1.2100820
H    1.0668724  -0.7616666   0.0315027
H   -0.0985263   0.5944494  -0.6657541
    6
Pathway 1  34  Energy =      -19.1110095239  kJ/mol
F   -1.9041460   0.0527722   3.9399747
H   -1.4556016   0.0271588   3.1404588
C    0.2191765  -0.0684768   0.1552211
O   -0.3726223  -0.0346831   1.2100832
H    1.0668714  -0.7616670   0.0315036
H   -0.0985274   0.5944491  -0.6657531
    6
Pathway 1  35  Energy =      -19.1110095239  kJ/mol
F   -1.9041460   0.0527722   3.9399746
H   -1.4556016   0.0271588   3.1404588
C    0.2191765  -0.0684768   0.1552211
O   -0.3726223  -0.0346831   1.2100832
H    1.0668714  -0.7616670   0.0315036
H   -0.0985274   0.5944491  -0.6657531
    6
Pathway 1  36  Energy =      -19.1110095239  kJ/mol
F   -1.9041460   0.0527722   3.9399746
H   -1.4556016   0.0271588   3.1404588
C    0.2191765  -0.0684768   0.1552211
O   -0.3726222  -0.0346831   1.2100833
H    1.0668713  -0.7616670   0.0315036
H   -0.0985274   0.5944491  -0.6657531
    6
Pathway 1  37  Energy =      -19.2989883616  kJ/mol
F   -1.8977940   0.0453818   3.9437726
H   -1.4545783   0.0259465   3.1411172
C    0.2622065  -0.1218369   0.1880405
O   -0.4272528   0.0321380   1.1704048
H    1.0816568  -0.8582938   0.2112278
H    0.0602080   0.4767264  -0.7149123
    6
Pathway 1  38  Energy =      -19.8223064481  kJ/mol
F   -1.8850371   0.0378122   3.9357529
H   -1.4510839   0.0290109   3.1278662
C    0.2921059  -0.1736958   0.2426485
O   -0.4812460   0.0973854   1.1328978
H    1.0669478  -0.9387130   0.4122775
H    0.2098465   0.3485519  -0.7242516
    6
Pathway 1  39  Energy =      -20.5664794933  kJ/mol
F   -1.8680956   0.0304439   3.9193267
H   -1.4541259   0.0441510   3.1010878
C    0.3105943  -0.2236321   0.3148613
O   -0.5312069   0.1591423   1.0952180
H    1.0253547  -1.0019326   0.6275447
H    0.3497167   0.2118713  -0.6966778
    6
Pathway 1  40  Energy =      -21.4431817477  kJ/mol
F   -1.8457666   0.0234738   3.8917792
H   -1.4687594   0.0773724   3.0574925
C    0.3160967  -0.2710131   0.4063191
O   -0.5773437   0.2158106   1.0612001
H    0.9565025  -1.0470550   0.8558128
H    0.4758197   0.0690492  -0.6296593
    6
Pathway 1  41  Energy =      -22.3385215240  kJ/mol
F   -1.8187376   0.0170545   3.8540914
H   -1.4989453   0.1298998   3.0019925
C    0.3089469  -0.3150009   0.5145828
O   -0.6182912   0.2661507   1.0309105
H    0.8622096  -1.0732871   1.0919107
H    0.5860809  -0.0771705  -0.5251472
    6
Pathway 1  42  Energy =      -23.1304735377  kJ/mol
F   -1.7878901   0.0113337   3.8076252
H   -1.5477839   0.2005774   2.9429811
C    0.2897987  -0.3547301   0.6365448
O   -0.6527209   0.3091442   1.0040086
H    0.7448701  -1.0801182   1.3301782
H    0.6788096  -0.2238808  -0.3861742
    6
Pathway 1  43  Energy =      -23.7155063418  kJ/mol
F   -1.7547125   0.0065765   3.7546462
H   -1.6100500   0.2797770   2.8912182
C    0.2599360  -0.3877002   0.7643792
O   -0.6796147   0.3427836   0.9828740
H    0.6127845  -1.0681663   1.5561298
H    0.7485110  -0.3614257  -0.2230464
    6
Pathway 1  44  Energy =      -24.0473280891  kJ/mol
F   -1.7224480   0.0029852   3.7008985
H   -1.6708693   0.3509598   2.8539469
C    0.2241653  -0.4114144   0.8835560
O   -0.6990892   0.3658752   0.9702970
H    0.4836378  -1.0431662   1.7484079
H    0.7915219  -0.4757717  -0.0589777
    6
Pathway 1  45  Energy =      -24.1280030987  kJ/mol
F   -1.6960271   0.0008133   3.6552312
H   -1.7182281   0.4033383   2.8314871
C    0.1916525  -0.4256858   0.9762087
O   -0.7120979   0.3788364   0.9671962
H    0.3816008  -1.0169995   1.8865234
H    0.8110663  -0.5548695   0.0739652
    6
Pathway 1  46  Energy =      -24.1312957368  kJ/mol
F   -1.6994947   0.0012534   3.6608912
H   -1.7118234   0.3967179   2.8335282
C    0.1964540  -0.4237151   0.9628203
O   -0.7109377   0.3767206   0.9695381
H    0.3979185  -1.0219592   1.8661039
H    0.8076125  -0.5423086   0.0535206
    6
Pathway 1  47  Energy =      -24.1313059830  kJ/mol
F   -1.6997239   0.0012780   3.6612750
H   -1.7114335   0.3962972   2.8336903
C    0.1967569  -0.4235941   0.9619829
O   -0.7108434   0.3765967   0.9696249
H    0.3988969  -1.0222419   1.8648480
H    0.8074268  -0.5415647   0.0522739
    6
Pathway 1  48  Energy =      -24.1313059831  kJ/mol
F   -1.6997247   0.0012781   3.6612762
H   -1.7114322   0.3962958   2.8336908
C    0.1967579  -0.4235937   0.9619801
O   -0.7108431   0.3765963   0.9696252
H    0.3989002  -1.0222429   1.8648437
H    0.8074261  -0.5415621   0.0522697
    6
Pathway 1  Converged. Energy =      -24.1313059831  kJ/mol
F   -1.6997247   0.0012781   3.6612762
H   -1.7114322   0.3962958   2.8336908
C    0.1967579  -0.4235937   0.9619801
O   -0.7108431   0.3765963   0.9696252
H    0.3989002  -1.0222429   1.8648437
H    0.8074261  -0.5415621   0.0522697
