c.m. Water1       -3.0318770256E-01   -6.7341439042E-01   -3.7046650169E+00
           ux      2.3873498977E-01    8.1282425845E-01    5.3134012603E-01
           uy     -9.4292083218E-01    3.2485286432E-01   -7.3286566197E-02
           uz     -2.3217646069E-01   -4.8351560618E-01    8.4398267143E-01
Water1            -3.3195308284E-01   -7.3331930172E-01   -3.6001002284E+00
           ux      2.3873498977E-01    8.1282425845E-01    5.3134012603E-01
           uy     -9.4292083218E-01    3.2485286432E-01   -7.3286566197E-02
           uz     -2.3217646069E-01   -4.8351560618E-01    8.4398267143E-01
O                 -3.3195308284E-01   -7.3331930172E-01   -3.6001002284E+00
H2                 2.6653383540E-01    9.6451892608E-01   -3.7744592169E+00
           ux     -3.7479574372E-02    1.1515047085E-01    9.9264074597E-01
           uy      9.4292083218E-01   -3.2485286432E-01    7.3286566197E-02
           uz      3.3090117217E-01    9.3872838756E-01   -9.6402430711E-02
H1                -4.1638189823E-01   -1.3606135369E+00   -5.2943894640E+00
           ux     -3.2972905058E-01   -8.7987528559E-01    3.4219619374E-01
           uy     -9.4292083218E-01    3.2485286432E-01   -7.3286566197E-02
           uz     -4.6680375332E-02   -3.4682862966E-01   -9.3676616303E-01
CM                -3.0339729689E-01   -6.7385087793E-01   -3.7039031224E+00
c.m. Water2       -1.6111775171E+00   -4.1743251081E+00    3.3406190679E+00
           ux      7.0660289097E-01    7.0229326917E-01   -8.6582437892E-02
           uy     -4.2930737689E-01    3.2820805202E-01   -8.4141229533E-01
           uz     -5.6250113833E-01    6.3171483967E-01    5.3341243960E-01
Water2            -1.6808682993E+00   -4.0960591308E+00    3.4067059211E+00
           ux      7.0660289097E-01    7.0229326917E-01   -8.6582437892E-02
           uy     -4.2930737689E-01    3.2820805202E-01   -8.4141229533E-01
           uz     -5.6250113833E-01    6.3171483967E-01    5.3341243960E-01
O                 -1.6808682993E+00   -4.0960591308E+00    3.4067059211E+00
H2                -4.7516075386E-02   -3.7909179014E+00    2.6923589195E+00
           ux     -1.2326901713E-02    9.2941698080E-01    3.6882532897E-01
           uy      4.2930737689E-01   -3.2820805202E-01    8.4141229533E-01
           uz      9.0307431789E-01    1.6871144118E-01   -3.9495977767E-01
H1                -2.0687959562E+00   -5.7998698510E+00    2.9400331676E+00
           ux     -8.7732086416E-01    6.9698678678E-02    4.7481595962E-01
           uy     -4.2930737689E-01    3.2820805202E-01   -8.4141229533E-01
           uz     -2.1448374638E-01   -9.4203055618E-01   -2.5802161491E-01
CM                -1.6116853078E+00   -4.1737548356E+00    3.3411005992E+00
c.m. Water3        1.4728688496E+00    4.3214941742E+00   -3.0989673775E+00
           ux      4.8856810364E-01   -4.9391104173E-01    7.1927261241E-01
           uy     -7.5291858986E-01   -6.5523527146E-01    6.1484437713E-02
           uz      4.4092494277E-01   -5.7159305620E-01   -6.9200185907E-01
Water3             1.5274970131E+00    4.2506769536E+00   -3.1847025833E+00
           ux      4.8856810364E-01   -4.9391104173E-01    7.1927261241E-01
           uy     -7.5291858986E-01   -6.5523527146E-01    6.1484437713E-02
           uz      4.4092494277E-01   -5.7159305620E-01   -6.9200185907E-01
O                  1.5274970131E+00    4.2506769536E+00   -3.1847025833E+00
H2                 1.7381638202E+00    4.1770233154E+00   -1.3898663974E+00
           ux      6.4772427138E-01   -7.5432644852E-01   -1.0698073341E-01
           uy      7.5291858986E-01    6.5523527146E-01   -6.1484437713E-02
           uz      1.1647688744E-01   -4.0722820322E-02    9.9235819471E-01
H1                 3.4058550437E-01    5.5898854255E+00   -3.4473887751E+00
           ux      4.9639455581E-02   -1.4970102943E-01   -9.8748444354E-01
           uy     -7.5291858986E-01   -6.5523527146E-01    6.1484437713E-02
           uz     -6.5623892105E-01    7.4044334072E-01   -1.4523821014E-01
CM                 1.4732668889E+00    4.3209781759E+00   -3.0995920733E+00
c.m. Water4        1.1348131130E+00    2.7190796775E+00    1.9875216216E+00
           ux      5.7571436350E-01    5.5401681586E-01    6.0134710393E-01
           uy      2.9953543087E-01   -8.2723318345E-01    4.7535648292E-01
           uz      7.6080976421E-01   -9.3544791120E-02   -6.4219769132E-01
Water4             1.2290732380E+00    2.7074899949E+00    1.9079568769E+00
           ux      5.7571436350E-01    5.5401681586E-01    6.0134710393E-01
           uy      2.9953543087E-01   -8.2723318345E-01    4.7535648292E-01
           uz      7.6080976421E-01   -9.3544791120E-02   -6.4219769132E-01
O                  1.2290732380E+00    2.7074899949E+00    1.9079568769E+00
H2                 1.2102577177E+00    3.6034471287E+00    3.4789912771E+00
           ux      9.5402846006E-01    2.6512732251E-01   -1.3977553523E-01
           uy     -2.9953543087E-01    8.2723318345E-01   -4.7535648292E-01
           uz     -1.0403030579E-02    4.9537133855E-01    8.6861902690E-01
H1                -4.3660769272E-01    2.0186488526E+00    1.7588018778E+00
           ux      2.4926280614E-01   -4.1307709320E-01   -8.7591972723E-01
           uy      2.9953543087E-01   -8.2723318345E-01    4.7535648292E-01
           uz     -9.2094873860E-01   -3.8085768375E-01   -8.2467239543E-02
CM                 1.1354999243E+00    2.7189952312E+00    1.9869418858E+00
c.m. Water5        2.6317702647E+00   -2.4196097256E+00    6.2982306327E-01
           ux     -3.3504769412E-01   -4.9367159378E-01   -8.0251566973E-01
           uy      9.2058292641E-01    9.8862983351E-03   -3.9042199824E-01
           uz      2.0067415945E-01   -8.6959221397E-01    4.5115325903E-01
Water5             2.6566326840E+00   -2.5273473948E+00    6.8571845863E-01
           ux     -3.3504769412E-01   -4.9367159378E-01   -8.0251566973E-01
           uy      9.2058292641E-01    9.8862983351E-03   -3.9042199824E-01
           uz      2.0067415945E-01   -8.6959221397E-01    4.5115325903E-01
O                  2.6566326840E+00   -2.5273473948E+00    6.8571845863E-01
H2                 1.9552660016E+00   -2.2707610258E+00   -9.6154912985E-01
           ux     -4.6383342184E-02   -9.8983655267E-01   -1.3443282546E-01
           uy     -9.2058292641E-01   -9.8862983351E-03    3.9042199824E-01
           uz     -3.8778300785E-01    1.4186564101E-01   -9.1076807077E-01
H1                 2.9136899932E+00   -8.5858387081E-01    1.3340949978E+00
           ux      3.6376815344E-01   -3.8550425583E-01    8.4797358407E-01
           uy      9.2058292641E-01    9.8862983351E-03   -3.9042199824E-01
           uz      1.4212602206E-01    9.2265309290E-01    3.5848495647E-01
CM                 2.6319514207E+00   -2.4203947388E+00    6.3023033610E-01
c.m. Water6       -3.3248112899E+00    2.2677176057E-01    8.4599207646E-01
           ux      1.0670820353E-01    3.5936239984E-01   -9.2707714074E-01
           uy     -9.7956251676E-01   -1.2189244315E-01   -1.5999846267E-01
           uz     -1.7050112918E-01    9.2520316574E-01    3.3901101318E-01
Water6            -3.3459354375E+00    3.4139931938E-01    8.8799366734E-01
           ux      1.0670820353E-01    3.5936239984E-01   -9.2707714074E-01
           uy     -9.7956251676E-01   -1.2189244315E-01   -1.5999846267E-01
           uz     -1.7050112918E-01    9.2520316574E-01    3.3901101318E-01
O                 -3.3459354375E+00    3.4139931938E-01    8.8799366734E-01
H2                -3.0045609543E+00   -1.6885044475E-01   -8.1328553855E-01
           ux     -6.9517802257E-02    9.5160562060E-01   -2.9935600548E-01
           uy      9.7956251676E-01    1.2189244315E-01    1.5999846267E-01
           uz      1.8874467124E-01   -2.8211518064E-01   -9.4063089144E-01
H1                -3.3098061601E+00   -1.1968281080E+00    1.8386741357E+00
           ux     -2.0014556075E-01    5.1168907035E-01    8.3553339239E-01
           uy     -9.7956251676E-01   -1.2189244315E-01   -1.5999846267E-01
           uz      1.9975741906E-02   -8.5048017472E-01    5.2562766494E-01
CM                -3.3249652076E+00    2.2760697587E-01    8.4629811431E-01
