<?xml version="1.0" encoding="UTF-8"?>

<OTA_ReadRQ xmlns:xsi="http://www.w3.org/2001/XMLSchema-instance"
            xmlns="http://www.opentravel.org/OTA/2003/05"
            xsi:schemaLocation="http://www.opentravel.org/OTA/2003/05 OTA_ReadRQ.xsd"
            Version="1.001">

    <ReadRequests>
        <HotelReadRequest HotelCode="123" HotelName="Frangart Inn">
           <SelectionCriteria Start="2012-03-21T15:00:00+01:00"></SelectionCriteria>
       </HotelReadRequest>
    </ReadRequests>

</OTA_ReadRQ>
