{
  "contactPoint": {
    "email": "info@noi.bz.it",
    "telephone": "+390471066600",
    "address": {
      "street": {
        "ita": "Piazza Università 1"
      },
      "city": {
        "ita": "Bolzano"
      },
      "region": {
        "ita": "Trentino-Alto Adige"
      },
      "country": "IT",
      "zipcode": "39100",
      "complement": {
        "ita": "Ufficio 3.07"
      },
      "type": "example/main"
    },
    "availableHours": {
      "dailySchedules": {
        "2020-12-23": [
          {
            "opens": "08:00:00",
            "closes": "12:00:00"
          }
        ],
        "2020-12-25": null
      },
      "weeklySchedules": [
        {
          "validFrom": "2020-01-01",
          "validTo": "2020-12-31",
          "monday": [
            {
              "opens": "08:00:00+01:00",
              "closes": "12:00:00+01:00"
            },
            {
              "opens": "14:00:00+01:00",
              "closes": "18:00:00+01:00"
            }
          ],
          "tuesday": [
            {
              "opens": "08:00:00+01:00",
              "closes": "12:00:00+01:00"
            },
            {
              "opens": "14:00:00+01:00",
              "closes": "18:00:00+01:00"
            }
          ],
          "wednesday": [
            {
              "opens": "08:00:00+01:00",
              "closes": "12:00:00+01:00"
            },
            {
              "opens": "14:00:00+01:00",
              "closes": "18:00:00+01:00"
            }
          ],
          "thursday": [
            {
              "opens": "08:00:00+01:00",
              "closes": "12:00:00+01:00"
            },
            {
              "opens": "14:00:00+01:00",
              "closes": "18:00:00+01:00"
            }
          ],
          "friday": [
            {
              "opens": "08:00:00+01:00",
              "closes": "12:00:00+01:00"
            },
            {
              "opens": "14:00:00+01:00",
              "closes": "18:00:00+01:00"
            }
          ],
          "saturday": null,
          "sunday": null
        }
      ]
    }
  }
}
