{
  "links": {
    "self": "http://example.com/2022-04/lifts/1"
  },
  "data": {
    "type": "lifts",
    "id": "1",
    "meta": {
      "dataProvider": "http://example.com",
      "lastUpdate": "2020-04-01T08:00:00+02:00"
    },
    "attributes": {
      "name": {
        "deu": "Bergbahn Meran 2000",
        "eng": "Ropeway Merano 2000",
        "ita": "Funivia Merano 2000"
      },
      "shortName": {
        "deu": "Meran 2000",
        "eng": "Merano 2000",
        "ita": "Merano 2000"
      },
      "description": {
        "ita": "Situata a pochi minuti dalla città di Merano, la Funivia conduce all’area sciistica ed escursionistica Merano 2000, un luogo ideale in cui passare una vacanza all’insegna del movimento e della buona cucina con tutta la famiglia. Grazie al suo clima mite, l’area offre infinite possibilità per il tempo libero in ogni stagione: impianti di risalita, sentieri escursionistici facili e numerosi rifugi in cui sostare per assaporare l’ottima cucina locale in un paesaggio ricco e dominato dalla tranquillità."
      },
      "abstract": {
        "ita": "Situata a pochi minuti dalla città di Merano, la Funivia conduce all’area sciistica ed escursionistica Merano 2000, un luogo ideale in cui passare una vacanza all’insegna del movimento e della buona cucina con tutta la famiglia..."
      },
      "url": "http://example.com",
      "length": 3650,
      "minAltitude": 1000,
      "maxAltitude": 2350,
      "capacity": 200,
      "personsPerChair": 10,
      "openingHours": {
        "dailySchedules": {
          "2020-12-25": null
        },
        "weeklySchedules": [
          {
            "validFrom": "2020-01-01",
            "validTo": "2020-12-31",
            "monday": [
              {
                "opens": "08:00:00+01:00",
                "closes": "18:00:00+01:00"
              }
            ],
            "tuesday": [
              {
                "opens": "08:00:00+01:00",
                "closes": "18:00:00+01:00"
              }
            ],
            "wednesday": [
              {
                "opens": "08:00:00+01:00",
                "closes": "18:00:00+01:00"
              }
            ],
            "thursday": [
              {
                "opens": "08:00:00+01:00",
                "closes": "18:00:00+01:00"
              }
            ],
            "friday": [
              {
                "opens": "08:00:00+01:00",
                "closes": "18:00:00+01:00"
              }
            ],
            "saturday": [
              {
                "opens": "08:00:00+01:00",
                "closes": "18:00:00+01:00"
              }
            ],
            "sunday": [
              {
                "opens": "08:00:00+01:00",
                "closes": "18:00:00+01:00"
              }
            ]
          }
        ]
      },
      "address": {
        "street": {
          "deu": "Naifweg 37",
          "eng": "37 Val di Nova Street",
          "ita": "Via Val di Nova, 37"
        },
        "city": {
          "deu": "Meran",
          "eng": "Merano",
          "ita": "Merano"
        },
        "region": {
          "deu": "Trentino-Südtirol",
          "eng": "Trentino-Alto Adige",
          "ita": "Trentino-Alto Adige"
        },
        "country": "IT",
        "zipcode": "39012",
        "type": null,
        "complement": null
      },
      "geometries": [
        {
          "type": "LineString",
          "coordinates": [
            [11.305682659149168, 46.66705018437341],
            [11.30692720413208, 46.667182709603225],
            [11.308064460754393, 46.667491933875965]
          ]
        }
      ],
      "howToArrive": {
        "ita": "Fino alla stazione a valle della Funivia Merano 2000: dalla stazione ferroviaria di Merano si raggiunge in pochi minuti la stazione a valle Val di Nova con la linea urbana 1A. Da Scena c'è il bus vacanze che porta fino alla Val di Nova.",
        "deu": "Zur Talstation der Bergbahn Meran 2000: vom Zugbahnhof Meran erreicht man in wenigen Minuten die Talstation Naif mit der Buslinie 1A. Von Schenna aus fährt der Gästebus bis zur Talstation Naif."
      }
    },
    "relationships": {
      "categories": {
        "data": [
          {
            "type": "categories",
            "id": "alpinebits:gondola"
          }
        ],
        "links": {
          "related": "http://example.com/2022-04/lifts/1/categories/"
        }
      },
      "connections": {
        "data": [
          {
            "type": "skiSlopes",
            "id": "1"
          },
          {
            "type": "skiSlopes",
            "id": "2"
          }
        ],
        "links": {
          "related": "http://example.com/2022-04/lifts/1/connections/"
        }
      },
      "multimediaDescriptions": {
        "data": [
          {
            "type": "mediaObjects",
            "id": "1"
          }
        ],
        "links": {
          "related": "http://example.com/2022-04/mountainAreas/1/multimediaDescriptions/"
        }
      }
    },
    "links": {
      "self": "http://example.com/2022-04/lifts/1"
    }
  }
}
