{
  "address": {
    "street": {
      "ita": "Piazza Università 1"
    },
    "city": {
      "ita": "Bolzano"
    },
    "region": {
      "ita": "Trentino-Alto Adige"
    },
    "country": "IT",
    "zipcode": "39100",
    "complement": {
      "ita": "Ufficio 3.07"
    },
    "type": "example/main"
  }
}
