{
    "jsonapi": {
        "version": "1.0"
    },
    "errors": [
        {
            "status": 404,
            "title": "Resource not found."
        },
        {
            "status": 405,
            "title": "Method not supported."
        }
    ]
}