%YAML 1.1
%TAG !u! tag:unity3d.com,2011:
--- !u!1045 &1
EditorBuildSettings:
  m_ObjectHideFlags: 0
  serializedVersion: 2
  m_Scenes:
  - enabled: 1
    path: Assets/Scenes/GameLauncherScene.unity
    guid: 00f395ea81bd61346bf8de8a72895a6c
  - enabled: 1
    path: Assets/Scenes/GameScene.unity
    guid: 44557d6706d29b64587b6fb18b64a0e1
  m_configObjects: {}
