timestamp,PackageEnergy
0.0,0.0238333333333
0.005,0.0351233562965
0.01,0.0465181304907
0.015,0.0432857316908
0.02,0.038973603559
0.025,0.0450342230614
0.03,0.0537780529206
0.035,0.0506616380529
0.04,0.0446605333244
0.045,0.0434174011697
0.05,0.0439762816318
0.055,0.0447376261111
0.06,0.0459391462968
0.065,0.0502515113804
0.07,0.0551748500189
0.075,0.0588852075579
0.08,0.0581454244302
0.085,0.0578543004638
0.09,0.0574012551797
0.095,0.0582166731696
0.1,0.0593664589019
0.105,0.0577880169955
0.11,0.0523955007406
0.115,0.0480395250379
0.12,0.044278663067
0.125,0.0446096266972
0.13,0.0528839659268
0.135,0.0621926391636
0.14,0.0594058761198
0.145,0.0603945109143
0.15,0.0660259781535
0.155,0.0669170596425
0.16,0.0625988154904
0.165,0.05887624666
0.17,0.0551880046493
0.175,0.0528883830458
0.18,0.053624839004
0.185,0.0530639159747
0.19,0.0496741600732
0.195,0.0462293388401
0.2,0.0442570410141
0.205,0.0358813185697
0.21,0.0402625462373
0.215,0.0514706553185
0.22,0.0555519433851
0.225,0.0553421037908
0.23,0.059814205106
0.235,0.0614248412913
0.24,0.0578062964752
0.245,0.0526728112988
0.25,0.0510682884167
0.255,0.0662789736008
0.26,0.0849041844719
0.265,0.083158327769
0.27,0.0702803469809
0.275,0.0606160621978
0.28,0.0692088366196
0.285,0.0691369678598
0.29,0.0667744755059
0.295,0.0715895890987
0.3,0.0703538683175
0.305,0.064274108931
0.31,0.0560875872009
0.315,0.0531211263152
0.32,0.0559994753306
0.325,0.0610535225085
0.33,0.0657240713827
0.335,0.0668021898017
0.34,0.062328897522
0.345,0.0588436576272
0.35,0.0530666487967
0.355,0.046261343807
0.36,0.0434433591463
0.365,0.0413362706431
0.37,0.0410842349297
0.375,0.0423081634257
0.38,0.0447621459918
0.385,0.0473650638206
0.39,0.0506352324833
0.395,0.0539419978959
0.4,0.0545370056909
0.405,0.0554391263554
