timestamp,PackageEnergy
0.0,0.103166666667
0.005,0.117572910764
0.01,0.132209788327
0.015,0.135833684287
0.02,0.136707287025
0.025,0.1367613585
0.03,0.134813872233
0.035,0.128208314717
0.04,0.12026781513
0.045,0.126180719825
0.05,0.129624531638
0.055,0.130641932061
0.06,0.13562535662
0.065,0.144307069273
0.07,0.139073799804
0.075,0.132583905187
0.08,0.120073430144
0.085,0.0914253233159
0.09,0.0744360517488
0.095,0.089907372884
0.1,0.10279687564
0.105,0.112984579842
0.11,0.12872799916
0.115,0.125280612133
0.12,0.110009280075
0.125,0.111258828069
0.13,0.112065738813
0.135,0.109202414337
0.14,0.104963350712
0.145,0.11022006028
0.15,0.115619408829
0.155,0.106560427157
0.16,0.0908661599065
0.165,0.0907432143313
0.17,0.100366847886
0.175,0.105805747418
0.18,0.108667666836
0.185,0.107544774293
0.19,0.102970909953
0.195,0.0947738230682
0.2,0.0895559350291
0.205,0.0971630444166
0.21,0.10771452964
0.215,0.113621225688
0.22,0.115526895331
0.225,0.110908353331
0.23,0.10536238377
0.235,0.110293236137
0.24,0.118137185119
0.245,0.119941253692
0.25,0.120522260738
