timestamp,PackageEnergy
0.0,0.0626666666667
0.005,0.0941108894397
0.01,0.126282783641
0.015,0.134975644342
0.02,0.135964555585
0.025,0.137637281713
0.03,0.136813043856
0.035,0.131014016788
0.04,0.125741334279
0.045,0.12213209966
0.05,0.11653158522
0.055,0.101834452513
0.06,0.086995471178
0.065,0.0900904293101
0.07,0.107484965603
0.075,0.120712892
0.08,0.122993978995
0.085,0.121628874354
0.09,0.120463799879
0.095,0.122762787007
0.1,0.129673516764
0.105,0.137134889713
0.11,0.143352761013
0.115,0.142240053705
0.12,0.139459562955
0.125,0.126066027751
0.13,0.0952295857562
0.135,0.063745765264
0.14,0.0681857112822
0.145,0.106103083029
0.15,0.127474517348
0.155,0.101333317591
0.16,0.0713986942727
0.165,0.0775709425615
0.17,0.101915394223
0.175,0.123157219994
0.18,0.138909261915
0.185,0.144294969864
0.19,0.126198002119
0.195,0.105449958587
0.2,0.105602991595
0.205,0.109204187957
0.21,0.107793504968
0.215,0.100913846692
0.22,0.0904922515201
0.225,0.0887421207628
0.23,0.105079869678
0.235,0.116785015152
0.24,0.104188522719
0.245,0.0937743359796
0.25,0.0980045163749
0.255,0.103082188003
0.26,0.105322163056
0.265,0.102336383329
0.27,0.093106278227
0.275,0.0892227953704
0.28,0.0929811352032
