timestamp,PackageEnergy
0.0,0.114166666667
0.005,0.131338455414
0.01,0.14906588904
0.015,0.149700635405
0.02,0.149482869444
0.025,0.15188416555
0.03,0.147016794298
0.035,0.12951952585
0.04,0.112188814555
0.045,0.124215321644
0.05,0.149069721855
0.055,0.149575969411
0.06,0.141541000418
0.065,0.129276255885
0.07,0.114669138475
0.075,0.102323248131
0.08,0.0927878549743
0.085,0.0796561344175
0.09,0.0731195425502
0.095,0.0894128893872
0.1,0.104022375335
0.105,0.103463649885
0.11,0.102208379972
0.115,0.103062560623
0.12,0.113087928873
0.125,0.119816237359
0.13,0.117044682026
0.135,0.119493686614
0.14,0.123959204741
0.145,0.116964966879
0.15,0.103569556483
0.155,0.0946944595462
0.16,0.0889730611689
0.165,0.089543365565
0.17,0.0862016322339
0.175,0.0752516735344
0.18,0.0658742421828
0.185,0.0741743228317
0.19,0.0889742867022
0.195,0.0891296384856
0.2,0.0789605629095
0.205,0.0894171073185
0.21,0.10849301304
0.215,0.109240742651
0.22,0.108371758892
0.225,0.108815656762
0.23,0.107045914228
0.235,0.103767818611
0.24,0.103304874028
0.245,0.10345586337
0.25,0.102462913315
0.255,0.102884272604
0.26,0.104540834244
