timestamp,PackageEnergy
0.0,0.0735
0.005,0.0987117892383
0.01,0.12638993616
0.015,0.124281305976
0.02,0.120527315536
0.025,0.114249742698
0.03,0.117100598112
0.035,0.117829165585
0.04,0.118884666946
0.045,0.122535770672
0.05,0.121932324926
0.055,0.116681510699
0.06,0.111728556197
0.065,0.109042955454
0.07,0.110804008386
0.075,0.11421447449
0.08,0.118812503481
0.085,0.123710521195
0.09,0.13283107456
0.095,0.144588856397
0.1,0.143233708497
0.105,0.125556152259
0.11,0.103372176953
0.115,0.0896662180845
0.12,0.102024202896
0.125,0.118023205517
0.13,0.113577637669
0.135,0.10881190509
0.14,0.127542504963
0.145,0.134292997788
0.15,0.136987561395
0.155,0.14766106745
0.16,0.154933658939
0.165,0.154219186457
0.17,0.162019824669
0.175,0.165583293401
0.18,0.151744758398
0.185,0.13824452205
0.19,0.127337652642
0.195,0.115384610876
0.2,0.116376864117
0.205,0.121942973644
0.21,0.128853233086
0.215,0.136490058322
0.22,0.141631038413
0.225,0.144160758679
0.23,0.141230792855
0.235,0.139361119893
0.24,0.1406454003
0.245,0.141929680708
