timestamp,PackageEnergy
0.0,0.00133333333333
0.005,0.0191472220428
0.01,0.0376590523559
0.015,0.0407379037477
0.02,0.0427999978043
0.025,0.0429997208622
0.03,0.0429373452324
0.035,0.0451963975525
0.04,0.0452465198255
0.045,0.0433535370582
0.05,0.0414713061738
0.055,0.04293367817
0.06,0.0473630769256
0.065,0.0493153165283
0.07,0.0505748604213
0.075,0.0509754925704
0.08,0.0502810428678
0.085,0.0485481444916
0.09,0.0466016623832
0.095,0.0486989819343
0.1,0.0556204126285
0.105,0.0596196052216
0.11,0.0603205267866
0.115,0.0620778422542
0.12,0.0628333748802
0.125,0.0634578095572
0.13,0.0691825817386
0.135,0.0723905879621
0.14,0.0745920776271
0.145,0.0751753984915
0.15,0.0729841575711
0.155,0.0701536568939
0.16,0.0668047561461
0.165,0.0630771178011
0.17,0.062144817282
0.175,0.0614989170505
0.18,0.0638389119094
0.185,0.071779516877
0.19,0.0766178785294
0.195,0.0814459880032
0.2,0.0850781809304
0.205,0.085412137872
0.21,0.0871049764711
0.215,0.0891389479327
0.22,0.0933408044711
0.225,0.0936692415295
0.23,0.0910857079059
0.235,0.085268354035
0.24,0.0790923557485
0.245,0.0760288304206
0.25,0.0775797013222
0.255,0.083636090719
0.26,0.0899055937072
0.265,0.0960863564388
0.27,0.0928822073465
0.275,0.0922209402494
0.28,0.0917394606297
0.285,0.0944224436676
0.29,0.0955988709187
0.295,0.0978287393184
0.3,0.101468897885
0.305,0.103249835128
0.31,0.09562751754
0.315,0.0895317738216
0.32,0.0859471120193
0.325,0.0812129780658
0.33,0.0783502264782
0.335,0.0769262741522
0.34,0.0679623731144
0.345,0.0548310662434
0.35,0.0427665847681
0.355,0.0512201788223
0.36,0.0686578761426
0.365,0.0806270130034
0.37,0.0894994384071
0.375,0.088154791204
0.38,0.0777553699994
0.385,0.0667732051815
0.39,0.0644734254959
0.395,0.0735300627174
0.4,0.07841612166
0.405,0.0757995666199
0.41,0.0731368178378
0.415,0.072089638032
0.42,0.0638362700003
0.425,0.065922735082
0.43,0.0786094286659
0.435,0.0897752008786
0.44,0.0906198141479
0.445,0.10273154269
0.45,0.110045105039
0.455,0.109955590626
0.46,0.10738604173
0.465,0.109813095097
0.47,0.111965586892
0.475,0.114346118147
0.48,0.116472464509
0.485,0.115615047854
0.49,0.112594418932
0.495,0.107972432316
0.5,0.100398836891
0.505,0.0905826657886
0.51,0.0807239767532
0.515,0.0761681953371
0.52,0.0762386130913
0.525,0.0798060852956
0.53,0.0830539299557
0.535,0.0842842518176
0.54,0.0835032673267
0.545,0.0850709240924
