timestamp,PackageEnergy
0.0,0.057
0.005,0.0805373686411
0.01,0.103625180921
0.015,0.102473838346
0.02,0.100324903377
0.025,0.115731271905
0.03,0.132000831115
0.035,0.124641678696
0.04,0.115826866702
0.045,0.119324410478
0.05,0.123170849451
0.055,0.122804374053
0.06,0.12444343902
0.065,0.121383409976
0.07,0.11762306169
0.075,0.112439946311
0.08,0.107642347308
0.085,0.10633132653
0.09,0.111440362371
0.095,0.116355260327
0.1,0.112696425649
0.105,0.102247879497
0.11,0.0942592232724
0.115,0.0853678110118
0.12,0.101460278813
0.125,0.131379267597
0.13,0.128653501152
0.135,0.116345614351
0.14,0.125485162805
0.145,0.13225855028
0.15,0.122162106555
0.155,0.118609255489
0.16,0.119577081188
0.165,0.120156798503
0.17,0.117692553511
0.175,0.106954798015
0.18,0.100676843145
0.185,0.105139928823
0.19,0.110812977042
0.195,0.115017848962
0.2,0.119382217245
0.205,0.12280770884
0.21,0.124396564616
0.215,0.12347262662
0.22,0.120703263767
0.225,0.117667328957
0.23,0.118741294408
0.235,0.11976768329
0.24,0.119850488977
0.245,0.119933366484
