timestamp,PackageEnergy
0.0,0.0183333333333
0.005,0.0324818153848
0.01,0.0472511239181
0.015,0.0458991377667
0.02,0.0435279119302
0.025,0.0458907851003
0.03,0.0486321987655
0.035,0.0530892726917
0.04,0.0577826269511
0.045,0.0559601261072
0.05,0.0529200244865
0.055,0.0506745220715
0.06,0.0485027426713
0.065,0.0465433496024
0.07,0.0460510997459
0.075,0.0467656232585
0.08,0.0488066922873
0.085,0.0518642852738
0.09,0.0548216555753
0.095,0.0582994609881
0.1,0.0619172752216
0.105,0.0620516594734
0.11,0.0616870088274
0.115,0.0599960145868
0.12,0.0581763016785
0.125,0.0605749294863
0.13,0.0679949669543
0.135,0.0704928350696
0.14,0.0692276588064
0.145,0.0675126057621
0.15,0.065564493463
0.155,0.0648206670351
0.16,0.0635716211085
0.165,0.058971278304
0.17,0.0544480575365
0.175,0.0525304697751
0.18,0.0557419738838
0.185,0.0607170821086
0.19,0.0635644775588
0.195,0.0646628500104
0.2,0.0627713799283
0.205,0.0516526790394
0.21,0.0397792402455
0.215,0.0421081589406
0.22,0.05738305767
0.225,0.067391744904
0.23,0.0633314312286
0.235,0.0578055234499
0.24,0.0533827703096
0.245,0.0456063821459
0.25,0.0480577548988
0.255,0.05731945887
0.26,0.0670546548772
0.265,0.0758824995795
0.27,0.0809011370605
0.275,0.0784482090391
0.28,0.0633198146451
0.285,0.0616318574072
0.29,0.0765314929242
0.295,0.0841193373901
0.3,0.0803124523305
0.305,0.073694371694
0.31,0.0708042196244
0.315,0.0662905057105
0.32,0.0542425639977
0.325,0.0432364643552
0.33,0.0426197521358
0.335,0.0497836315753
0.34,0.0569677574976
0.345,0.0631539771385
0.35,0.0602639888466
0.355,0.0554382090177
0.36,0.0558320831938
0.365,0.0597432991716
0.37,0.0609519461081
0.375,0.0553483217678
0.38,0.0530882875222
0.385,0.0532108937588
0.39,0.0555221013109
0.395,0.0572117673724
0.4,0.0552600578486
0.405,0.0531585178191
0.41,0.0530482387697
0.415,0.0527763304683
